Test results [failed]

From: Date: Fri, 27 Dec 2002 07:06:31 +0000
Subject: Test results [failed]
Groups: php.qa 
Request: Send a blank email to php-qa+get-7513@lists.php.net to get a copy of this message
===================================================================== FAILED TEST SUMMARY --------------------------------------------------------------------- Locale settings affecting float parsing [tests/lang/034.phpt] Bug #20993 (referenced array key, makes array global) [tests/lang/bug20993.phpt] OpenSSL private key functions [ext/openssl/tests/001.phpt] File type functions [ext/standard/tests/file/001.phpt] ===================================================================== ===================================================================== TEST RESULT SUMMARY --------------------------------------------------------------------- Exts skipped : 64 Exts tested : 24 --------------------------------------------------------------------- Number of tests : 442 Tests skipped : 171 (38.7%) Tests failed : 4 ( 0.9%) Tests passed : 267 (60.4%) --------------------------------------------------------------------- Time taken : 447 seconds ===================================================================== ================================================================================ /usr/local/src/build-php-4.3.0RC3/php-4.3.0RC4/tests/lang/034.phpt ================================================================================ ---- EXPECTED OUTPUT 3,14 ---- ACTUAL OUTPUT 3.14 ---- FAILED ================================================================================ 001- 3,14 001+ 3.14 ================================================================================ ================================================================================ /usr/local/src/build-php-4.3.0RC3/php-4.3.0RC4/tests/lang/bug20993.phpt ================================================================================ ---- EXPECTED OUTPUT 1 -b 1 -r 1 1 -b 1 -r 1 1 -b 1 -r 1 ---- ACTUAL OUTPUT 1 -b 1 -r 1 2 -b 1 -r 2 2 -b 1 -r 2 ---- FAILED ================================================================================ 002- 1 -b 1 -r 1 002+ 2 -b 1 -r 2 003- 1 -b 1 -r 1 003+ 2 -b 1 -r 2 ================================================================================ ================================================================================ /usr/local/src/build-php-4.3.0RC3/php-4.3.0RC4/ext/openssl/tests/001.phpt ================================================================================ ---- EXPECTED OUTPUT Creating private key Export key to file Load key from file - array syntax Load key using direct syntax Load key manually and use string syntax OK! ---- ACTUAL OUTPUT Creating private key Export key to file Load key from file - array syntax Load key using direct syntax Load key manually and use string syntax failed to load key using string syntax ---- FAILED ================================================================================ 006- OK! 006+ failed to load key using string syntax ================================================================================ ================================================================================ /usr/local/src/build-php-4.3.0RC3/php-4.3.0RC4/ext/standard/tests/file/001.phpt ================================================================================ ---- EXPECTED OUTPUT test.file does not exist test.file exists test.link exists test.file is not a symlink test.link is a symlink test.file exists test.link lstat and stat differ at element 1 test.link lstat and stat differ at element 2 test.link lstat and stat differ at element 7 test.link lstat and stat differ at element 8 test.link lstat and stat differ at element 9 test.link lstat and stat differ at element 10 test.file is file test.link is link test.file permissions are 0744 test.file size is 0 test.file is writeable test.file is readable test.file is executable test.file is a regular file test.link is a regular file test.link is not a directory ../file is a directory test.file is not a directory test.file does not exist test.file does not exist ---- ACTUAL OUTPUT test.file does not exist test.file exists test.link exists test.file is not a symlink test.link is a symlink test.file exists test.link lstat and stat differ at element 1 test.link lstat and stat differ at element 2 test.link lstat and stat differ at element 4 test.link lstat and stat differ at element 7 test.link lstat and stat differ at element 8 test.link lstat and stat differ at element 9 test.file is file test.link is link test.file permissions are 0744 test.file size is 0 test.file is writeable test.file is readable test.file is executable test.file is a regular file test.link is a regular file test.link is not a directory ../file is a directory test.file is not a directory test.file does not exist test.file does not exist ---- FAILED ================================================================================ 009- test.link lstat and stat differ at element 7 009+ test.link lstat and stat differ at element 4 010- test.link lstat and stat differ at element 8 010+ test.link lstat and stat differ at element 7 011- test.link lstat and stat differ at element 9 011+ test.link lstat and stat differ at element 8 012- test.link lstat and stat differ at element 10 012+ test.link lstat and stat differ at element 9 ================================================================================ ================================================================================ BUILD ENVIRONMENT ================================================================================ OS: Darwin Automake: automake (GNU automake) 1.6.1 Written by Tom Tromey <tromey@redhat.com>. Copyright 2002 Free Software Foundation, Inc. This is free software; see the source for copying conditions. There is NO warranty; not even for MERCHANTABILITY or FITNESS FOR A PARTICULAR PURPOSE. Autoconf: autoconf (GNU Autoconf) 2.57 Written by David J. MacKenzie and Akim Demaille. Copyright 2002 Free Software Foundation, Inc. This is free software; see the source for copying conditions. There is NO warranty; not even for MERCHANTABILITY or FITNESS FOR A PARTICULAR PURPOSE. Libtool: ltmain.sh (GNU libtool) 1.4.2 (1.922.2.53 2001/09/11 03:18:52) Compiler: Reading specs from /usr/libexec/gcc/darwin/ppc/2.95.2/specs Apple Computer, Inc. version gcc-937.2, based on gcc version 2.95.2 19991024 (release) Bison: GNU Bison version 1.28 User's E-mail: monan at acm dot org ================================================================================ PHPINFO ================================================================================ phpinfo() PHP Version => 4.3.0RC4 System => Darwin Athanor.local. 6.3 Darwin Kernel Version 6.3: Sat Dec 14 03:11:25 PST 2002; root:xnu/xnu-344.23.obj~4/RELEASE_PPC Power Macintosh Build Date => Dec 27 2002 01:53:23 Configure Command => './configure' '--with-openssl=/usr/local' '--with-gd=/usr/local' '--with-gdbm' '--with-expat-dir=/usr/local' '--with-mysql=/usr/local/mysql' '--enable-md5' '--enable-track-vars' '--enable-discard-path' '--with-jpeg-dir=/usr/local' '--with-png-dir=/usr/local' '--with-tiff-dir=/usr/local' '--with-xml' '--with-zlib=/usr/local' '--enable-ftp' '--with-freetype-dir=/usr/local' '--with-apxs=/usr/local/apache/sbin/apxs' '--enable-trans-sid' '--with-pdflib=/usr/local' '--with-curl=/usr/local' '--enable-bcmath' '--with-ldap=/usr/local' '--enable-exif' '--with-imap=/usr/local' '--with-imap-ssl=/usr/local' '--enable-sockets' '--with-mcrypt=/usr/local' '--enable-shared' '--enable-static' '--with-iconv-dir=/usr/local' '--with-iconv=/usr/local' '--with-xslt-sablot=/usr/local' '--enable-xslt' Server API => Command Line Interface Virtual Directory Support => disabled Configuration File (php.ini) Path => /usr/local/lib/php.ini PHP API => 20020918 PHP Extension => 20020429 Zend Extension => 20021010 Debug Build => no Thread Safety => disabled Registered PHP Streams => php, http, ftp, https, ftps, compress.zlib This program makes use of the Zend Scripting Language Engine: Zend Engine v1.3.0, Copyright (c) 1998-2002 Zend Technologies _______________________________________________________________________ Configuration PHP Core Directive => Local Value => Master Value allow_call_time_pass_reference => On => On allow_url_fopen => On => On always_populate_raw_post_data => Off => Off arg_separator.input => &amp; => &amp; arg_separator.output => &amp; => &amp; asp_tags => Off => Off auto_append_file => no value => no value auto_prepend_file => no value => no value browscap => no value => no value default_charset => no value => no value default_mimetype => text/html => text/html define_syslog_variables => Off => Off disable_functions => no value => no value display_errors => On => On display_startup_errors => Off => Off doc_root => no value => no value docref_ext => no value => no value docref_root => http://www.php.net/ => http://www.php.net/ enable_dl => On => On error_append_string => no value => no value error_log => no value => no value error_prepend_string => no value => no value error_reporting => 2039 => 2039 expose_php => On => On extension_dir => ./ => ./ file_uploads => On => On gpc_order => GPC => GPC highlight.bg => #FFFFFF => #FFFFFF highlight.comment => #FF9900 => #FF9900 highlight.default => #0000CC => #0000CC highlight.html => #000000 => #000000 highlight.keyword => #006600 => #006600 highlight.string => #CC0000 => #CC0000 html_errors => Off => On ignore_repeated_errors => Off => Off ignore_repeated_source => Off => Off ignore_user_abort => Off => Off implicit_flush => On => Off include_path => .:/usr/local/lib/php => .:/usr/local/lib/php log_errors => Off => Off log_errors_max_len => 1024 => 1024 magic_quotes_gpc => On => On magic_quotes_runtime => Off => Off magic_quotes_sybase => Off => Off max_execution_time => 0 => 30 max_input_time => -1 => -1 open_basedir => no value => no value output_buffering => no value => no value output_handler => no value => no value post_max_size => 8M => 8M precision => 14 => 14 register_argc_argv => On => On register_globals => On => On report_memleaks => On => On safe_mode => Off => Off safe_mode_exec_dir => no value => no value safe_mode_gid => Off => Off safe_mode_include_dir => no value => no value sendmail_from => me@localhost.com => me@localhost.com sendmail_path => /usr/sbin/sendmail -t -i => /usr/sbin/sendmail -t -i short_open_tag => On => On SMTP => localhost => localhost smtp_port => 25 => 25 sql.safe_mode => Off => Off track_errors => Off => Off unserialize_callback_func => no value => no value upload_max_filesize => 2M => 2M upload_tmp_dir => no value => no value user_dir => no value => no value variables_order => EGPCS => EGPCS xmlrpc_error_number => 0 => 0 xmlrpc_errors => Off => Off y2k_compliance => Off => Off bcmath BCMath support => enabled ctype ctype functions => enabled curl CURL support => enabled CURL Information => libcurl/7.10.2 OpenSSL/0.9.7 ipv6 zlib/1.1.4 dba DBA support => enabled Supported handlers => gdbm exif EXIF Support => enabled EXIF Version => 1.4 $Id: exif.c,v 1.118.2.11 2002/12/16 17:53:15 helly Exp $ Supported EXIF Version => 0220 Supported filetypes => JPEG,TIFF ftp FTP support => enabled gd GD Support => enabled GD Version => 2.0 or higher FreeType Support => enabled FreeType Linkage => with freetype GIF Read Support => enabled GIF Create Support => enabled JPG Support => enabled PNG Support => enabled WBMP Support => enabled iconv iconv support => enabled iconv implementation => libiconv iconv library version => 1.8 Directive => Local Value => Master Value iconv.input_encoding => ISO-8859-1 => ISO-8859-1 iconv.internal_encoding => ISO-8859-1 => ISO-8859-1 iconv.output_encoding => ISO-8859-1 => ISO-8859-1 imap IMAP c-Client Version => 4.1 SSL Support => enabled ldap LDAP Support => enabled RCS Version => $Id: ldap.c,v 1.130 2002/11/05 14:18:20 edink Exp $ Total Links => 0/unlimited API Version => 2004 Vendor Name => OpenLDAP Vendor Version => 20109 mcrypt mcrypt support => enabled version => >= 2.4.x Supported ciphers => arcfour blowfish-compat blowfish cast-128 cast-256 des enigma gost loki97 panama rc2 rijndael-128 rijndael-192 rijndael-256 safer-sk128 safer-sk64 saferplus serpent threeway tripledes twofish wake xtea Supported modes => cbc cfb ctr ecb ncfb nofb ofb stream Directive => Local Value => Master Value mcrypt.algorithms_dir => no value => no value mcrypt.modes_dir => no value => no value mysql MySQL Support => enabled Active Persistent Links => 0 Active Links => 0 Client API version => 4.0.7-gamma MYSQL_MODULE_TYPE => external MYSQL_SOCKET => /tmp/mysql.sock MYSQL_INCLUDE => -I/usr/local/mysql/include/mysql MYSQL_LIBS => -L/usr/local/mysql/lib/mysql -lmysqlclient Directive => Local Value => Master Value mysql.allow_persistent => On => On mysql.connect_timeout => -1 => -1 mysql.default_host => no value => no value mysql.default_password => no value => no value mysql.default_port => no value => no value mysql.default_socket => no value => no value mysql.default_user => no value => no value mysql.max_links => Unlimited => Unlimited mysql.max_persistent => Unlimited => Unlimited mysql.trace_mode => Off => Off openssl OpenSSL support => enabled OpenSSL Version => OpenSSL 0.9.7-beta6 17 Dec 2002 overload User-Space Object Overloading Support => enabled pcre PCRE (Perl Compatible Regular Expressions) Support => enabled PCRE Library Version => 3.92 11-Sep-2002 pdf PDF Support => enabled PDFlib GmbH Version => 4.0.3 Revision => $Revision: 1.112.2.2 $ posix Revision => $Revision: 1.51 $ session Session Support => enabled Registered save handlers => files user Directive => Local Value => Master Value session.auto_start => Off => Off session.bug_compat_42 => On => On session.bug_compat_warn => On => On session.cache_expire => 180 => 180 session.cache_limiter => nocache => nocache session.cookie_domain => no value => no value session.cookie_lifetime => 0 => 0 session.cookie_path => / => / session.cookie_secure => Off => Off session.entropy_file => no value => no value session.entropy_length => 0 => 0 session.gc_dividend => 100 => 100 session.gc_maxlifetime => 1440 => 1440 session.gc_probability => 1 => 1 session.name => PHPSESSID => PHPSESSID session.referer_check => no value => no value session.save_handler => files => files session.save_path => /tmp => /tmp session.serialize_handler => php => php session.use_cookies => On => On session.use_only_cookies => Off => Off session.use_trans_sid => On => On sockets Sockets Support => enabled standard Regex Library => Bundled library enabled Dynamic Library Support => enabled Path to sendmail => /usr/sbin/sendmail -t -i Directive => Local Value => Master Value assert.active => 1 => 1 assert.bail => 0 => 0 assert.callback => no value => no value assert.quiet_eval => 0 => 0 assert.warning => 1 => 1 auto_detect_line_endings => 0 => 0 default_socket_timeout => 60 => 60 safe_mode_allowed_env_vars => PHP_ => PHP_ safe_mode_protected_env_vars => LD_LIBRARY_PATH => LD_LIBRARY_PATH url_rewriter.tags => a=href,area=href,frame=src,input=src,form=fakeentry => a=href,area=href,frame=src,input=src,form=fakeentry user_agent => no value => no value tokenizer Tokenizer Support => enabled xml XML Support => active XML Namespace Support => active EXPAT Version => expat_1.95.5 xslt XSLT support => enabled Backend => Sablotron Sablotron Version => 0.97 Sablotron Information => Cflags: -g -O2 -I/usr/local/include -I/usr/local/include Libs: -L/usr/local/lib -liconv -lexpat Prefix: /usr/local zlib ZLib Support => enabled Compiled Version => 1.1.4 Linked Version => 1.1.4 Directive => Local Value => Master Value zlib.output_compression => Off => Off zlib.output_compression_level => -1 => -1 zlib.output_handler => no value => no value Additional Modules Module Name Environment Variable => Value PWD => /usr/local/src/build-php-4.3.0RC3/php-4.3.0RC4 MAKEFLAGS => VENDOR => apple MFLAGS => REDIRECT_STATUS => TEST_PHP_EXECUTABLE => /usr/local/src/build-php-4.3.0RC3/php-4.3.0RC4/sapi/cli/php MANPATH => /usr/local/man:/usr/local/share/man:/sw/man:/sw/share/man:/usr/local/apache/man:/usr/local/apache/share/man:/usr/local/mysql/man:/usr/local/samba/man:/usr/local/mm/man:/usr/local/netpbm/man/var/root/man:/usr/local/share/man:/usr/share/man CC => gcc USER => root MACHTYPE => powerpc SCRIPT_FILENAME => LC_ALL => C ENV_SET => CVS_RSH => /usr/local/bin/ssh PATH_TRANSLATED => EDITOR => /usr/local/bin/vi LANG => en_US QUERY_STRING => CONTENT_LENGTH => HOST => athanor.local. MAKELEVEL => 1 SHLVL => 3 LOGNAME => root GROUP => wheel _ => /usr/local/src/build-php-4.3.0RC3/php-4.3.0RC4/sapi/cli/php REQUEST_METHOD => SHELL => /bin/sh CVSROOT => cvs@spiderman.diamondbullet.com:/home/cvs HOSTTYPE => macintosh TEST_PHP_SRCDIR => /usr/local/src/build-php-4.3.0RC3/php-4.3.0RC4 OSTYPE => darwin TERM => vt100 HOME => /var/root PATH => /usr/local/apache/bin:/usr/local/apache/sbin:/usr/local/mysql/bin:/usr/local/samba/bin:/usr/local/mm/bin:/usr/local/netpbm/bin:/usr/libexec/:/Library/StartupItems/Sharity/bin:/Library/StartupItems/Sharity/sbin:/var/root/bin/powerpc-apple-darwin:/var/root/bin:/usr/local/bin:/usr/bin:/bin:/usr/local/sbin:/usr/sbin:/sbin:/usr/local/libexec:/usr/libexec:/sw/bin:/sw/sbin __CF_USER_TEXT_ENCODING => 0x0:0:0 CONTENT_TYPE => PHP Variables Variable => Value PHP_SELF => _SERVER["PWD"] => /usr/local/src/build-php-4.3.0RC3/php-4.3.0RC4 _SERVER["MAKEFLAGS"] => _SERVER["VENDOR"] => apple _SERVER["MFLAGS"] => _SERVER["REDIRECT_STATUS"] => _SERVER["TEST_PHP_EXECUTABLE"] => /usr/local/src/build-php-4.3.0RC3/php-4.3.0RC4/sapi/cli/php _SERVER["MANPATH"] => /usr/local/man:/usr/local/share/man:/sw/man:/sw/share/man:/usr/local/apache/man:/usr/local/apache/share/man:/usr/local/mysql/man:/usr/local/samba/man:/usr/local/mm/man:/usr/local/netpbm/man/var/root/man:/usr/local/share/man:/usr/share/man _SERVER["CC"] => gcc _SERVER["USER"] => root _SERVER["MACHTYPE"] => powerpc _SERVER["SCRIPT_FILENAME"] => _SERVER["LC_ALL"] => C _SERVER["ENV_SET"] => _SERVER["CVS_RSH"] => /usr/local/bin/ssh _SERVER["PATH_TRANSLATED"] => _SERVER["EDITOR"] => /usr/local/bin/vi _SERVER["LANG"] => en_US _SERVER["QUERY_STRING"] => _SERVER["CONTENT_LENGTH"] => _SERVER["HOST"] => athanor.local. _SERVER["MAKELEVEL"] => 1 _SERVER["SHLVL"] => 3 _SERVER["LOGNAME"] => root _SERVER["GROUP"] => wheel _SERVER["_"] => /usr/local/src/build-php-4.3.0RC3/php-4.3.0RC4/sapi/cli/php _SERVER["REQUEST_METHOD"] => _SERVER["SHELL"] => /bin/sh _SERVER["CVSROOT"] => cvs@spiderman.diamondbullet.com:/home/cvs _SERVER["HOSTTYPE"] => macintosh _SERVER["TEST_PHP_SRCDIR"] => /usr/local/src/build-php-4.3.0RC3/php-4.3.0RC4 _SERVER["OSTYPE"] => darwin _SERVER["TERM"] => vt100 _SERVER["HOME"] => /var/root _SERVER["PATH"] => /usr/local/apache/bin:/usr/local/apache/sbin:/usr/local/mysql/bin:/usr/local/samba/bin:/usr/local/mm/bin:/usr/local/netpbm/bin:/usr/libexec/:/Library/StartupItems/Sharity/bin:/Library/StartupItems/Sharity/sbin:/var/root/bin/powerpc-apple-darwin:/var/root/bin:/usr/local/bin:/usr/bin:/bin:/usr/local/sbin:/usr/sbin:/sbin:/usr/local/libexec:/usr/libexec:/sw/bin:/sw/sbin _SERVER["__CF_USER_TEXT_ENCODING"] => 0x0:0:0 _SERVER["CONTENT_TYPE"] => _SERVER["PHP_SELF"] => _SERVER["SCRIPT_NAME"] => _SERVER["DOCUMENT_ROOT"] => _SERVER["argv"] => Array ( ) _SERVER["argc"] => 0 _ENV["PWD"] => /usr/local/src/build-php-4.3.0RC3/php-4.3.0RC4 _ENV["MAKEFLAGS"] => _ENV["VENDOR"] => apple _ENV["MFLAGS"] => _ENV["REDIRECT_STATUS"] => _ENV["TEST_PHP_EXECUTABLE"] => /usr/local/src/build-php-4.3.0RC3/php-4.3.0RC4/sapi/cli/php _ENV["MANPATH"] => /usr/local/man:/usr/local/share/man:/sw/man:/sw/share/man:/usr/local/apache/man:/usr/local/apache/share/man:/usr/local/mysql/man:/usr/local/samba/man:/usr/local/mm/man:/usr/local/netpbm/man/var/root/man:/usr/local/share/man:/usr/share/man _ENV["CC"] => gcc _ENV["USER"] => root _ENV["MACHTYPE"] => powerpc _ENV["SCRIPT_FILENAME"] => _ENV["LC_ALL"] => C _ENV["ENV_SET"] => _ENV["CVS_RSH"] => /usr/local/bin/ssh _ENV["PATH_TRANSLATED"] => _ENV["EDITOR"] => /usr/local/bin/vi _ENV["LANG"] => en_US _ENV["QUERY_STRING"] => _ENV["CONTENT_LENGTH"] => _ENV["HOST"] => athanor.local. _ENV["MAKELEVEL"] => 1 _ENV["SHLVL"] => 3 _ENV["LOGNAME"] => root _ENV["GROUP"] => wheel _ENV["_"] => /usr/local/src/build-php-4.3.0RC3/php-4.3.0RC4/sapi/cli/php _ENV["REQUEST_METHOD"] => _ENV["SHELL"] => /bin/sh _ENV["CVSROOT"] => cvs@spiderman.diamondbullet.com:/home/cvs _ENV["HOSTTYPE"] => macintosh _ENV["TEST_PHP_SRCDIR"] => /usr/local/src/build-php-4.3.0RC3/php-4.3.0RC4 _ENV["OSTYPE"] => darwin _ENV["TERM"] => vt100 _ENV["HOME"] => /var/root _ENV["PATH"] => /usr/local/apache/bin:/usr/local/apache/sbin:/usr/local/mysql/bin:/usr/local/samba/bin:/usr/local/mm/bin:/usr/local/netpbm/bin:/usr/libexec/:/Library/StartupItems/Sharity/bin:/Library/StartupItems/Sharity/sbin:/var/root/bin/powerpc-apple-darwin:/var/root/bin:/usr/local/bin:/usr/bin:/bin:/usr/local/sbin:/usr/sbin:/sbin:/usr/local/libexec:/usr/libexec:/sw/bin:/sw/sbin _ENV["__CF_USER_TEXT_ENCODING"] => 0x0:0:0 _ENV["CONTENT_TYPE"] => PHP License This program is free software; you can redistribute it and/or modify it under the terms of the PHP License as published by the PHP Group and included in the distribution in the file: LICENSE This program is distributed in the hope that it will be useful, but WITHOUT ANY WARRANTY; without even the implied warranty of MERCHANTABILITY or FITNESS FOR A PARTICULAR PURPOSE. If you did not receive a copy of the PHP license, or have any questions about PHP licensing, please contact license@php.net.

« previous php.qa (#7513) next »