Test results [failed] PHP5 (ZE2) on Tru64

From: Date: Mon, 13 Jan 2003 13:22:59 +0000
Subject: Test results [failed] PHP5 (ZE2) on Tru64
Groups: php.qa 
Request: Send a blank email to php-qa+get-8007@lists.php.net to get a copy of this message


===================================================================== FAILED TEST SUMMARY --------------------------------------------------------------------- Bug #20175 (Static vars can't store ref to new instance) [tests/lang/bug20175.phpt] Bug #21600 (assign by reference function call changes variable contents) [tests/lang/bug21600.phpt] aggregating everything [ext/standard/tests/aggregation/aggregate.phpt] aggregating all methods [ext/standard/tests/aggregation/aggregate_methods.phpt] aggregating methods specified in the list [ext/standard/tests/aggregation/aggregate_methods_by_list.phpt] aggregating methods matching regular expression [ext/standard/tests/aggregation/aggregate_methods_by_regexp.phpt] Simple math tests [ext/standard/tests/math/abs.phpt] log() tests [ext/standard/tests/math/log.phpt] Various pow() tests [ext/standard/tests/math/pow.phpt] Simple math tests [ext/standard/tests/math/round.phpt] htmlentities() test 1 (cp1252) [ext/standard/tests/strings/htmlentities01.phpt] htmlentities() test 3 (setlocale / de_DE.ISO-8859-1) [ext/standard/tests/strings/htmlentities03.phpt] htmlentities() test 10 (default_charset / cp1252) [ext/standard/tests/strings/htmlentities10.phpt] htmlentities() test 11 (default_charset / ISO-8859-15) [ext/standard/tests/strings/htmlentities11.phpt] htmlentities() test 12 (default_charset / ISO-8859-1) [ext/standard/tests/strings/htmlentities12.phpt] htmlentities() test 13 (default_charset / EUC-JP) [ext/standard/tests/strings/htmlentities13.phpt] htmlentities() test 14 (default_charset / Shift_JIS) [ext/standard/tests/strings/htmlentities14.phpt] Test strcspn() behavior [ext/standard/tests/strings/strcspn.phpt] Test strspn() behavior [ext/standard/tests/strings/strspn.phpt] microtime() function [ext/standard/tests/time/001.phpt] strtotime() function [ext/standard/tests/time/002.phpt] ===================================================================== ===================================================================== TEST RESULT SUMMARY --------------------------------------------------------------------- Exts skipped : 82 Exts tested : 3 --------------------------------------------------------------------- Number of tests : 467 Tests skipped : 272 (58.2%) Tests failed : 21 ( 4.5%) Tests passed : 174 (37.3%) --------------------------------------------------------------------- Time taken : 233 seconds ===================================================================== ================================================================================ /php/php4/tests/lang/bug20175.phpt ================================================================================ ---- EXPECTED OUTPUT %s foo_static() foo_global() foo:1 foo_static() foo:1 bar_static() bar_global() bar:1 bar_static() bar_global() bar:2 wow_static() wow_global() wow:1 wow_static() wow:1 oop_test() oop_static() oop_class() oop:1 oop_static() oop:1 oop_test() oop_static() oop:1 ---- ACTUAL OUTPUT Parse error: parse error, expecting `'('' in /php/php4/tests/lang/bug20175.php on line 109 ---- FAILED ================================================================================ 001- %s 001+ Parse error: parse error, expecting `'('' in /php/php4/tests/lang/bug20175.php on line 109 002- foo_static() 003- foo_global() 004- foo:1 005- foo_static() 006- foo:1 007- bar_static() 008- bar_global() 009- bar:1 010- bar_static() 011- bar_global() 012- bar:2 013- wow_static() 014- wow_global() 015- wow:1 016- wow_static() 017- wow:1 018- oop_test() 019- oop_static() 020- oop_class() 021- oop:1 022- oop_static() 023- oop:1 024- oop_test() 025- oop_static() 026- oop:1 ================================================================================ ================================================================================ /php/php4/tests/lang/bug21600.phpt ================================================================================ ---- EXPECTED OUTPUT array(1) { ["foo"]=> string(4) "test" } ---- ACTUAL OUTPUT array(1) { ["foo"]=> &string(4) "test" } ---- FAILED ================================================================================ 003- string(4) "test" 003+ &string(4) "test" ================================================================================ ================================================================================ /php/php4/ext/standard/tests/aggregation/aggregate.phpt ================================================================================ ---- EXPECTED OUTPUT I'm alive! I'm helping! I'm aggregating! **** ---- ACTUAL OUTPUT I'm alive! Fatal error: Call to undefined function do_this() in /php/php4/ext/standard/tests/aggregation/aggregate.php on line 7 ---- FAILED ================================================================================ 002- I'm helping! 002+ 003- I'm aggregating! 003+ Fatal error: Call to undefined function do_this() in /php/php4/ext/standard/tests/aggregation/aggregate.php on line 7 004- **** ================================================================================ ================================================================================ /php/php4/ext/standard/tests/aggregation/aggregate_methods.phpt ================================================================================ ---- EXPECTED OUTPUT I'm alive! mixing 100 simple,mix_it simple_prop mixing ---- ACTUAL OUTPUT I'm alive! Fatal error: Call to undefined function mix_it() in /php/php4/ext/standard/tests/aggregation/aggregate_methods.php on line 6 ---- FAILED ================================================================================ 002- mixing 002+ 003- 100 003+ Fatal error: Call to undefined function mix_it() in /php/php4/ext/standard/tests/aggregation/aggregate_methods.php on line 6 004- simple,mix_it 005- simple_prop 006- mixing ================================================================================ ================================================================================ /php/php4/ext/standard/tests/aggregation/aggregate_methods_by_list.phpt ================================================================================ ---- EXPECTED OUTPUT I'm alive! simple,just_another_method I'm alive! simple,do_this,do_that yep, that's me ---- ACTUAL OUTPUT I'm alive! simple I'm alive! simple Fatal error: Call to undefined function just_another_method() in /php/php4/ext/standard/tests/aggregation/aggregate_methods_by_list.php on line 10 ---- FAILED ================================================================================ 002- simple,just_another_method 002+ simple 004- simple,do_this,do_that 004+ simple 005- yep, that's me 005+ 006+ Fatal error: Call to undefined function just_another_method() in /php/php4/ext/standard/tests/aggregation/aggregate_methods_by_list.php on line 10 ================================================================================ ================================================================================ /php/php4/ext/standard/tests/aggregation/aggregate_methods_by_regexp.phpt ================================================================================ ---- EXPECTED OUTPUT I'm alive! simple,do_this,do_that I'm alive! simple,just_another_method ---- ACTUAL OUTPUT I'm alive! simple I'm alive! simple ---- FAILED ================================================================================ 002- simple,do_this,do_that 002+ simple 004- simple,just_another_method 004+ simple ================================================================================ ================================================================================ /php/php4/ext/standard/tests/math/abs.phpt ================================================================================ ---- EXPECTED OUTPUT 1,1,0,0 OK ---- ACTUAL OUTPUT 1,1,1,1 Assert failed: -LONG_MIN+1 === abs(LONG_MIN-1) Left: int(-9223372036854775807) Right: int(9223372036854775807) Assert failed: -LONG_MIN === abs(LONG_MIN) Left: int(-9223372036854775808) Right: float(9.2233720368548E+18) ---- FAILED ================================================================================ 001- 1,1,0,0 001+ 1,1,1,1 002- OK 002+ 003+ Assert failed: 004+ -LONG_MIN+1 === abs(LONG_MIN-1) 005+ Left: int(-9223372036854775807) 006+ Right: int(9223372036854775807) 007+ 008+ Assert failed: 009+ -LONG_MIN === abs(LONG_MIN) 010+ Left: int(-9223372036854775808) 011+ Right: float(9.2233720368548E+18) ================================================================================ ================================================================================ /php/php4/ext/standard/tests/math/log.phpt ================================================================================ ---- EXPECTED OUTPUT On failure, please mail result to php-dev@lists.php.net 200 50 50 50 50 50 50 50 50 50 ---- ACTUAL OUTPUT On failure, please mail result to php-dev@lists.php.net 200 ---- FAILED ================================================================================ 003- 50 004- 50 005- 50 006- 50 007- 50 008- 50 009- 50 010- 50 011- 50 ================================================================================ ================================================================================ /php/php4/ext/standard/tests/math/pow.phpt ================================================================================ ---- EXPECTED OUTPUT 1,1,0,0 On failure, please mail result to php-dev@lists.php.net OK ---- ACTUAL OUTPUT 1,1,1,1 On failure, please mail result to php-dev@lists.php.net Assert failed: TRUE === is_infinite(pow(0,-2)) Left: bool(true) Right: bool(false) Assert failed: TRUE === is_infinite(pow(0,-1)) Left: bool(true) Right: bool(false) Assert failed: TRUE === is_infinite(pow(0,-2.0)) Left: bool(true) Right: bool(false) Assert failed: TRUE === is_infinite(pow(0,-1.0)) Left: bool(true) Right: bool(false) Assert failed: TRUE === is_infinite(pow(0.0,-2.0)) Left: bool(true) Right: bool(false) Assert failed: TRUE === is_infinite(pow(0.0,-1.0)) Left: bool(true) Right: bool(false) Assert failed: TRUE === is_infinite(pow( 0.0,-2)) Left: bool(true) Right: bool(false) Assert failed: TRUE === is_infinite(pow( 0.0,-1)) Left: bool(true) Right: bool(false) Assert failed: LONG_MAX-1 === pow(LONG_MAX-1,1) Left: int(9223372036854775806) Right: int(-9223372036854775808) Assert failed: LONG_MIN+1 === pow(LONG_MIN+1,1) Left: int(-9223372036854775807) Right: int(-9223372036854775808) Assert failed: LONG_MAX === pow(LONG_MAX,1) Left: int(9223372036854775807) Right: int(-9223372036854775808) ---- FAILED ================================================================================ 001- 1,1,0,0 001+ 1,1,1,1 003- OK 003+ 004+ Assert failed: 005+ TRUE === is_infinite(pow(0,-2)) 006+ Left: bool(true) 007+ Right: bool(false) 008+ 009+ Assert failed: 010+ TRUE === is_infinite(pow(0,-1)) 011+ Left: bool(true) 012+ Right: bool(false) 013+ 014+ Assert failed: 015+ TRUE === is_infinite(pow(0,-2.0)) 016+ Left: bool(true) 017+ Right: bool(false) 018+ 019+ Assert failed: 020+ TRUE === is_infinite(pow(0,-1.0)) 021+ Left: bool(true) 022+ Right: bool(false) 023+ 024+ Assert failed: 025+ TRUE === is_infinite(pow(0.0,-2.0)) 026+ Left: bool(true) 027+ Right: bool(false) 028+ 029+ Assert failed: 030+ TRUE === is_infinite(pow(0.0,-1.0)) 031+ Left: bool(true) 032+ Right: bool(false) 033+ 034+ Assert failed: 035+ TRUE === is_infinite(pow( 0.0,-2)) 036+ Left: bool(true) 037+ Right: bool(false) 038+ 039+ Assert failed: 040+ TRUE === is_infinite(pow( 0.0,-1)) 041+ Left: bool(true) 042+ Right: bool(false) 043+ 044+ Assert failed: 045+ LONG_MAX-1 === pow(LONG_MAX-1,1) 046+ Left: int(9223372036854775806) 047+ Right: int(-9223372036854775808) 048+ 049+ Assert failed: 050+ LONG_MIN+1 === pow(LONG_MIN+1,1) 051+ Left: int(-9223372036854775807) 052+ Right: int(-9223372036854775808) 053+ 054+ Assert failed: 055+ LONG_MAX === pow(LONG_MAX,1) 056+ Left: int(9223372036854775807) 057+ Right: int(-9223372036854775808) ================================================================================ ================================================================================ /php/php4/ext/standard/tests/math/round.phpt ================================================================================ ---- EXPECTED OUTPUT 1,1,0,0 OK ---- ACTUAL OUTPUT 1,1,1,1 Assert failed: LONG_MIN-1 ~== round(LONG_MIN - 0.6) Left: int(9223372036854775807) Right: float(-9.2233720368548E+18) Assert failed: LONG_MIN-1 ~== floor(LONG_MIN - 0.5) Left: int(9223372036854775807) Right: float(-9.2233720368548E+18) Assert failed: LONG_MAX+1 ~== ceil(LONG_MAX + 0.5) Left: int(-9223372036854775808) Right: float(9.2233720368548E+18) Assert failed: LONG_MAX+1 ~== round(LONG_MAX + 0.6) Left: int(-9223372036854775808) Right: float(9.2233720368548E+18) ---- FAILED ================================================================================ 001- 1,1,0,0 001+ 1,1,1,1 002- OK 002+ 003+ Assert failed: 004+ LONG_MIN-1 ~== round(LONG_MIN - 0.6) 005+ Left: int(9223372036854775807) 006+ Right: float(-9.2233720368548E+18) 007+ 008+ Assert failed: 009+ LONG_MIN-1 ~== floor(LONG_MIN - 0.5) 010+ Left: int(9223372036854775807) 011+ Right: float(-9.2233720368548E+18) 012+ 013+ Assert failed: 014+ LONG_MAX+1 ~== ceil(LONG_MAX + 0.5) 015+ Left: int(-9223372036854775808) 016+ Right: float(9.2233720368548E+18) 017+ 018+ Assert failed: 019+ LONG_MAX+1 ~== round(LONG_MAX + 0.6) 020+ Left: int(-9223372036854775808) 021+ Right: float(9.2233720368548E+18) ================================================================================ ================================================================================ /php/php4/ext/standard/tests/strings/htmlentities01.phpt ================================================================================ ---- EXPECTED OUTPUT string(28) "&sbquo;&dagger;&trade;&Yuml;" string(32) "&euro;&cent;&pound;&curren;&yen;" ---- ACTUAL OUTPUT ---- FAILED ================================================================================ 001- string(28) "&sbquo;&dagger;&trade;&Yuml;" 001+ 002- string(32) "&euro;&cent;&pound;&curren;&yen;" ================================================================================ ================================================================================ /php/php4/ext/standard/tests/strings/htmlentities03.phpt ================================================================================ ---- EXPECTED OUTPUT string(18) "&auml;&ouml;&uuml;" ---- ACTUAL OUTPUT ---- FAILED ================================================================================ 001- string(18) "&auml;&ouml;&uuml;" 001+ ================================================================================ ================================================================================ /php/php4/ext/standard/tests/strings/htmlentities10.phpt ================================================================================ ---- EXPECTED OUTPUT cp1252 string(28) "&sbquo;&dagger;&trade;&Yuml;" string(32) "&euro;&cent;&pound;&curren;&yen;" ---- ACTUAL OUTPUT cp1252 ---- FAILED ================================================================================ 002- string(28) "&sbquo;&dagger;&trade;&Yuml;" 003- string(32) "&euro;&cent;&pound;&curren;&yen;" ================================================================================ ================================================================================ /php/php4/ext/standard/tests/strings/htmlentities11.phpt ================================================================================ ---- EXPECTED OUTPUT ISO-8859-15 string(20) "&OElig;&oelig;&Yuml;" ---- ACTUAL OUTPUT ISO-8859-15 ---- FAILED ================================================================================ 002- string(20) "&OElig;&oelig;&Yuml;" ================================================================================ ================================================================================ /php/php4/ext/standard/tests/strings/htmlentities12.phpt ================================================================================ ---- EXPECTED OUTPUT ISO-8859-1 string(18) "&auml;&ouml;&uuml;" ---- ACTUAL OUTPUT ISO-8859-1 ---- FAILED ================================================================================ 002- string(18) "&auml;&ouml;&uuml;" ================================================================================ ================================================================================ /php/php4/ext/standard/tests/strings/htmlentities13.phpt ================================================================================ ---- EXPECTED OUTPUT EUC-JP string(6) "¡¢¡£¡¤" ---- ACTUAL OUTPUT EUC-JP ---- FAILED ================================================================================ 002- string(6) "¡¢¡£¡¤" ================================================================================ ================================================================================ /php/php4/ext/standard/tests/strings/htmlentities14.phpt ================================================================================ ---- EXPECTED OUTPUT Shift_JIS string(6) "ABC" ---- ACTUAL OUTPUT Shift_JIS ---- FAILED ================================================================================ 002- string(6) "ABC" ================================================================================ ================================================================================ /php/php4/ext/standard/tests/strings/strcspn.phpt ================================================================================ ---- EXPECTED OUTPUT string(25) "22222222aaaa bbb1111 cccc" string(4) "1234" int(0) int(7) int(6) ---- ACTUAL OUTPUT string(25) "22222222aaaa bbb1111 cccc" string(4) "1234" int(0) int(0) int(0) ---- FAILED ================================================================================ 004- int(7) 004+ int(0) 005- int(6) 005+ int(0) ================================================================================ ================================================================================ /php/php4/ext/standard/tests/strings/strspn.phpt ================================================================================ ---- EXPECTED OUTPUT string(25) "22222222aaaa bbb1111 cccc" string(4) "1234" int(8) int(6) int(3) ---- ACTUAL OUTPUT string(25) "22222222aaaa bbb1111 cccc" string(4) "1234" ---- FAILED ================================================================================ 003- int(8) 004- int(6) 005- int(3) ================================================================================ ================================================================================ /php/php4/ext/standard/tests/time/001.phpt ================================================================================ ---- EXPECTED OUTPUT Passed: 100000 Failed: 0 ---- ACTUAL OUTPUT Passed: 16049 Failed: 83951 000003: 1042463692 0.27816800 < 1042463692 0.27816800 000004: 1042463692 0.27816800 < 1042463692 0.27816800 000005: 1042463692 0.27816800 < 1042463692 0.27816800 000007: 1042463692 0.27914400 < 1042463692 0.27914400 000008: 1042463692 0.27914400 < 1042463692 0.27914400 000009: 1042463692 0.27914400 < 1042463692 0.27914400 000011: 1042463692 0.28012100 < 1042463692 0.28012100 000012: 1042463692 0.28012100 < 1042463692 0.28012100 000013: 1042463692 0.28012100 < 1042463692 0.28012100 000014: 1042463692 0.28012100 < 1042463692 0.28012100 000016: 1042463692 0.28109700 < 1042463692 0.28109700 ---- FAILED ================================================================================ 001- Passed: 100000 001+ Passed: 16049 002- Failed: 0 002+ Failed: 83951 003+ 000003: 1042463692 0.27816800 < 1042463692 0.27816800 004+ 000004: 1042463692 0.27816800 < 1042463692 0.27816800 005+ 000005: 1042463692 0.27816800 < 1042463692 0.27816800 006+ 000007: 1042463692 0.27914400 < 1042463692 0.27914400 007+ 000008: 1042463692 0.27914400 < 1042463692 0.27914400 008+ 000009: 1042463692 0.27914400 < 1042463692 0.27914400 009+ 000011: 1042463692 0.28012100 < 1042463692 0.28012100 010+ 000012: 1042463692 0.28012100 < 1042463692 0.28012100 011+ 000013: 1042463692 0.28012100 < 1042463692 0.28012100 012+ 000014: 1042463692 0.28012100 < 1042463692 0.28012100 013+ 000016: 1042463692 0.28109700 < 1042463692 0.28109700 ================================================================================ ================================================================================ /php/php4/ext/standard/tests/time/002.phpt ================================================================================ ---- EXPECTED OUTPUT 1999-10-13 00:00:00 1999-10-13 00:00:00 2000-01-19 00:00:00 2000-01-19 00:00:00 2001-12-21 00:00:00 2001-12-21 00:00:00 2001-12-21 12:16:00 2001-12-21 12:16:00 1969-12-31 23:59:59 2001-10-22 21:19:58 2001-10-22 23:19:58 2001-10-22 23:32:58 2001-10-22 19:19:58 2001-10-22 19:06:58 1999-10-13 00:00:00 1999-10-13 00:00:00 2000-01-19 00:00:00 2000-01-19 00:00:00 2001-12-21 00:00:00 2001-12-21 00:00:00 2001-12-21 12:16:00 2001-12-21 12:16:00 1970-01-01 00:59:59 2001-10-22 21:19:58 2001-10-23 01:19:58 2001-10-23 01:32:58 2001-10-22 21:19:58 2001-10-22 21:06:58 ---- ACTUAL OUTPUT 1999-10-13 00:00:00 1999-10-13 00:00:00 2000-01-19 00:00:00 2000-01-19 00:00:00 2001-12-21 00:00:00 2001-12-21 00:00:00 2001-12-21 12:16:00 2001-12-21 12:16:00 1970-01-01 00:59:59 2001-10-22 21:19:58 2001-10-23 01:19:58 2001-10-23 01:32:58 2001-10-22 21:19:58 2001-10-22 21:06:58 1999-10-13 00:00:00 1999-10-13 00:00:00 2000-01-19 00:00:00 2000-01-19 00:00:00 2001-12-21 00:00:00 2001-12-21 00:00:00 2001-12-21 12:16:00 2001-12-21 12:16:00 1970-01-01 00:59:59 2001-10-22 21:19:58 2001-10-23 01:19:58 2001-10-23 01:32:58 2001-10-22 21:19:58 2001-10-22 21:06:58 ---- FAILED ================================================================================ 009- 1969-12-31 23:59:59 009+ 1970-01-01 00:59:59 011- 2001-10-22 23:19:58 011+ 2001-10-23 01:19:58 012- 2001-10-22 23:32:58 012+ 2001-10-23 01:32:58 013- 2001-10-22 19:19:58 013+ 2001-10-22 21:19:58 014- 2001-10-22 19:06:58 014+ 2001-10-22 21:06:58 ================================================================================ ================================================================================ BUILD ENVIRONMENT ================================================================================ OS: OSF1 Automake: automake (GNU automake) 1.4 Copyright (C) 1999 Free Software Foundation, Inc. This is free software; see the source for copying conditions. There is NO warranty; not even for MERCHANTABILITY or FITNESS FOR A PARTICULAR PURPOSE. Written by Tom Tromey <tromey@cygnus.com> Autoconf: Autoconf version 2.13 Libtool: ltmain.sh (GNU libtool) 1.4.2 (1.922.2.53 2001/09/11 03:18:52) Compiler: Reading specs from /usr/local/lib/gcc-lib/alphaev5-dec-osf5.1/3.2.1/specs Configured with: ./configure Thread model: single gcc version 3.2.1 Bison: GNU Bison version 1.28 User's E-mail: novell at kiruna dot se ================================================================================ PHPINFO ================================================================================ phpinfo() PHP Version => 5.0.0-dev System => OSF1 netsrv5.netiic.com V5.1 732 alpha Build Date => Jan 13 2003 14:04:05 Configure Command => './configure' '--prefix=/usr/local/php' '--disable-all' '--disable-cgi' '--enable-cli' '--with-pcre-regex' '--enable-recode' '--with-mysql=/my_db' Server API => Command Line Interface Virtual Directory Support => disabled Configuration File (php.ini) Path => /usr/local/php/lib PHP API => 20020918 PHP Extension => 20020429 Zend Extension => 90021012 Debug Build => no Thread Safety => disabled Registered PHP Streams => php, http, ftp This program makes use of the Zend Scripting Language Engine: Zend Engine v2.0.0-dev, Copyright (c) 1998-2003 Zend Technologies _______________________________________________________________________ Configuration PHP Core Directive => Local Value => Master Value allow_call_time_pass_reference => On => On allow_url_fopen => On => On always_populate_raw_post_data => Off => Off arg_separator.input => &amp; => &amp; arg_separator.output => &amp; => &amp; asp_tags => Off => Off auto_append_file => no value => no value auto_prepend_file => no value => no value browscap => no value => no value default_charset => no value => no value default_mimetype => text/html => text/html define_syslog_variables => Off => Off disable_functions => no value => no value display_errors => On => On display_startup_errors => Off => Off doc_root => no value => no value docref_ext => no value => no value docref_root => http://www.php.net/ => http://www.php.net/ enable_dl => On => On error_append_string => no value => no value error_log => no value => no value error_prepend_string => no value => no value error_reporting => no value => no value expose_php => On => On extension_dir => /usr/local/php/lib/php/extensions/no-debug-non-zts-20020429 => /usr/local/php/lib/php/extensions/no-debug-non-zts-20020429 file_uploads => On => On gpc_order => GPC => GPC highlight.bg => #FFFFFF => #FFFFFF highlight.comment => #FF8000 => #FF8000 highlight.default => #0000BB => #0000BB highlight.html => #000000 => #000000 highlight.keyword => #007700 => #007700 highlight.string => #DD0000 => #DD0000 html_errors => Off => On ignore_repeated_errors => Off => Off ignore_repeated_source => Off => Off ignore_user_abort => Off => Off implicit_flush => On => Off include_path => .:/usr/local/php/lib/php => .:/usr/local/php/lib/php log_errors => Off => Off log_errors_max_len => 1024 => 1024 magic_quotes_gpc => On => On magic_quotes_runtime => Off => Off magic_quotes_sybase => Off => Off max_execution_time => 0 => 30 max_input_time => -1 => -1 open_basedir => no value => no value output_buffering => 0 => 0 output_handler => no value => no value post_max_size => 8M => 8M precision => 14 => 14 register_argc_argv => On => On register_globals => Off => Off report_memleaks => On => On report_zend_debug => On => On safe_mode => Off => Off safe_mode_exec_dir => 1 => 1 safe_mode_gid => Off => Off safe_mode_include_dir => no value => no value sendmail_from => no value => no value sendmail_path => /usr/sbin/sendmail -t -i => /usr/sbin/sendmail -t -i short_open_tag => On => On SMTP => localhost => localhost smtp_port => 25 => 25 sql.safe_mode => Off => Off track_errors => Off => Off unserialize_callback_func => no value => no value upload_max_filesize => 2M => 2M upload_tmp_dir => no value => no value user_dir => no value => no value variables_order => no value => no value xmlrpc_error_number => 0 => 0 xmlrpc_errors => Off => Off y2k_compliance => On => On zend2.implicit_clone => no value => no value mysql MySQL Support => enabled Active Persistent Links => 0 Active Links => 0 Client API version => 4.0.8-gamma MYSQL_MODULE_TYPE => external MYSQL_SOCKET => /tmp/mysql.sock MYSQL_INCLUDE => -I/my_db/include/mysql MYSQL_LIBS => -L/my_db/lib/mysql -lmysqlclient Directive => Local Value => Master Value mysql.allow_persistent => On => On mysql.connect_timeout => -1 => -1 mysql.default_host => no value => no value mysql.default_password => no value => no value mysql.default_port => no value => no value mysql.default_socket => no value => no value mysql.default_user => no value => no value mysql.max_links => Unlimited => Unlimited mysql.max_persistent => Unlimited => Unlimited mysql.trace_mode => Off => Off pcre PCRE (Perl Compatible Regular Expressions) Support => enabled PCRE Library Version => 3.92 11-Sep-2002 standard Regex Library => Bundled library enabled Dynamic Library Support => enabled Path to sendmail => /usr/sbin/sendmail -t -i Directive => Local Value => Master Value assert.active => 1 => 1 assert.bail => 0 => 0 assert.callback => no value => no value assert.quiet_eval => 0 => 0 assert.warning => 1 => 1 auto_detect_line_endings => 0 => 0 default_socket_timeout => 60 => 60 safe_mode_allowed_env_vars => PHP_ => PHP_ safe_mode_protected_env_vars => LD_LIBRARY_PATH => LD_LIBRARY_PATH url_rewriter.tags => a=href,area=href,frame=src,form=,fieldset= => a=href,area=href,frame=src,form=,fieldset= user_agent => no value => no value Additional Modules Module Name Environment Variable => Value QUERY_STRING => SSH_TTY => deleted PATH => /usr/local/bin:/usr/local/sbin:/sbin:/usr/sbin:/usr/bin:/usr/ccs/bin:/usr/bin/X11:/usr/local/php/bin OLDPWD => /php/php4/Zend SCRIPT_FILENAME => CONTENT_TYPE => SSH2_TTY => /dev/pts/3 SSH_AUTH_SOCK => deleted MAKE => gmake LOGNAME => root REDIRECT_STATUS => MAKEFLAGS => MAIL => /var/spool/mail/root HOSTNAME => netsrv5.netiic.com REQUEST_METHOD => USER => root PATH_TRANSLATED => SHLVL => 1 CC => gcc CONTENT_LENGTH => MAKELEVEL => 1 TEST_PHP_EXECUTABLE => /php/php4/sapi/cli/php SHELL => /bin/sh HOSTTYPE => alpha SSH2_CLIENT => 10.0.2.1 44650 10.0.1.5 22 OSTYPE => osf5.1 HOME => /root SSH_CLIENT => deleted TEST_PHP_SRCDIR => /php/php4 TERM => xterm MFLAGS => PWD => /php/php4 MACHTYPE => alpha-dec-osf5.1 PHP Variables Variable => Value _SERVER["QUERY_STRING"] => _SERVER["SSH_TTY"] => deleted _SERVER["PATH"] => /usr/local/bin:/usr/local/sbin:/sbin:/usr/sbin:/usr/bin:/usr/ccs/bin:/usr/bin/X11:/usr/local/php/bin _SERVER["OLDPWD"] => /php/php4/Zend _SERVER["SCRIPT_FILENAME"] => _SERVER["CONTENT_TYPE"] => _SERVER["SSH2_TTY"] => /dev/pts/3 _SERVER["SSH_AUTH_SOCK"] => deleted _SERVER["MAKE"] => gmake _SERVER["LOGNAME"] => root _SERVER["REDIRECT_STATUS"] => _SERVER["MAKEFLAGS"] => _SERVER["MAIL"] => /var/spool/mail/root _SERVER["HOSTNAME"] => netsrv5.netiic.com _SERVER["REQUEST_METHOD"] => _SERVER["USER"] => root _SERVER["PATH_TRANSLATED"] => _SERVER["SHLVL"] => 1 _SERVER["CC"] => gcc _SERVER["CONTENT_LENGTH"] => _SERVER["MAKELEVEL"] => 1 _SERVER["TEST_PHP_EXECUTABLE"] => /php/php4/sapi/cli/php _SERVER["SHELL"] => /bin/sh _SERVER["HOSTTYPE"] => alpha _SERVER["SSH2_CLIENT"] => 10.0.2.1 44650 10.0.1.5 22 _SERVER["OSTYPE"] => osf5.1 _SERVER["HOME"] => /root _SERVER["SSH_CLIENT"] => deleted _SERVER["TEST_PHP_SRCDIR"] => /php/php4 _SERVER["TERM"] => xterm _SERVER["MFLAGS"] => _SERVER["PWD"] => /php/php4 _SERVER["MACHTYPE"] => alpha-dec-osf5.1 _SERVER["PHP_SELF"] => _SERVER["SCRIPT_NAME"] => _SERVER["DOCUMENT_ROOT"] => _SERVER["argv"] => Array ( ) _SERVER["argc"] => 0 _ENV["QUERY_STRING"] => _ENV["SSH_TTY"] => deleted _ENV["PATH"] => /usr/local/bin:/usr/local/sbin:/sbin:/usr/sbin:/usr/bin:/usr/ccs/bin:/usr/bin/X11:/usr/local/php/bin _ENV["OLDPWD"] => /php/php4/Zend _ENV["SCRIPT_FILENAME"] => _ENV["CONTENT_TYPE"] => _ENV["SSH2_TTY"] => /dev/pts/3 _ENV["SSH_AUTH_SOCK"] => deleted _ENV["MAKE"] => gmake _ENV["LOGNAME"] => root _ENV["REDIRECT_STATUS"] => _ENV["MAKEFLAGS"] => _ENV["MAIL"] => /var/spool/mail/root _ENV["HOSTNAME"] => netsrv5.netiic.com _ENV["REQUEST_METHOD"] => _ENV["USER"] => root _ENV["PATH_TRANSLATED"] => _ENV["SHLVL"] => 1 _ENV["CC"] => gcc _ENV["CONTENT_LENGTH"] => _ENV["MAKELEVEL"] => 1 _ENV["TEST_PHP_EXECUTABLE"] => /php/php4/sapi/cli/php _ENV["SHELL"] => /bin/sh _ENV["HOSTTYPE"] => alpha _ENV["SSH2_CLIENT"] => 10.0.2.1 44650 10.0.1.5 22 _ENV["OSTYPE"] => osf5.1 _ENV["HOME"] => /root _ENV["SSH_CLIENT"] => deleted _ENV["TEST_PHP_SRCDIR"] => /php/php4 _ENV["TERM"] => xterm _ENV["MFLAGS"] => _ENV["PWD"] => /php/php4 _ENV["MACHTYPE"] => alpha-dec-osf5.1 PHP License This program is free software; you can redistribute it and/or modify it under the terms of the PHP License as published by the PHP Group and included in the distribution in the file: LICENSE This program is distributed in the hope that it will be useful, but WITHOUT ANY WARRANTY; without even the implied warranty of MERCHANTABILITY or FITNESS FOR A PARTICULAR PURPOSE. If you did not receive a copy of the PHP license, or have any questions about PHP licensing, please contact license@php.net.
« previous php.qa (#8007) next »