Test results [failed]

From: Date: Mon, 13 Jan 2003 18:00:21 +0000
Subject: Test results [failed]
Groups: php.qa 
Request: Send a blank email to php-qa+get-8022@lists.php.net to get a copy of this message
===================================================================== FAILED TEST SUMMARY --------------------------------------------------------------------- Bug #20175 (Static vars can't store ref to new instance) [tests/lang/bug20175.phpt] Bug #21600 (assign by reference function call changes variable contents) [tests/lang/bug21600.phpt] session object deserialization [ext/session/tests/003.phpt] session_set_save_handler test [ext/session/tests/004.phpt] custom save handler, multiple session_start()s, complex data structure test. [ext/session/tests/005.phpt] serializing references test case using globals [ext/session/tests/019.phpt] rewriter uses arg_seperator.output for modifying URLs [ext/session/tests/020.phpt] rewriter handles form and fieldset tags correctly [ext/session/tests/021.phpt] aggregating everything [ext/standard/tests/aggregation/aggregate.phpt] aggregating all methods [ext/standard/tests/aggregation/aggregate_methods.phpt] aggregating methods specified in the list [ext/standard/tests/aggregation/aggregate_methods_by_list.phpt] aggregating methods matching regular expression [ext/standard/tests/aggregation/aggregate_methods_by_regexp.phpt] strtotime() function [ext/standard/tests/time/002.phpt] Check for mktime with out-of-range parameters [ext/standard/tests/time/003.phpt] ===================================================================== ===================================================================== TEST RESULT SUMMARY --------------------------------------------------------------------- Exts skipped : 74 Exts tested : 11 --------------------------------------------------------------------- Number of tests : 467 Tests skipped : 219 (46.9%) Tests failed : 14 ( 3.0%) Tests passed : 234 (50.1%) --------------------------------------------------------------------- Time taken : 73 seconds ===================================================================== ================================================================================ /usr1/phpqa/php5/tests/lang/bug20175.phpt ================================================================================ ---- EXPECTED OUTPUT %s foo_static() foo_global() foo:1 foo_static() foo:1 bar_static() bar_global() bar:1 bar_static() bar_global() bar:2 wow_static() wow_global() wow:1 wow_static() wow:1 oop_test() oop_static() oop_class() oop:1 oop_static() oop:1 oop_test() oop_static() oop:1 ---- ACTUAL OUTPUT Parse error: parse error, expecting `'('' in /usr1/phpqa/php5/tests/lang/bug20175.php on line 109 ---- FAILED ================================================================================ 001- %s 001+ Parse error: parse error, expecting `'('' in /usr1/phpqa/php5/tests/lang/bug20175.php on line 109 002- foo_static() 003- foo_global() 004- foo:1 005- foo_static() 006- foo:1 007- bar_static() 008- bar_global() 009- bar:1 010- bar_static() 011- bar_global() 012- bar:2 013- wow_static() 014- wow_global() 015- wow:1 016- wow_static() 017- wow:1 018- oop_test() 019- oop_static() 020- oop_class() 021- oop:1 022- oop_static() 023- oop:1 024- oop_test() 025- oop_static() 026- oop:1 ================================================================================ ================================================================================ /usr1/phpqa/php5/tests/lang/bug21600.phpt ================================================================================ ---- EXPECTED OUTPUT array(1) { ["foo"]=> string(4) "test" } ---- ACTUAL OUTPUT array(1) { ["foo"]=> &string(4) "test" } ---- FAILED ================================================================================ 003- string(4) "test" 003+ &string(4) "test" ================================================================================ ================================================================================ /usr1/phpqa/php5/ext/session/tests/003.phpt ================================================================================ ---- EXPECTED OUTPUT object(foo)(2) { ["bar"]=> string(2) "ok" ["yes"]=> int(2) } array(1) { [3]=> &object(foo)(2) { ["bar"]=> string(2) "ok" ["yes"]=> int(2) } } ---- ACTUAL OUTPUT object(foo)(2) { ["bar"]=> string(2) "ok" ["yes"]=> int(2) } array(1) { [3]=> object(foo)(2) { ["bar"]=> string(2) "ok" ["yes"]=> int(2) } } ---- FAILED ================================================================================ 009- &object(foo)(2) { 009+ object(foo)(2) { ================================================================================ ================================================================================ /usr1/phpqa/php5/ext/session/tests/004.phpt ================================================================================ ---- EXPECTED OUTPUT OPEN: PHPSESSID READ: abtest object(foo)(2) { ["bar"]=> string(2) "ok" ["yes"]=> int(2) } array(1) { [3]=> &object(foo)(2) { ["bar"]=> string(2) "ok" ["yes"]=> int(2) } } WRITE: abtest, baz|O:3:"foo":2:{s:3:"bar";s:2:"ok";s:3:"yes";i:2;}arr|a:1:{i:3;O:3:"foo":2:{s:3:"bar";s:2:"ok";s:3:"yes";i:2;}} OPEN: PHPSESSID READ: abtest object(foo)(2) { ["bar"]=> string(2) "ok" ["yes"]=> int(2) } array(1) { [3]=> object(foo)(2) { ["bar"]=> string(2) "ok" ["yes"]=> int(2) } } DESTROY: abtest ---- ACTUAL OUTPUT OPEN: PHPSESSID READ: abtest object(foo)(2) { ["bar"]=> string(2) "ok" ["yes"]=> int(2) } array(1) { [3]=> object(foo)(2) { ["bar"]=> string(2) "ok" ["yes"]=> int(2) } } WRITE: abtest, baz|O:3:"foo":2:{s:3:"bar";s:2:"ok";s:3:"yes";i:2;}arr|a:1:{i:3;O:3:"foo":2:{s:3:"bar";s:2:"ok";s:3:"yes";i:2;}} OPEN: PHPSESSID READ: abtest object(foo)(2) { ["bar"]=> string(2) "ok" ["yes"]=> int(2) } array(1) { [3]=> object(foo)(2) { ["bar"]=> string(2) "ok" ["yes"]=> int(2) } } DESTROY: abtest ---- FAILED ================================================================================ 011- &object(foo)(2) { 011+ object(foo)(2) { ================================================================================ ================================================================================ /usr1/phpqa/php5/ext/session/tests/005.phpt ================================================================================ ---- EXPECTED OUTPUT OPEN: PHPSESSID READ: abtest object(foo)(2) { ["bar"]=> string(2) "ok" ["yes"]=> int(2) } array(1) { [3]=> &object(foo)(2) { ["bar"]=> string(2) "ok" ["yes"]=> int(2) } } WRITE: abtest, baz|O:3:"foo":2:{s:3:"bar";s:2:"ok";s:3:"yes";i:2;}arr|a:1:{i:3;O:3:"foo":2:{s:3:"bar";s:2:"ok";s:3:"yes";i:2;}} CLOSE OPEN: PHPSESSID READ: abtest object(foo)(2) { ["bar"]=> string(2) "ok" ["yes"]=> int(3) } array(1) { [3]=> &object(foo)(2) { ["bar"]=> string(2) "ok" ["yes"]=> int(3) } } int(123) WRITE: abtest, baz|O:3:"foo":2:{s:3:"bar";s:2:"ok";s:3:"yes";i:3;}arr|a:1:{i:3;O:3:"foo":2:{s:3:"bar";s:2:"ok";s:3:"yes";i:3;}}c|i:123; CLOSE OPEN: PHPSESSID READ: abtest object(foo)(2) { ["bar"]=> string(2) "ok" ["yes"]=> int(3) } array(1) { [3]=> object(foo)(2) { ["bar"]=> string(2) "ok" ["yes"]=> int(3) } } int(123) DESTROY: abtest CLOSE ---- ACTUAL OUTPUT OPEN: PHPSESSID READ: abtest object(foo)(2) { ["bar"]=> string(2) "ok" ["yes"]=> int(2) } array(1) { [3]=> object(foo)(2) { ["bar"]=> string(2) "ok" ["yes"]=> int(2) } } WRITE: abtest, baz|O:3:"foo":2:{s:3:"bar";s:2:"ok";s:3:"yes";i:2;}arr|a:1:{i:3;O:3:"foo":2:{s:3:"bar";s:2:"ok";s:3:"yes";i:2;}} CLOSE OPEN: PHPSESSID READ: abtest object(foo)(2) { ["bar"]=> string(2) "ok" ["yes"]=> int(3) } array(1) { [3]=> object(foo)(2) { ["bar"]=> string(2) "ok" ["yes"]=> int(3) } } int(123) WRITE: abtest, baz|O:3:"foo":2:{s:3:"bar";s:2:"ok";s:3:"yes";i:3;}arr|a:1:{i:3;O:3:"foo":2:{s:3:"bar";s:2:"ok";s:3:"yes";i:3;}}c|i:123; CLOSE OPEN: PHPSESSID READ: abtest object(foo)(2) { ["bar"]=> string(2) "ok" ["yes"]=> int(3) } array(1) { [3]=> object(foo)(2) { ["bar"]=> string(2) "ok" ["yes"]=> int(3) } } int(123) DESTROY: abtest CLOSE ---- FAILED ================================================================================ 011- &object(foo)(2) { 011+ object(foo)(2) { 030- &object(foo)(2) { 030+ object(foo)(2) { ================================================================================ ================================================================================ /usr1/phpqa/php5/ext/session/tests/019.phpt ================================================================================ ---- EXPECTED OUTPUT array(2) { ["o1"]=> &object(tfoo)(1) { ["c"]=> int(42) } ["o2"]=> &object(tfoo)(1) { ["c"]=> int(42) } } array(2) { ["o1"]=> &object(tfoo)(1) { ["c"]=> int(44) } ["o2"]=> &object(tfoo)(1) { ["c"]=> int(44) } } ---- ACTUAL OUTPUT ---- FAILED ================================================================================ 001- array(2) { 001+ 002- ["o1"]=> 003- &object(tfoo)(1) { 004- ["c"]=> 005- int(42) 006- } 007- ["o2"]=> 008- &object(tfoo)(1) { 009- ["c"]=> 010- int(42) 011- } 012- } 013- array(2) { 014- ["o1"]=> 015- &object(tfoo)(1) { 016- ["c"]=> 017- int(44) 018- } 019- ["o2"]=> 020- &object(tfoo)(1) { 021- ["c"]=> 022- int(44) 023- } 024- } ================================================================================ ================================================================================ /usr1/phpqa/php5/ext/session/tests/020.phpt ================================================================================ ---- EXPECTED OUTPUT <a href="link.php?a=b&amp;PHPSESSID=abtest"> ---- ACTUAL OUTPUT ---- FAILED ================================================================================ 001- <a href="link.php?a=b&amp;PHPSESSID=abtest"> 001+ ================================================================================ ================================================================================ /usr1/phpqa/php5/ext/session/tests/021.phpt ================================================================================ ---- EXPECTED OUTPUT <form><input type="hidden" name="PHPSESSID" value="abtest" /> <fieldset><input type="hidden" name="PHPSESSID" value="abtest" /> <form><input type="hidden" name="PHPSESSID" value="abtest" /> <fieldset> <form><input type="hidden" name="PHPSESSID" value="abtest" /> <fieldset> <form> <fieldset><input type="hidden" name="PHPSESSID" value="abtest" /> ---- ACTUAL OUTPUT ---- FAILED ================================================================================ 001- <form><input type="hidden" name="PHPSESSID" value="abtest" /> 001+ 002- <fieldset><input type="hidden" name="PHPSESSID" value="abtest" /> 003- <form><input type="hidden" name="PHPSESSID" value="abtest" /> 004- <fieldset> 005- <form><input type="hidden" name="PHPSESSID" value="abtest" /> 006- <fieldset> 007- <form> 008- <fieldset><input type="hidden" name="PHPSESSID" value="abtest" /> ================================================================================ ================================================================================ /usr1/phpqa/php5/ext/standard/tests/aggregation/aggregate.phpt ================================================================================ ---- EXPECTED OUTPUT I'm alive! I'm helping! I'm aggregating! **** ---- ACTUAL OUTPUT I'm alive! Fatal error: Call to undefined function do_this() in /usr1/phpqa/php5/ext/standard/tests/aggregation/aggregate.php on line 7 ---- FAILED ================================================================================ 002- I'm helping! 002+ 003- I'm aggregating! 003+ Fatal error: Call to undefined function do_this() in /usr1/phpqa/php5/ext/standard/tests/aggregation/aggregate.php on line 7 004- **** ================================================================================ ================================================================================ /usr1/phpqa/php5/ext/standard/tests/aggregation/aggregate_methods.phpt ================================================================================ ---- EXPECTED OUTPUT I'm alive! mixing 100 simple,mix_it simple_prop mixing ---- ACTUAL OUTPUT I'm alive! Fatal error: Call to undefined function mix_it() in /usr1/phpqa/php5/ext/standard/tests/aggregation/aggregate_methods.php on line 6 ---- FAILED ================================================================================ 002- mixing 002+ 003- 100 003+ Fatal error: Call to undefined function mix_it() in /usr1/phpqa/php5/ext/standard/tests/aggregation/aggregate_methods.php on line 6 004- simple,mix_it 005- simple_prop 006- mixing ================================================================================ ================================================================================ /usr1/phpqa/php5/ext/standard/tests/aggregation/aggregate_methods_by_list.phpt ================================================================================ ---- EXPECTED OUTPUT I'm alive! simple,just_another_method I'm alive! simple,do_this,do_that yep, that's me ---- ACTUAL OUTPUT I'm alive! simple I'm alive! simple Fatal error: Call to undefined function just_another_method() in /usr1/phpqa/php5/ext/standard/tests/aggregation/aggregate_methods_by_list.php on line 10 ---- FAILED ================================================================================ 002- simple,just_another_method 002+ simple 004- simple,do_this,do_that 004+ simple 005- yep, that's me 005+ 006+ Fatal error: Call to undefined function just_another_method() in /usr1/phpqa/php5/ext/standard/tests/aggregation/aggregate_methods_by_list.php on line 10 ================================================================================ ================================================================================ /usr1/phpqa/php5/ext/standard/tests/aggregation/aggregate_methods_by_regexp.phpt ================================================================================ ---- EXPECTED OUTPUT I'm alive! simple,do_this,do_that I'm alive! simple,just_another_method ---- ACTUAL OUTPUT I'm alive! simple I'm alive! simple ---- FAILED ================================================================================ 002- simple,do_this,do_that 002+ simple 004- simple,just_another_method 004+ simple ================================================================================ ================================================================================ /usr1/phpqa/php5/ext/standard/tests/time/002.phpt ================================================================================ ---- EXPECTED OUTPUT 1999-10-13 00:00:00 1999-10-13 00:00:00 2000-01-19 00:00:00 2000-01-19 00:00:00 2001-12-21 00:00:00 2001-12-21 00:00:00 2001-12-21 12:16:00 2001-12-21 12:16:00 1969-12-31 23:59:59 2001-10-22 21:19:58 2001-10-22 23:19:58 2001-10-22 23:32:58 2001-10-22 19:19:58 2001-10-22 19:06:58 1999-10-13 00:00:00 1999-10-13 00:00:00 2000-01-19 00:00:00 2000-01-19 00:00:00 2001-12-21 00:00:00 2001-12-21 00:00:00 2001-12-21 12:16:00 2001-12-21 12:16:00 1970-01-01 00:59:59 2001-10-22 21:19:58 2001-10-23 01:19:58 2001-10-23 01:32:58 2001-10-22 21:19:58 2001-10-22 21:06:58 ---- ACTUAL OUTPUT 1999-10-13 00:00:00 1999-10-13 00:00:00 2000-01-19 00:00:00 2000-01-19 00:00:00 2001-12-21 00:00:00 2001-12-21 00:00:00 2001-12-21 12:16:00 2001-12-21 12:16:00 1969-12-31 23:59:59 2001-10-22 21:19:58 2001-10-22 23:19:58 2001-10-22 23:32:58 2001-10-22 19:19:58 2001-10-22 19:06:58 1999-10-13 00:00:00 1999-10-13 00:00:00 2000-01-19 00:00:00 2000-01-19 00:00:00 2001-12-21 00:00:00 2001-12-21 00:00:00 2001-12-21 12:16:00 2001-12-21 12:16:00 1969-12-31 23:59:59 2001-10-22 21:19:58 2001-10-22 23:19:58 2001-10-22 23:32:58 2001-10-22 19:19:58 2001-10-22 19:06:58 ---- FAILED ================================================================================ 023- 1970-01-01 00:59:59 023+ 1969-12-31 23:59:59 025- 2001-10-23 01:19:58 025+ 2001-10-22 23:19:58 026- 2001-10-23 01:32:58 026+ 2001-10-22 23:32:58 027- 2001-10-22 21:19:58 027+ 2001-10-22 19:19:58 028- 2001-10-22 21:06:58 028+ 2001-10-22 19:06:58 ================================================================================ ================================================================================ /usr1/phpqa/php5/ext/standard/tests/time/003.phpt ================================================================================ ---- EXPECTED OUTPUT 2000-02-29 2000-02-28 2000-02-29 2001-02-28 2001-03-01 1999-11-30 2000-05-29 12:00:00 2000-05-29 13:00:00 2000-05-29 12:00:00 2000-01-31 12:00:00 2000-01-31 12:00:00 2000-01-31 11:00:00 2000-04-29 12:00:00 2000-04-29 13:00:00 2000-04-29 12:00:00 ---- ACTUAL OUTPUT 2000-02-29 2000-02-28 2000-02-29 2001-02-28 2001-03-01 1999-11-30 2000-05-29 12:00:00 2000-05-29 12:00:00 2000-05-29 12:00:00 2000-01-31 12:00:00 2000-01-31 12:00:00 2000-01-31 12:00:00 2000-04-29 12:00:00 2000-04-29 12:00:00 2000-04-29 12:00:00 ---- FAILED ================================================================================ 008- 2000-05-29 13:00:00 008+ 2000-05-29 12:00:00 012- 2000-01-31 11:00:00 012+ 2000-01-31 12:00:00 014- 2000-04-29 13:00:00 014+ 2000-04-29 12:00:00 ================================================================================ ================================================================================ BUILD ENVIRONMENT ================================================================================ OS: AIX Automake: automake (GNU automake) 1.5 Written by Tom Tromey <tromey@cygnus.com>. Copyright 1994, 1995, 1996, 1997, 1998, 1999, 2000, 2001 Free Software Foundation, Inc. This is free software; see the source for copying conditions. There is NO warranty; not even for MERCHANTABILITY or FITNESS FOR A PARTICULAR PURPOSE. Autoconf: Autoconf version 2.13 Libtool: ltmain.sh (GNU libtool) 1.4.2 (1.922.2.53 2001/09/11 03:18:52) Compiler: Reading specs from /usr/bin/../lib/gcc-lib/powerpc-ibm-aix5.1.0.0/2.9-aix51-020209/specs gcc version 2.9-aix51-020209 Bison: GNU Bison version 1.28 User's E-mail: f dot malfatto at fmal dot com ================================================================================ PHPINFO ================================================================================ phpinfo() PHP Version => 5.0.0-dev System => AIX trantor 1 5 0042297A4C00 Build Date => Jan 13 2003 18:46:04 Configure Command => './configure' '--enable-track-vars' '--enable-magic-quotes' '--with-zlib=/opt/freeware' '--enable-bcmath' '--with-gd' '--with-ttf=/opt/freeware' '--with-xpm-dir=/opt/freeware' '--with-png-dir=/opt/freeware' '--with-zlib-dir=/opt/freeware' '--with-jpeg-dir=/opt/freeware' '--with-apxs=/opt/freeware/apache/sbin/apxs' '--with-mysql=/opt/freeware' Server API => Command Line Interface Virtual Directory Support => disabled Configuration File (php.ini) Path => /usr/local/lib/php.ini PHP API => 20020918 PHP Extension => 20020429 Zend Extension => 90021012 Debug Build => no Thread Safety => disabled Registered PHP Streams => php, http, ftp, compress.zlib This program makes use of the Zend Scripting Language Engine: Zend Engine v2.0.0-dev, Copyright (c) 1998-2003 Zend Technologies _______________________________________________________________________ Configuration PHP Core Directive => Local Value => Master Value allow_call_time_pass_reference => On => On allow_url_fopen => On => On always_populate_raw_post_data => Off => Off arg_separator.input => &amp; => &amp; arg_separator.output => &amp; => &amp; asp_tags => Off => Off auto_append_file => no value => no value auto_prepend_file => no value => no value browscap => no value => no value default_charset => no value => no value default_mimetype => text/html => text/html define_syslog_variables => Off => Off disable_functions => no value => no value display_errors => On => On display_startup_errors => Off => Off doc_root => no value => no value docref_ext => no value => no value docref_root => http://www.php.net/ => http://www.php.net/ enable_dl => On => On error_append_string => no value => no value error_log => syslog => syslog error_prepend_string => no value => no value error_reporting => 2039 => 2039 expose_php => On => On extension_dir => ./ => ./ file_uploads => On => On gpc_order => GPC => GPC highlight.bg => #FFFFFF => #FFFFFF highlight.comment => #FF9900 => #FF9900 highlight.default => #0000CC => #0000CC highlight.html => #000000 => #000000 highlight.keyword => #006600 => #006600 highlight.string => #CC0000 => #CC0000 html_errors => Off => On ignore_repeated_errors => Off => Off ignore_repeated_source => Off => Off ignore_user_abort => Off => Off implicit_flush => On => Off include_path => .:/usr/local/lib/php => .:/usr/local/lib/php log_errors => On => On log_errors_max_len => 1024 => 1024 magic_quotes_gpc => On => On magic_quotes_runtime => Off => Off magic_quotes_sybase => Off => Off max_execution_time => 0 => 30 max_input_time => -1 => -1 open_basedir => no value => no value output_buffering => no value => no value output_handler => no value => no value post_max_size => 8M => 8M precision => 14 => 14 register_argc_argv => On => On register_globals => On => On report_memleaks => On => On report_zend_debug => On => On safe_mode => Off => Off safe_mode_exec_dir => no value => no value safe_mode_gid => Off => Off safe_mode_include_dir => no value => no value sendmail_from => me@localhost.com => me@localhost.com sendmail_path => /usr/local/bin/sendmail -t -i => /usr/local/bin/sendmail -t -i short_open_tag => On => On SMTP => localhost => localhost smtp_port => 25 => 25 sql.safe_mode => Off => Off track_errors => Off => Off unserialize_callback_func => no value => no value upload_max_filesize => 5M => 5M upload_tmp_dir => /tmp => /tmp user_dir => no value => no value variables_order => EGPCS => EGPCS xmlrpc_error_number => 0 => 0 xmlrpc_errors => Off => Off y2k_compliance => Off => Off zend2.implicit_clone => no value => no value bcmath BCMath support => enabled ctype ctype functions => enabled gd GD Support => enabled GD Version => bundled (2.0 compatible) FreeType Support => enabled FreeType Linkage => with TTF library GIF Read Support => enabled JPG Support => enabled PNG Support => enabled WBMP Support => enabled mysql MySQL Support => enabled Active Persistent Links => 0 Active Links => 0 Client API version => 3.23.47 MYSQL_MODULE_TYPE => external MYSQL_SOCKET => /tmp/mysql.sock MYSQL_INCLUDE => -I/opt/freeware/include/mysql MYSQL_LIBS => -L/opt/freeware/lib/mysql -lmysqlclient Directive => Local Value => Master Value mysql.allow_persistent => On => On mysql.connect_timeout => -1 => -1 mysql.default_host => no value => no value mysql.default_password => no value => no value mysql.default_port => no value => no value mysql.default_socket => no value => no value mysql.default_user => no value => no value mysql.max_links => Unlimited => Unlimited mysql.max_persistent => 32 => 32 mysql.trace_mode => Off => Off pcre PCRE (Perl Compatible Regular Expressions) Support => enabled PCRE Library Version => 3.92 11-Sep-2002 posix Revision => $Revision: 1.52 $ session Session Support => enabled Registered save handlers => files user Directive => Local Value => Master Value session.auto_start => Off => Off session.bug_compat_42 => On => On session.bug_compat_warn => On => On session.cache_expire => 180 => 180 session.cache_limiter => nocache => nocache session.cookie_domain => no value => no value session.cookie_lifetime => 0 => 0 session.cookie_path => / => / session.cookie_secure => Off => Off session.entropy_file => no value => no value session.entropy_length => 0 => 0 session.gc_dividend => 100 => 100 session.gc_maxlifetime => 1440 => 1440 session.gc_probability => 1 => 1 session.hash_function => 0 => 0 session.name => PHPSESSID => PHPSESSID session.referer_check => no value => no value session.save_handler => files => files session.save_path => /tmp => /tmp session.serialize_handler => php => php session.use_cookies => On => On session.use_only_cookies => Off => Off session.use_trans_sid => On => On standard Regex Library => Bundled library enabled Dynamic Library Support => enabled Path to sendmail => /usr/local/bin/sendmail -t -i Directive => Local Value => Master Value assert.active => 1 => 1 assert.bail => 0 => 0 assert.callback => no value => no value assert.quiet_eval => 0 => 0 assert.warning => 1 => 1 auto_detect_line_endings => 0 => 0 default_socket_timeout => 60 => 60 safe_mode_allowed_env_vars => PHP_ => PHP_ safe_mode_protected_env_vars => LD_LIBRARY_PATH => LD_LIBRARY_PATH url_rewriter.tags => a=href,area=href,frame=src,input=src,form=fakeentry => a=href,area=href,frame=src,input=src,form=fakeentry user_agent => no value => no value tokenizer Tokenizer Support => enabled xml XML Support => active XML Namespace Support => active EXPAT Version => 1.95.5 zlib ZLib Support => enabled Compiled Version => 1.1.4 Linked Version => 1.1.4 Directive => Local Value => Master Value zlib.output_compression => Off => Off zlib.output_compression_level => -1 => -1 zlib.output_handler => no value => no value Additional Modules Module Name Environment Variable => Value _ => /usr1/phpqa/php5/sapi/cli/php MANPATH => /usr/share/man:/opt/freeware/man:/usr/local/man LANG => C LOGIN => phpqa QUERY_STRING => SSH_TTY => deleted PATH => /usr/linux/bin:/usr/local/bin:/usr/bin:/usr/linux/bin:/etc:/usr/sbin:/usr/ucb:/usr/bin/X11:/sbin:/usr/java130/jre/bin:/usr/java130/bin:/usr/local/bin:.:. OLDPWD => /usr1/phpqa SCRIPT_FILENAME => CONTENT_TYPE => LC__FASTMSG => true SSH_AUTH_SOCK => deleted CGI_DIRECTORY => /opt/freeware/apache/share/cgi-bin myhost => trantor.fmal.com LOGNAME => phpqa REDIRECT_STATUS => MAKEFLAGS => MAIL => /usr/spool/mail/phpqa LOCPATH => /usr/lib/nls/loc PS1 => $LOGNAME@$myhost:$PWD # REQUEST_METHOD => DOCUMENT_SERVER_MACHINE_NAME => trantor.fmal.com USER => phpqa PATH_TRANSLATED => AUTHSTATE => files SHLVL => 1 LC_MESSAGES => en_US CC => gcc CONTENT_LENGTH => DEFAULT_BROWSER => netscape MAKELEVEL => 1 TEST_PHP_EXECUTABLE => /usr1/phpqa/php5/sapi/cli/php SHELL => /bin/sh ODMDIR => /etc/objrepos DOCUMENT_SERVER_PORT => 80 HOME => /usr1/phpqa SSH_CLIENT => deleted TEST_PHP_SRCDIR => /usr1/phpqa/php5 TERM => xterm MAILMSG => [YOU HAVE NEW MAIL] MFLAGS => ITECONFIGSRV => /etc/IMNSearch PWD => /usr1/phpqa/php5 DOCUMENT_DIRECTORY => /webs/trantor TZ => NFT-1DFT ITECONFIGCL => /etc/IMNSearch/clients ITE_DOC_SEARCH_INSTANCE => search PHP Variables Variable => Value PHP_SELF => _SERVER["_"] => /usr1/phpqa/php5/sapi/cli/php _SERVER["MANPATH"] => /usr/share/man:/opt/freeware/man:/usr/local/man _SERVER["LANG"] => C _SERVER["LOGIN"] => phpqa _SERVER["QUERY_STRING"] => _SERVER["SSH_TTY"] => deleted _SERVER["PATH"] => /usr/linux/bin:/usr/local/bin:/usr/bin:/usr/linux/bin:/etc:/usr/sbin:/usr/ucb:/usr/bin/X11:/sbin:/usr/java130/jre/bin:/usr/java130/bin:/usr/local/bin:.:. _SERVER["OLDPWD"] => /usr1/phpqa _SERVER["SCRIPT_FILENAME"] => _SERVER["CONTENT_TYPE"] => _SERVER["LC__FASTMSG"] => true _SERVER["SSH_AUTH_SOCK"] => deleted _SERVER["CGI_DIRECTORY"] => /opt/freeware/apache/share/cgi-bin _SERVER["myhost"] => trantor.fmal.com _SERVER["LOGNAME"] => phpqa _SERVER["REDIRECT_STATUS"] => _SERVER["MAKEFLAGS"] => _SERVER["MAIL"] => /usr/spool/mail/phpqa _SERVER["LOCPATH"] => /usr/lib/nls/loc _SERVER["PS1"] => $LOGNAME@$myhost:$PWD # _SERVER["REQUEST_METHOD"] => _SERVER["DOCUMENT_SERVER_MACHINE_NAME"] => trantor.fmal.com _SERVER["USER"] => phpqa _SERVER["PATH_TRANSLATED"] => _SERVER["AUTHSTATE"] => files _SERVER["SHLVL"] => 1 _SERVER["LC_MESSAGES"] => en_US _SERVER["CC"] => gcc _SERVER["CONTENT_LENGTH"] => _SERVER["DEFAULT_BROWSER"] => netscape _SERVER["MAKELEVEL"] => 1 _SERVER["TEST_PHP_EXECUTABLE"] => /usr1/phpqa/php5/sapi/cli/php _SERVER["SHELL"] => /bin/sh _SERVER["ODMDIR"] => /etc/objrepos _SERVER["DOCUMENT_SERVER_PORT"] => 80 _SERVER["HOME"] => /usr1/phpqa _SERVER["SSH_CLIENT"] => deleted _SERVER["TEST_PHP_SRCDIR"] => /usr1/phpqa/php5 _SERVER["TERM"] => xterm _SERVER["MAILMSG"] => [YOU HAVE NEW MAIL] _SERVER["MFLAGS"] => _SERVER["ITECONFIGSRV"] => /etc/IMNSearch _SERVER["PWD"] => /usr1/phpqa/php5 _SERVER["DOCUMENT_DIRECTORY"] => /webs/trantor _SERVER["TZ"] => NFT-1DFT _SERVER["ITECONFIGCL"] => /etc/IMNSearch/clients _SERVER["ITE_DOC_SEARCH_INSTANCE"] => search _SERVER["PHP_SELF"] => _SERVER["SCRIPT_NAME"] => _SERVER["DOCUMENT_ROOT"] => _SERVER["argv"] => Array ( ) _SERVER["argc"] => 0 _ENV["_"] => /usr1/phpqa/php5/sapi/cli/php _ENV["MANPATH"] => /usr/share/man:/opt/freeware/man:/usr/local/man _ENV["LANG"] => C _ENV["LOGIN"] => phpqa _ENV["QUERY_STRING"] => _ENV["SSH_TTY"] => deleted _ENV["PATH"] => /usr/linux/bin:/usr/local/bin:/usr/bin:/usr/linux/bin:/etc:/usr/sbin:/usr/ucb:/usr/bin/X11:/sbin:/usr/java130/jre/bin:/usr/java130/bin:/usr/local/bin:.:. _ENV["OLDPWD"] => /usr1/phpqa _ENV["SCRIPT_FILENAME"] => _ENV["CONTENT_TYPE"] => _ENV["LC__FASTMSG"] => true _ENV["SSH_AUTH_SOCK"] => deleted _ENV["CGI_DIRECTORY"] => /opt/freeware/apache/share/cgi-bin _ENV["myhost"] => trantor.fmal.com _ENV["LOGNAME"] => phpqa _ENV["REDIRECT_STATUS"] => _ENV["MAKEFLAGS"] => _ENV["MAIL"] => /usr/spool/mail/phpqa _ENV["LOCPATH"] => /usr/lib/nls/loc _ENV["PS1"] => $LOGNAME@$myhost:$PWD # _ENV["REQUEST_METHOD"] => _ENV["DOCUMENT_SERVER_MACHINE_NAME"] => trantor.fmal.com _ENV["USER"] => phpqa _ENV["PATH_TRANSLATED"] => _ENV["AUTHSTATE"] => files _ENV["SHLVL"] => 1 _ENV["LC_MESSAGES"] => en_US _ENV["CC"] => gcc _ENV["CONTENT_LENGTH"] => _ENV["DEFAULT_BROWSER"] => netscape _ENV["MAKELEVEL"] => 1 _ENV["TEST_PHP_EXECUTABLE"] => /usr1/phpqa/php5/sapi/cli/php _ENV["SHELL"] => /bin/sh _ENV["ODMDIR"] => /etc/objrepos _ENV["DOCUMENT_SERVER_PORT"] => 80 _ENV["HOME"] => /usr1/phpqa _ENV["SSH_CLIENT"] => deleted _ENV["TEST_PHP_SRCDIR"] => /usr1/phpqa/php5 _ENV["TERM"] => xterm _ENV["MAILMSG"] => [YOU HAVE NEW MAIL] _ENV["MFLAGS"] => _ENV["ITECONFIGSRV"] => /etc/IMNSearch _ENV["PWD"] => /usr1/phpqa/php5 _ENV["DOCUMENT_DIRECTORY"] => /webs/trantor _ENV["TZ"] => NFT-1DFT _ENV["ITECONFIGCL"] => /etc/IMNSearch/clients _ENV["ITE_DOC_SEARCH_INSTANCE"] => search PHP License This program is free software; you can redistribute it and/or modify it under the terms of the PHP License as published by the PHP Group and included in the distribution in the file: LICENSE This program is distributed in the hope that it will be useful, but WITHOUT ANY WARRANTY; without even the implied warranty of MERCHANTABILITY or FITNESS FOR A PARTICULAR PURPOSE. If you did not receive a copy of the PHP license, or have any questions about PHP licensing, please contact license@php.net.

« previous php.qa (#8022) next »