Test results [failed]

From: Date: Mon, 20 Jan 2003 18:23:58 +0000
Subject: Test results [failed]
Groups: php.qa 
Request: Send a blank email to php-qa+get-8288@lists.php.net to get a copy of this message
===================================================================== FAILED TEST SUMMARY --------------------------------------------------------------------- Bug #20175 (Static vars can't store ref to new instance) [tests/lang/bug20175.phpt] Bug #21094 (set_error_handler not accepting methods) [tests/lang/bug21094.phpt] Bug #21600 (assign by reference function call changes variable contents) [tests/lang/bug21600.phpt] aggregating everything [ext/standard/tests/aggregation/aggregate.phpt] aggregating all methods [ext/standard/tests/aggregation/aggregate_methods.phpt] aggregating methods specified in the list [ext/standard/tests/aggregation/aggregate_methods_by_list.phpt] aggregating methods matching regular expression [ext/standard/tests/aggregation/aggregate_methods_by_regexp.phpt] ===================================================================== ===================================================================== TEST RESULT SUMMARY --------------------------------------------------------------------- Exts skipped : 77 Exts tested : 8 --------------------------------------------------------------------- Number of tests : 470 Tests skipped : 248 (52.8%) Tests failed : 7 ( 1.5%) Tests passed : 215 (45.7%) --------------------------------------------------------------------- Time taken : 49 seconds ===================================================================== ================================================================================ /opt/DEV/php/php4/tests/lang/bug20175.phpt ================================================================================ ---- EXPECTED OUTPUT %s foo_static() foo_global() foo:1 foo_static() foo:1 bar_static() bar_global() bar:1 bar_static() bar_global() bar:2 wow_static() wow_global() wow:1 wow_static() wow:1 oop_test() oop_static() oop_class() oop:1 oop_static() oop:1 oop_test() oop_static() oop:1 ---- ACTUAL OUTPUT Parse error: parse error, unexpected ')', expecting '(' in /opt/DEV/php/php4/tests/lang/bug20175.php on line 109 ---- FAILED ================================================================================ 001- %s 001+ Parse error: parse error, unexpected ')', expecting '(' in /opt/DEV/php/php4/tests/lang/bug20175.php on line 109 002- foo_static() 003- foo_global() 004- foo:1 005- foo_static() 006- foo:1 007- bar_static() 008- bar_global() 009- bar:1 010- bar_static() 011- bar_global() 012- bar:2 013- wow_static() 014- wow_global() 015- wow:1 016- wow_static() 017- wow:1 018- oop_test() 019- oop_static() 020- oop_class() 021- oop:1 022- oop_static() 023- oop:1 024- oop_test() 025- oop_static() 026- oop:1 ================================================================================ ================================================================================ /opt/DEV/php/php4/tests/lang/bug21094.phpt ================================================================================ ---- EXPECTED OUTPUT [1024] errstr: test, errfile: %s, errline: %d ---- ACTUAL OUTPUT Notice: Array to string conversion in /opt/DEV/php/php4/tests/lang/bug21094.php on line 8 Notice: test in /opt/DEV/php/php4/tests/lang/bug21094.php on line 10 ---- FAILED ================================================================================ 001- [1024] errstr: test, errfile: %s, errline: %d 001+ Notice: Array to string conversion in /opt/DEV/php/php4/tests/lang/bug21094.php on line 8 002+ 003+ Notice: test in /opt/DEV/php/php4/tests/lang/bug21094.php on line 10 ================================================================================ ================================================================================ /opt/DEV/php/php4/tests/lang/bug21600.phpt ================================================================================ ---- EXPECTED OUTPUT array(1) { ["foo"]=> string(4) "test" } ---- ACTUAL OUTPUT array(1) { ["foo"]=> &string(4) "test" } ---- FAILED ================================================================================ 003- string(4) "test" 003+ &string(4) "test" ================================================================================ ================================================================================ /opt/DEV/php/php4/ext/standard/tests/aggregation/aggregate.phpt ================================================================================ ---- EXPECTED OUTPUT I'm alive! I'm helping! I'm aggregating! **** ---- ACTUAL OUTPUT I'm alive! Fatal error: Call to undefined function do_this() in /opt/DEV/php/php4/ext/standard/tests/aggregation/aggregate.php on line 7 ---- FAILED ================================================================================ 002- I'm helping! 002+ 003- I'm aggregating! 003+ Fatal error: Call to undefined function do_this() in /opt/DEV/php/php4/ext/standard/tests/aggregation/aggregate.php on line 7 004- **** ================================================================================ ================================================================================ /opt/DEV/php/php4/ext/standard/tests/aggregation/aggregate_methods.phpt ================================================================================ ---- EXPECTED OUTPUT I'm alive! mixing 100 simple,mix_it simple_prop mixing ---- ACTUAL OUTPUT I'm alive! Fatal error: Call to undefined function mix_it() in /opt/DEV/php/php4/ext/standard/tests/aggregation/aggregate_methods.php on line 6 ---- FAILED ================================================================================ 002- mixing 002+ 003- 100 003+ Fatal error: Call to undefined function mix_it() in /opt/DEV/php/php4/ext/standard/tests/aggregation/aggregate_methods.php on line 6 004- simple,mix_it 005- simple_prop 006- mixing ================================================================================ ================================================================================ /opt/DEV/php/php4/ext/standard/tests/aggregation/aggregate_methods_by_list.phpt ================================================================================ ---- EXPECTED OUTPUT I'm alive! simple,just_another_method I'm alive! simple,do_this,do_that yep, that's me ---- ACTUAL OUTPUT I'm alive! simple I'm alive! simple Fatal error: Call to undefined function just_another_method() in /opt/DEV/php/php4/ext/standard/tests/aggregation/aggregate_methods_by_list.php on line 10 ---- FAILED ================================================================================ 002- simple,just_another_method 002+ simple 004- simple,do_this,do_that 004+ simple 005- yep, that's me 005+ 006+ Fatal error: Call to undefined function just_another_method() in /opt/DEV/php/php4/ext/standard/tests/aggregation/aggregate_methods_by_list.php on line 10 ================================================================================ ================================================================================ /opt/DEV/php/php4/ext/standard/tests/aggregation/aggregate_methods_by_regexp.phpt ================================================================================ ---- EXPECTED OUTPUT I'm alive! simple,do_this,do_that I'm alive! simple,just_another_method ---- ACTUAL OUTPUT I'm alive! simple I'm alive! simple ---- FAILED ================================================================================ 002- simple,do_this,do_that 002+ simple 004- simple,just_another_method 004+ simple ================================================================================ ================================================================================ BUILD ENVIRONMENT ================================================================================ OS: Linux Automake: automake (GNU automake) 1.4-p5 Copyright (C) 1999, 2001 Free Software Foundation, Inc. This is free software; see the source for copying conditions. There is NO warranty; not even for MERCHANTABILITY or FITNESS FOR A PARTICULAR PURPOSE. Written by Tom Tromey <tromey@cygnus.com> Autoconf: Autoconf version 2.13 Libtool: ltmain.sh (GNU libtool) 1.4.2 (1.922.2.53 2001/09/11 03:18:52) Compiler: Reading specs from /usr/lib/gcc-lib/i686-pc-linux-gnu/3.2.1/specs Configured with: /var/tmp/portage/gcc-3.2.1-r7/work/gcc-3.2.1/configure --prefix=/usr --bindir=/usr/i686-pc-linux-gnu/gcc-bin/3.2 --includedir=/usr/lib/gcc-lib/i686-pc-linux-gnu/3.2.1/include --datadir=/usr/share/gcc-data/i686-pc-linux-gnu/3.2 --mandir=/usr/share/gcc-data/i686-pc-linux-gnu/3.2/man --infodir=/usr/share/gcc-data/i686-pc-linux-gnu/3.2/info --enable-shared --host=i686-pc-linux-gnu --target=i686-pc-linux-gnu --with-system-zlib --enable-languages=c,c++,ada,f77,objc,java --enable-threads=posix --enable-long-long --disable-checking --enable-cstdio=stdio --enable-clocale=generic --enable-__cxa_atexit --enable-version-specific-runtime-libs --with-gxx-include-dir=/usr/lib/gcc-lib/i686-pc-linux-gnu/3.2.1/include/g++-v3 --with-local-prefix=/usr/local --enable-shared --enable-nls --without-included-gettext Thread model: posix gcc version 3.2.1 20021207 (Gentoo Linux 3.2.1-20021207) Bison: bison (GNU Bison) 1.35 Copyright 1984, 1986, 1989, 1992, 2000, 2001, 2002 Free Software Foundation, Inc. This is free software; see the source for copying conditions. There is NO warranty; not even for MERCHANTABILITY or FITNESS FOR A PARTICULAR PURPOSE. User's E-mail: novell at kiruna dot se ================================================================================ PHPINFO ================================================================================ phpinfo() PHP Version => 5.0.0-dev System => Linux N0v3ll.NetIIC.com 2.4.20-gentoo-r1 #1 SMP Tue Jan 14 23:49:51 CET 2003 i686 Build Date => Jan 20 2003 19:22:23 Configure Command => './configure' '--prefix=/usr/local/php' '--disable-all' '--enable-cli' '--disable-cgi' '--enable-sockets' '--enable-posix' '--enable-sessions' '--enable-short-path' '--enable-rpath' '--with-pear' '--with-pcre-regex' '--enable-recode' '--with-mysql=/usr' '--enable-bcmath' '--enable-dba' '--with-gdbm=/usr/local' '--enable-ftp' Server API => Command Line Interface Virtual Directory Support => disabled Configuration File (php.ini) Path => /usr/local/php/lib PHP API => 20020918 PHP Extension => 20020429 Zend Extension => 90021012 Debug Build => no Thread Safety => disabled Registered PHP Streams => php, http, ftp This program makes use of the Zend Scripting Language Engine: Zend Engine v2.0.0-dev, Copyright (c) 1998-2003 Zend Technologies _______________________________________________________________________ Configuration PHP Core Directive => Local Value => Master Value allow_call_time_pass_reference => On => On allow_url_fopen => On => On always_populate_raw_post_data => Off => Off arg_separator.input => &amp; => &amp; arg_separator.output => &amp; => &amp; asp_tags => Off => Off auto_append_file => no value => no value auto_prepend_file => no value => no value browscap => no value => no value default_charset => no value => no value default_mimetype => text/html => text/html define_syslog_variables => Off => Off disable_functions => no value => no value display_errors => On => On display_startup_errors => Off => Off doc_root => no value => no value docref_ext => no value => no value docref_root => http://www.php.net/ => http://www.php.net/ enable_dl => On => On error_append_string => no value => no value error_log => no value => no value error_prepend_string => no value => no value error_reporting => no value => no value expose_php => On => On extension_dir => /usr/local/php/lib/php/extensions/no-debug-non-zts-20020429 => /usr/local/php/lib/php/extensions/no-debug-non-zts-20020429 file_uploads => On => On gpc_order => GPC => GPC highlight.bg => #FFFFFF => #FFFFFF highlight.comment => #FF8000 => #FF8000 highlight.default => #0000BB => #0000BB highlight.html => #000000 => #000000 highlight.keyword => #007700 => #007700 highlight.string => #DD0000 => #DD0000 html_errors => Off => On ignore_repeated_errors => Off => Off ignore_repeated_source => Off => Off ignore_user_abort => Off => Off implicit_flush => On => Off include_path => .:/usr/local/php/lib/php => .:/usr/local/php/lib/php log_errors => Off => Off log_errors_max_len => 1024 => 1024 magic_quotes_gpc => On => On magic_quotes_runtime => Off => Off magic_quotes_sybase => Off => Off max_execution_time => 0 => 30 max_input_time => -1 => -1 open_basedir => no value => no value output_buffering => 0 => 0 output_handler => no value => no value post_max_size => 8M => 8M precision => 14 => 14 register_argc_argv => On => On register_globals => Off => Off report_memleaks => On => On report_zend_debug => On => On safe_mode => Off => Off safe_mode_exec_dir => 1 => 1 safe_mode_gid => Off => Off safe_mode_include_dir => no value => no value sendmail_from => no value => no value sendmail_path => /usr/sbin/sendmail -t -i => /usr/sbin/sendmail -t -i short_open_tag => On => On SMTP => localhost => localhost smtp_port => 25 => 25 sql.safe_mode => Off => Off track_errors => Off => Off unserialize_callback_func => no value => no value upload_max_filesize => 2M => 2M upload_tmp_dir => no value => no value user_dir => no value => no value variables_order => no value => no value xmlrpc_error_number => 0 => 0 xmlrpc_errors => Off => Off y2k_compliance => On => On zend2.implicit_clone => no value => no value bcmath BCMath support => enabled dba DBA support => enabled Supported handlers => gdbm cdb cdb_make flatfile ftp FTP support => enabled mysql MySQL Support => enabled Active Persistent Links => 0 Active Links => 0 Client API version => 3.23.54 MYSQL_MODULE_TYPE => external MYSQL_SOCKET => /var/run/mysqld/mysqld.sock MYSQL_INCLUDE => -I/usr/include/mysql MYSQL_LIBS => -L/usr/lib -lmysqlclient Directive => Local Value => Master Value mysql.allow_persistent => On => On mysql.connect_timeout => -1 => -1 mysql.default_host => no value => no value mysql.default_password => no value => no value mysql.default_port => no value => no value mysql.default_socket => no value => no value mysql.default_user => no value => no value mysql.max_links => Unlimited => Unlimited mysql.max_persistent => Unlimited => Unlimited mysql.trace_mode => Off => Off pcre PCRE (Perl Compatible Regular Expressions) Support => enabled PCRE Library Version => 3.92 11-Sep-2002 posix Revision => $Revision: 1.54 $ sockets Sockets Support => enabled standard Regex Library => Bundled library enabled Dynamic Library Support => enabled Path to sendmail => /usr/sbin/sendmail -t -i Directive => Local Value => Master Value assert.active => 1 => 1 assert.bail => 0 => 0 assert.callback => no value => no value assert.quiet_eval => 0 => 0 assert.warning => 1 => 1 auto_detect_line_endings => 0 => 0 default_socket_timeout => 60 => 60 safe_mode_allowed_env_vars => PHP_ => PHP_ safe_mode_protected_env_vars => LD_LIBRARY_PATH => LD_LIBRARY_PATH url_rewriter.tags => a=href,area=href,frame=src,form=,fieldset= => a=href,area=href,frame=src,form=,fieldset= user_agent => no value => no value Additional Modules Module Name Environment Variable => Value MANPATH => /usr/share/man:/usr/local/share/man:/usr/share/gcc-data/i686-pc-linux-gnu/3.2/man:/usr/X11R6/man:/opt/blackdown-jdk-1.4.1_beta/man:/usr/qt/3/man INFODIR => /usr/share/info:/usr/X11R6/info HOSTNAME => N0v3ll.NetIIC.com TEST_PHP_SRCDIR => /opt/DEV/php/php4 PHP_TEST_RESULTS => y SHELL => /bin/sh TERM => xterm MAKEFLAGS => --jobserver-fds=3,7 -j SSH_CLIENT => deleted GNUSTEP_LOCAL_ROOT => /usr/lib/GNUstep QTDIR => /usr/qt/3 SSH_TTY => deleted SGML_CATALOG_FILES => /etc/sgml/sgml-docbook.cat:/etc/sgml/openjade-1.3.1.cat:/etc/sgml/sgml-ent.cat:/etc/sgml/sgml-docbook-4.0.cat:/etc/sgml/sgml-lite.cat USER => root SCRIPT_FILENAME => SSH_AUTH_SOCK => deleted KDEDIR => /usr/kde/3.1 MAKELEVEL => 1 CONFIG_PROTECT_MASK => /etc/gconf PAGER => /usr/bin/less MFLAGS => - --jobserver-fds=3,7 -j XINITRC => /etc/X11/xinit/xinitrc PATH => /usr/bin/ccache:/bin:/sbin:/usr/bin:/usr/sbin:/usr/local/bin:/opt/bin:/usr/i686-pc-linux-gnu/gcc-bin/3.2:/usr/X11R6/bin:/opt/blackdown-jdk-1.4.1_beta/bin:/opt/blackdown-jdk-1.4.1_beta/jre/bin:/usr/qt/3/bin:/usr/kde/3.1/sbin:/usr/kde/3.1/bin:/usr/qt/2/bin:/usr/kde/3/bin:/usr/bin/ccache MAIL => /var/spool/mail/root _ => /opt/DEV/php/php4/sapi/cli/php PWD => /opt/DEV/php/php4 INPUTRC => /etc/inputrc JAVA_HOME => /opt/blackdown-jdk-1.4.1_beta CHROMIUM_DATA => /usr/share/games/chromium EDITOR => /bin/nano JAVAC => /opt/blackdown-jdk-1.4.1_beta/bin/javac TEST_PHP_EXECUTABLE => /opt/DEV/php/php4/sapi/cli/php REDIRECT_STATUS => QMAKESPEC => linux-g++ KDEDIRS => /usr/kde/3.1:/usr/kde/3:/usr PATH_TRANSLATED => JDK_HOME => /opt/blackdown-jdk-1.4.1_beta HOME => /root SHLVL => 4 CONTENT_LENGTH => PHP_TEST_EMAIL => novell@kiruna.se LOGNAME => root LESS => -r QUERY_STRING => CVS_RSH => ssh CLASSPATH => /opt/blackdown-jdk-1.4.1_beta/jre/lib/rt.jar:. LESSOPEN => |lesspipe.sh %s VIMRUNTIME => /usr/share/vim/vim61 INFOPATH => /usr/share/info:/usr/share/gcc-data/i686-pc-linux-gnu/3.2/info CONTENT_TYPE => DISPLAY => :0.0 CC => gcc REQUEST_METHOD => CONFIG_PROTECT => /usr/kde/3.1/share/config /usr/kde/3/share/config /opt/glftpd/etc /usr/share/config PHP Variables Variable => Value _SERVER["MANPATH"] => /usr/share/man:/usr/local/share/man:/usr/share/gcc-data/i686-pc-linux-gnu/3.2/man:/usr/X11R6/man:/opt/blackdown-jdk-1.4.1_beta/man:/usr/qt/3/man _SERVER["INFODIR"] => /usr/share/info:/usr/X11R6/info _SERVER["HOSTNAME"] => N0v3ll.NetIIC.com _SERVER["TEST_PHP_SRCDIR"] => /opt/DEV/php/php4 _SERVER["PHP_TEST_RESULTS"] => y _SERVER["SHELL"] => /bin/sh _SERVER["TERM"] => xterm _SERVER["MAKEFLAGS"] => --jobserver-fds=3,7 -j _SERVER["SSH_CLIENT"] => deleted _SERVER["GNUSTEP_LOCAL_ROOT"] => /usr/lib/GNUstep _SERVER["QTDIR"] => /usr/qt/3 _SERVER["SSH_TTY"] => deleted _SERVER["SGML_CATALOG_FILES"] => /etc/sgml/sgml-docbook.cat:/etc/sgml/openjade-1.3.1.cat:/etc/sgml/sgml-ent.cat:/etc/sgml/sgml-docbook-4.0.cat:/etc/sgml/sgml-lite.cat _SERVER["USER"] => root _SERVER["SCRIPT_FILENAME"] => _SERVER["SSH_AUTH_SOCK"] => deleted _SERVER["KDEDIR"] => /usr/kde/3.1 _SERVER["MAKELEVEL"] => 1 _SERVER["CONFIG_PROTECT_MASK"] => /etc/gconf _SERVER["PAGER"] => /usr/bin/less _SERVER["MFLAGS"] => - --jobserver-fds=3,7 -j _SERVER["XINITRC"] => /etc/X11/xinit/xinitrc _SERVER["PATH"] => /usr/bin/ccache:/bin:/sbin:/usr/bin:/usr/sbin:/usr/local/bin:/opt/bin:/usr/i686-pc-linux-gnu/gcc-bin/3.2:/usr/X11R6/bin:/opt/blackdown-jdk-1.4.1_beta/bin:/opt/blackdown-jdk-1.4.1_beta/jre/bin:/usr/qt/3/bin:/usr/kde/3.1/sbin:/usr/kde/3.1/bin:/usr/qt/2/bin:/usr/kde/3/bin:/usr/bin/ccache _SERVER["MAIL"] => /var/spool/mail/root _SERVER["_"] => /opt/DEV/php/php4/sapi/cli/php _SERVER["PWD"] => /opt/DEV/php/php4 _SERVER["INPUTRC"] => /etc/inputrc _SERVER["JAVA_HOME"] => /opt/blackdown-jdk-1.4.1_beta _SERVER["CHROMIUM_DATA"] => /usr/share/games/chromium _SERVER["EDITOR"] => /bin/nano _SERVER["JAVAC"] => /opt/blackdown-jdk-1.4.1_beta/bin/javac _SERVER["TEST_PHP_EXECUTABLE"] => /opt/DEV/php/php4/sapi/cli/php _SERVER["REDIRECT_STATUS"] => _SERVER["QMAKESPEC"] => linux-g++ _SERVER["KDEDIRS"] => /usr/kde/3.1:/usr/kde/3:/usr _SERVER["PATH_TRANSLATED"] => _SERVER["JDK_HOME"] => /opt/blackdown-jdk-1.4.1_beta _SERVER["HOME"] => /root _SERVER["SHLVL"] => 4 _SERVER["CONTENT_LENGTH"] => _SERVER["PHP_TEST_EMAIL"] => novell@kiruna.se _SERVER["LOGNAME"] => root _SERVER["LESS"] => -r _SERVER["QUERY_STRING"] => _SERVER["CVS_RSH"] => ssh _SERVER["CLASSPATH"] => /opt/blackdown-jdk-1.4.1_beta/jre/lib/rt.jar:. _SERVER["LESSOPEN"] => |lesspipe.sh %s _SERVER["VIMRUNTIME"] => /usr/share/vim/vim61 _SERVER["INFOPATH"] => /usr/share/info:/usr/share/gcc-data/i686-pc-linux-gnu/3.2/info _SERVER["CONTENT_TYPE"] => _SERVER["DISPLAY"] => :0.0 _SERVER["CC"] => gcc _SERVER["REQUEST_METHOD"] => _SERVER["CONFIG_PROTECT"] => /usr/kde/3.1/share/config /usr/kde/3/share/config /opt/glftpd/etc /usr/share/config _SERVER["PHP_SELF"] => _SERVER["SCRIPT_NAME"] => _SERVER["DOCUMENT_ROOT"] => _SERVER["argv"] => Array ( ) _SERVER["argc"] => 0 _ENV["MANPATH"] => /usr/share/man:/usr/local/share/man:/usr/share/gcc-data/i686-pc-linux-gnu/3.2/man:/usr/X11R6/man:/opt/blackdown-jdk-1.4.1_beta/man:/usr/qt/3/man _ENV["INFODIR"] => /usr/share/info:/usr/X11R6/info _ENV["HOSTNAME"] => N0v3ll.NetIIC.com _ENV["TEST_PHP_SRCDIR"] => /opt/DEV/php/php4 _ENV["PHP_TEST_RESULTS"] => y _ENV["SHELL"] => /bin/sh _ENV["TERM"] => xterm _ENV["MAKEFLAGS"] => --jobserver-fds=3,7 -j _ENV["SSH_CLIENT"] => deleted _ENV["GNUSTEP_LOCAL_ROOT"] => /usr/lib/GNUstep _ENV["QTDIR"] => /usr/qt/3 _ENV["SSH_TTY"] => deleted _ENV["SGML_CATALOG_FILES"] => /etc/sgml/sgml-docbook.cat:/etc/sgml/openjade-1.3.1.cat:/etc/sgml/sgml-ent.cat:/etc/sgml/sgml-docbook-4.0.cat:/etc/sgml/sgml-lite.cat _ENV["USER"] => root _ENV["SCRIPT_FILENAME"] => _ENV["SSH_AUTH_SOCK"] => deleted _ENV["KDEDIR"] => /usr/kde/3.1 _ENV["MAKELEVEL"] => 1 _ENV["CONFIG_PROTECT_MASK"] => /etc/gconf _ENV["PAGER"] => /usr/bin/less _ENV["MFLAGS"] => - --jobserver-fds=3,7 -j _ENV["XINITRC"] => /etc/X11/xinit/xinitrc _ENV["PATH"] => /usr/bin/ccache:/bin:/sbin:/usr/bin:/usr/sbin:/usr/local/bin:/opt/bin:/usr/i686-pc-linux-gnu/gcc-bin/3.2:/usr/X11R6/bin:/opt/blackdown-jdk-1.4.1_beta/bin:/opt/blackdown-jdk-1.4.1_beta/jre/bin:/usr/qt/3/bin:/usr/kde/3.1/sbin:/usr/kde/3.1/bin:/usr/qt/2/bin:/usr/kde/3/bin:/usr/bin/ccache _ENV["MAIL"] => /var/spool/mail/root _ENV["_"] => /opt/DEV/php/php4/sapi/cli/php _ENV["PWD"] => /opt/DEV/php/php4 _ENV["INPUTRC"] => /etc/inputrc _ENV["JAVA_HOME"] => /opt/blackdown-jdk-1.4.1_beta _ENV["CHROMIUM_DATA"] => /usr/share/games/chromium _ENV["EDITOR"] => /bin/nano _ENV["JAVAC"] => /opt/blackdown-jdk-1.4.1_beta/bin/javac _ENV["TEST_PHP_EXECUTABLE"] => /opt/DEV/php/php4/sapi/cli/php _ENV["REDIRECT_STATUS"] => _ENV["QMAKESPEC"] => linux-g++ _ENV["KDEDIRS"] => /usr/kde/3.1:/usr/kde/3:/usr _ENV["PATH_TRANSLATED"] => _ENV["JDK_HOME"] => /opt/blackdown-jdk-1.4.1_beta _ENV["HOME"] => /root _ENV["SHLVL"] => 4 _ENV["CONTENT_LENGTH"] => _ENV["PHP_TEST_EMAIL"] => novell@kiruna.se _ENV["LOGNAME"] => root _ENV["LESS"] => -r _ENV["QUERY_STRING"] => _ENV["CVS_RSH"] => ssh _ENV["CLASSPATH"] => /opt/blackdown-jdk-1.4.1_beta/jre/lib/rt.jar:. _ENV["LESSOPEN"] => |lesspipe.sh %s _ENV["VIMRUNTIME"] => /usr/share/vim/vim61 _ENV["INFOPATH"] => /usr/share/info:/usr/share/gcc-data/i686-pc-linux-gnu/3.2/info _ENV["CONTENT_TYPE"] => _ENV["DISPLAY"] => :0.0 _ENV["CC"] => gcc _ENV["REQUEST_METHOD"] => _ENV["CONFIG_PROTECT"] => /usr/kde/3.1/share/config /usr/kde/3/share/config /opt/glftpd/etc /usr/share/config PHP License This program is free software; you can redistribute it and/or modify it under the terms of the PHP License as published by the PHP Group and included in the distribution in the file: LICENSE This program is distributed in the hope that it will be useful, but WITHOUT ANY WARRANTY; without even the implied warranty of MERCHANTABILITY or FITNESS FOR A PARTICULAR PURPOSE. If you did not receive a copy of the PHP license, or have any questions about PHP licensing, please contact license@php.net.

« previous php.qa (#8288) next »