Test results [failed]
| From: | noreply@php.net | Date: | Mon, 20 Jan 2003 23:03:32 +0000 |
| Subject: | Test results [failed] | ||
| Groups: | php.qa | ||
| Request: | Send a blank email to php-qa+get-8296@lists.php.net to get a copy of this message | ||
=====================================================================
FAILED TEST SUMMARY
---------------------------------------------------------------------
Locale settings affecting float parsing [tests/lang/034.phpt]
Bug #20175 (Static vars can't store ref to new instance) [tests/lang/bug20175.phpt]
Bug #21600 (assign by reference function call changes variable contents) [tests/lang/bug21600.phpt]
GMP functionality test - factorial [ext/gmp/tests/002.phpt]
session object deserialization [ext/session/tests/003.phpt]
session_set_save_handler test [ext/session/tests/004.phpt]
custom save handler, multiple session_start()s, complex data structure test.
[ext/session/tests/005.phpt]
aggregating everything [ext/standard/tests/aggregation/aggregate.phpt]
aggregating all methods [ext/standard/tests/aggregation/aggregate_methods.phpt]
aggregating methods specified in the list
[ext/standard/tests/aggregation/aggregate_methods_by_list.phpt]
aggregating methods matching regular expression
[ext/standard/tests/aggregation/aggregate_methods_by_regexp.phpt]
File type functions [ext/standard/tests/file/001.phpt]
=====================================================================
=====================================================================
TEST RESULT SUMMARY
---------------------------------------------------------------------
Exts skipped : 68
Exts tested : 17
---------------------------------------------------------------------
Number of tests : 467
Tests skipped : 171 (36.6%)
Tests failed : 12 ( 2.6%)
Tests passed : 284 (60.8%)
---------------------------------------------------------------------
Time taken : 245 seconds
=====================================================================
================================================================================
/Users/imac/bin/php5-200301181230/tests/lang/034.phpt
================================================================================
---- EXPECTED OUTPUT
3,14
---- ACTUAL OUTPUT
3.14
---- FAILED
================================================================================
001- 3,14
001+ 3.14
================================================================================
================================================================================
/Users/imac/bin/php5-200301181230/tests/lang/bug20175.phpt
================================================================================
---- EXPECTED OUTPUT
%s
foo_static()
foo_global()
foo:1
foo_static()
foo:1
bar_static()
bar_global()
bar:1
bar_static()
bar_global()
bar:2
wow_static()
wow_global()
wow:1
wow_static()
wow:1
oop_test()
oop_static()
oop_class()
oop:1
oop_static()
oop:1
oop_test()
oop_static()
oop:1
---- ACTUAL OUTPUT
Parse error: parse error, expecting `'('' in
/Users/imac/bin/php5-200301181230/tests/lang/bug20175.php on line 109
---- FAILED
================================================================================
001- %s
001+ Parse error: parse error, expecting `'('' in
/Users/imac/bin/php5-200301181230/tests/lang/bug20175.php on line 109
002- foo_static()
003- foo_global()
004- foo:1
005- foo_static()
006- foo:1
007- bar_static()
008- bar_global()
009- bar:1
010- bar_static()
011- bar_global()
012- bar:2
013- wow_static()
014- wow_global()
015- wow:1
016- wow_static()
017- wow:1
018- oop_test()
019- oop_static()
020- oop_class()
021- oop:1
022- oop_static()
023- oop:1
024- oop_test()
025- oop_static()
026- oop:1
================================================================================
================================================================================
/Users/imac/bin/php5-200301181230/tests/lang/bug21600.phpt
================================================================================
---- EXPECTED OUTPUT
array(1) {
["foo"]=>
string(4) "test"
}
---- ACTUAL OUTPUT
array(1) {
["foo"]=>
&string(4) "test"
}
---- FAILED
================================================================================
003- string(4) "test"
003+ &string(4) "test"
================================================================================
================================================================================
/Users/imac/bin/php5-200301181230/ext/gmp/tests/002.phpt
================================================================================
---- EXPECTED OUTPUT
402387260077093773543702433923003985719374864210714632543799910429938512398629020592044208486969404800479988610197196058631666872994808558901323829669944590997424504087073759918823627727188732519779505950995276120874975462497043601418278094646496291056393887437886487337119181045825783647849977012476632889835955735432513185323958463075557409114262417474349347553428646576611667797396668820291207379143853719588249808126867838374559731746136085379534524221586593201928090878297308431392844403281231558611036976801357304216168747609675871348312025478589320767169132448426236131412508780208000261683151027341827977704784635868170164365024153691398281264810213092761244896359928705114964975419909342221566832572080821333186116811553615836546984046708975602900950537616475847728421889679646244945160765353408198901385442487984959953319101723355556602139450399736280750137837615307127761926849034352625200015888535147331611702103968175921510907788019393178114194545257223865541461062892187960223838971476088506276862967146674697562911234082439208160153780889893964518263243671616762179168909779911903754031274622289988005195444414282012187361745992642956581746628302955570299024324153181617210465832036786906117260158783520751516284225540265170483304226143974286933061690897968482590125458327168226458066526769958652682272807075781391858178889652208164348344825993266043367660176999612831860788386150279465955131156552036093988180612138558600301435694527224206344631797460594682573103790084024432438465657245014402821885252470935190620929023136493273497565513958720559654228749774011413346962715422845862377387538230483865688976461927383814900140767310446640259899490222221765904339901886018566526485061799702356193897017860040811889729918311021171229845901641921068884387121855646124960798722908519296819372388642614839657382291123125024186649353143970137428531926649875337218940694281434118520158014123344828015051399694290153483077644569099073152433278288269864602789864321139083506217095002597389863554277196742822248757586765752344220207573630569498825087968928162753848863396909959826280956121450994871701244516461260379029309120889086942028510640182154399457156805941872748998094254742173582401063677404595741785160829230135358081840096996372524230560855903700624271243416909004153690105933983835777939410970027753472000000000000000000000000000000000000000000000000000000000000000000000000000000000000000000000000000000000000000000000000000000000000000000000000000000000000000000000000000000000000000000000000000000000000000000000000000000000000000000000000000000000
---- ACTUAL OUTPUT
---- FAILED
================================================================================
001-
402387260077093773543702433923003985719374864210714632543799910429938512398629020592044208486969404800479988610197196058631666872994808558901323829669944590997424504087073759918823627727188732519779505950995276120874975462497043601418278094646496291056393887437886487337119181045825783647849977012476632889835955735432513185323958463075557409114262417474349347553428646576611667797396668820291207379143853719588249808126867838374559731746136085379534524221586593201928090878297308431392844403281231558611036976801357304216168747609675871348312025478589320767169132448426236131412508780208000261683151027341827977704784635868170164365024153691398281264810213092761244896359928705114964975419909342221566832572080821333186116811553615836546984046708975602900950537616475847728421889679646244945160765353408198901385442487984959953319101723355556602139450399736280750137837615307127761926849034352625200015888535147331611702103968175921510907788019393178114194545257223865541461062892187960223838971476088506276862967146674697562911234082439208160153780889893964518263243671616762179168909779911903754031274622289988005195444414282012187361745992642956581746628302955570299024324153181617210465832036786906117260158783520751516284225540265170483304226143974286933061690897968482590125458327168226458066526769958652682272807075781391858178889652208164348344825993266043367660176999612831860788386150279465955131156552036093988180612138558600301435694527224206344631797460594682573103790084024432438465657245014402821885252470935190620929023136493273497565513958720559654228749774011413346962715422845862377387538230483865688976461927383814900140767310446640259899490222221765904339901886018566526485061799702356193897017860040811889729918311021171229845901641921068884387121855646124960798722908519296819372388642614839657382291123125024186649353143970137428531926649875337218940694281434118520158014123344828015051399694290153483077644569099073152433278288269864602789864321139083506217095002597389863554277196742822248757586765752344220207573630569498825087968928162753848863396909959826280956121450994871701244516461260379029309120889086942028510640182154399457156805941872748998094254742173582401063677404595741785160829230135358081840096996372524230560855903700624271243416909004153690105933983835777939410970027753472000000000000000000000000000000000000000000000000000000000000000000000000000000000000000000000000000000000000000000000000000000000000000000000000000000000000000000000000000000000000000000000000000000000000000000000000000000000000000000000000000000000
001+
================================================================================
================================================================================
/Users/imac/bin/php5-200301181230/ext/session/tests/003.phpt
================================================================================
---- EXPECTED OUTPUT
object(foo)(2) {
["bar"]=>
string(2) "ok"
["yes"]=>
int(2)
}
array(1) {
[3]=>
&object(foo)(2) {
["bar"]=>
string(2) "ok"
["yes"]=>
int(2)
}
}
---- ACTUAL OUTPUT
object(foo)(2) {
["bar"]=>
string(2) "ok"
["yes"]=>
int(2)
}
array(1) {
[3]=>
object(foo)(2) {
["bar"]=>
string(2) "ok"
["yes"]=>
int(2)
}
}
---- FAILED
================================================================================
009- &object(foo)(2) {
009+ object(foo)(2) {
================================================================================
================================================================================
/Users/imac/bin/php5-200301181230/ext/session/tests/004.phpt
================================================================================
---- EXPECTED OUTPUT
OPEN: PHPSESSID
READ: abtest
object(foo)(2) {
["bar"]=>
string(2) "ok"
["yes"]=>
int(2)
}
array(1) {
[3]=>
&object(foo)(2) {
["bar"]=>
string(2) "ok"
["yes"]=>
int(2)
}
}
WRITE: abtest,
baz|O:3:"foo":2:{s:3:"bar";s:2:"ok";s:3:"yes";i:2;}arr|a:1:{i:3;O:3:"foo":2:{s:3:"bar";s:2:"ok";s:3:"yes";i:2;}}
OPEN: PHPSESSID
READ: abtest
object(foo)(2) {
["bar"]=>
string(2) "ok"
["yes"]=>
int(2)
}
array(1) {
[3]=>
object(foo)(2) {
["bar"]=>
string(2) "ok"
["yes"]=>
int(2)
}
}
DESTROY: abtest
---- ACTUAL OUTPUT
OPEN: PHPSESSID
READ: abtest
object(foo)(2) {
["bar"]=>
string(2) "ok"
["yes"]=>
int(2)
}
array(1) {
[3]=>
object(foo)(2) {
["bar"]=>
string(2) "ok"
["yes"]=>
int(2)
}
}
WRITE: abtest,
baz|O:3:"foo":2:{s:3:"bar";s:2:"ok";s:3:"yes";i:2;}arr|a:1:{i:3;O:3:"foo":2:{s:3:"bar";s:2:"ok";s:3:"yes";i:2;}}
OPEN: PHPSESSID
READ: abtest
object(foo)(2) {
["bar"]=>
string(2) "ok"
["yes"]=>
int(2)
}
array(1) {
[3]=>
object(foo)(2) {
["bar"]=>
string(2) "ok"
["yes"]=>
int(2)
}
}
DESTROY: abtest
---- FAILED
================================================================================
011- &object(foo)(2) {
011+ object(foo)(2) {
================================================================================
================================================================================
/Users/imac/bin/php5-200301181230/ext/session/tests/005.phpt
================================================================================
---- EXPECTED OUTPUT
OPEN: PHPSESSID
READ: abtest
object(foo)(2) {
["bar"]=>
string(2) "ok"
["yes"]=>
int(2)
}
array(1) {
[3]=>
&object(foo)(2) {
["bar"]=>
string(2) "ok"
["yes"]=>
int(2)
}
}
WRITE: abtest,
baz|O:3:"foo":2:{s:3:"bar";s:2:"ok";s:3:"yes";i:2;}arr|a:1:{i:3;O:3:"foo":2:{s:3:"bar";s:2:"ok";s:3:"yes";i:2;}}
CLOSE
OPEN: PHPSESSID
READ: abtest
object(foo)(2) {
["bar"]=>
string(2) "ok"
["yes"]=>
int(3)
}
array(1) {
[3]=>
&object(foo)(2) {
["bar"]=>
string(2) "ok"
["yes"]=>
int(3)
}
}
int(123)
WRITE: abtest,
baz|O:3:"foo":2:{s:3:"bar";s:2:"ok";s:3:"yes";i:3;}arr|a:1:{i:3;O:3:"foo":2:{s:3:"bar";s:2:"ok";s:3:"yes";i:3;}}c|i:123;
CLOSE
OPEN: PHPSESSID
READ: abtest
object(foo)(2) {
["bar"]=>
string(2) "ok"
["yes"]=>
int(3)
}
array(1) {
[3]=>
object(foo)(2) {
["bar"]=>
string(2) "ok"
["yes"]=>
int(3)
}
}
int(123)
DESTROY: abtest
CLOSE
---- ACTUAL OUTPUT
OPEN: PHPSESSID
READ: abtest
object(foo)(2) {
["bar"]=>
string(2) "ok"
["yes"]=>
int(2)
}
array(1) {
[3]=>
object(foo)(2) {
["bar"]=>
string(2) "ok"
["yes"]=>
int(2)
}
}
WRITE: abtest,
baz|O:3:"foo":2:{s:3:"bar";s:2:"ok";s:3:"yes";i:2;}arr|a:1:{i:3;O:3:"foo":2:{s:3:"bar";s:2:"ok";s:3:"yes";i:2;}}
CLOSE
OPEN: PHPSESSID
READ: abtest
object(foo)(2) {
["bar"]=>
string(2) "ok"
["yes"]=>
int(3)
}
array(1) {
[3]=>
object(foo)(2) {
["bar"]=>
string(2) "ok"
["yes"]=>
int(3)
}
}
int(123)
WRITE: abtest,
baz|O:3:"foo":2:{s:3:"bar";s:2:"ok";s:3:"yes";i:3;}arr|a:1:{i:3;O:3:"foo":2:{s:3:"bar";s:2:"ok";s:3:"yes";i:3;}}c|i:123;
CLOSE
OPEN: PHPSESSID
READ: abtest
object(foo)(2) {
["bar"]=>
string(2) "ok"
["yes"]=>
int(3)
}
array(1) {
[3]=>
object(foo)(2) {
["bar"]=>
string(2) "ok"
["yes"]=>
int(3)
}
}
int(123)
DESTROY: abtest
CLOSE
---- FAILED
================================================================================
011- &object(foo)(2) {
011+ object(foo)(2) {
030- &object(foo)(2) {
030+ object(foo)(2) {
================================================================================
================================================================================
/Users/imac/bin/php5-200301181230/ext/standard/tests/aggregation/aggregate.phpt
================================================================================
---- EXPECTED OUTPUT
I'm alive!
I'm helping!
I'm aggregating!
****
---- ACTUAL OUTPUT
I'm alive!
Fatal error: Call to undefined function do_this() in
/Users/imac/bin/php5-200301181230/ext/standard/tests/aggregation/aggregate.php on line 7
---- FAILED
================================================================================
002- I'm helping!
002+
003- I'm aggregating!
003+ Fatal error: Call to undefined function do_this() in
/Users/imac/bin/php5-200301181230/ext/standard/tests/aggregation/aggregate.php on line 7
004- ****
================================================================================
================================================================================
/Users/imac/bin/php5-200301181230/ext/standard/tests/aggregation/aggregate_methods.phpt
================================================================================
---- EXPECTED OUTPUT
I'm alive!
mixing
100
simple,mix_it
simple_prop
mixing
---- ACTUAL OUTPUT
I'm alive!
Fatal error: Call to undefined function mix_it() in
/Users/imac/bin/php5-200301181230/ext/standard/tests/aggregation/aggregate_methods.php on line 6
---- FAILED
================================================================================
002- mixing
002+
003- 100
003+ Fatal error: Call to undefined function mix_it() in
/Users/imac/bin/php5-200301181230/ext/standard/tests/aggregation/aggregate_methods.php on line 6
004- simple,mix_it
005- simple_prop
006- mixing
================================================================================
================================================================================
/Users/imac/bin/php5-200301181230/ext/standard/tests/aggregation/aggregate_methods_by_list.phpt
================================================================================
---- EXPECTED OUTPUT
I'm alive!
simple,just_another_method
I'm alive!
simple,do_this,do_that
yep, that's me
---- ACTUAL OUTPUT
I'm alive!
simple
I'm alive!
simple
Fatal error: Call to undefined function just_another_method() in
/Users/imac/bin/php5-200301181230/ext/standard/tests/aggregation/aggregate_methods_by_list.php on
line 10
---- FAILED
================================================================================
002- simple,just_another_method
002+ simple
004- simple,do_this,do_that
004+ simple
005- yep, that's me
005+
006+ Fatal error: Call to undefined function just_another_method() in
/Users/imac/bin/php5-200301181230/ext/standard/tests/aggregation/aggregate_methods_by_list.php on
line 10
================================================================================
================================================================================
/Users/imac/bin/php5-200301181230/ext/standard/tests/aggregation/aggregate_methods_by_regexp.phpt
================================================================================
---- EXPECTED OUTPUT
I'm alive!
simple,do_this,do_that
I'm alive!
simple,just_another_method
---- ACTUAL OUTPUT
I'm alive!
simple
I'm alive!
simple
---- FAILED
================================================================================
002- simple,do_this,do_that
002+ simple
004- simple,just_another_method
004+ simple
================================================================================
================================================================================
/Users/imac/bin/php5-200301181230/ext/standard/tests/file/001.phpt
================================================================================
---- EXPECTED OUTPUT
test.file does not exist
test.file exists
test.link exists
test.file is not a symlink
test.link is a symlink
test.file exists
test.link lstat and stat differ at element 1
test.link lstat and stat differ at element 2
test.link lstat and stat differ at element 7
test.link lstat and stat differ at element 8
test.link lstat and stat differ at element 9
test.link lstat and stat differ at element 10
test.file is file
test.link is link
test.file permissions are 0744
test.file size is 0
test.file is writeable
test.file is readable
test.file is executable
test.file is a regular file
test.link is a regular file
test.link is not a directory
../file is a directory
test.file is not a directory
test.file does not exist
test.file does not exist
---- ACTUAL OUTPUT
test.file does not exist
test.file exists
test.link exists
test.file is not a symlink
test.link is a symlink
test.file exists
test.link lstat and stat differ at element 1
test.link lstat and stat differ at element 2
test.link lstat and stat differ at element 7
test.link lstat and stat differ at element 8
test.link lstat and stat differ at element 9
test.file is file
test.link is link
test.file permissions are 0744
test.file size is 0
test.file is writeable
test.file is readable
test.file is executable
test.file is a regular file
test.link is a regular file
test.link is not a directory
../file is a directory
test.file is not a directory
test.file does not exist
test.file does not exist
---- FAILED
================================================================================
012- test.link lstat and stat differ at element 10
012+ test.file is file
013- test.file is file
013+ test.link is link
014- test.link is link
014+ test.file permissions are 0744
015- test.file permissions are 0744
015+ test.file size is 0
016- test.file size is 0
016+ test.file is writeable
017- test.file is writeable
017+ test.file is readable
018- test.file is readable
018+ test.file is executable
019- test.file is executable
019+ test.file is a regular file
020- test.file is a regular file
020+ test.link is a regular file
021- test.link is a regular file
021+ test.link is not a directory
022- test.link is not a directory
022+ ../file is a directory
023- ../file is a directory
023+ test.file is not a directory
024- test.file is not a directory
024+ test.file does not exist
026- test.file does not exist
================================================================================
================================================================================
BUILD ENVIRONMENT
================================================================================
OS:
Darwin
Automake:
automake (GNU automake) 1.6.1
Written by Tom Tromey <tromey@redhat.com>.
Copyright 2002 Free Software Foundation, Inc.
This is free software; see the source for copying conditions. There is NO
warranty; not even for MERCHANTABILITY or FITNESS FOR A PARTICULAR PURPOSE.
Autoconf:
autoconf (GNU Autoconf) 2.52
Written by David J. MacKenzie.
Copyright 1992, 1993, 1994, 1996, 1999, 2000, 2001
Free Software Foundation, Inc.
This is free software; see the source for copying conditions. There is NO
warranty; not even for MERCHANTABILITY or FITNESS FOR A PARTICULAR PURPOSE.
Libtool:
ltmain.sh (GNU libtool) 1.4.2 (1.922.2.53 2001/09/11 03:18:52)
Compiler:
Reading specs from /usr/libexec/gcc/darwin/ppc/3.1/specs
Thread model: posix
Apple Computer, Inc. GCC version 1161, based on gcc version 3.1 20020420 (prerelease)
Bison:
GNU Bison version 1.28
User's E-mail: dams at php dot net
================================================================================
PHPINFO
================================================================================
phpinfo()
PHP Version => 5.0.0-dev
System => Darwin iMac.local. 6.3 Darwin Kernel Version 6.3: Sat Dec 14 03:11:25 PST 2002;
root:xnu/xnu-344.23.obj~4/RELEASE_PPC Power Macintosh
Build Date => Jan 18 2003 17:29:35
Configure Command => './configure' '--prefix=/usr' '--with-curl'
'--enable-ftp' '--enable-wddx' '--enable-exif' '--with-gmp'
'--enable-trans-sid' '--enable-mbstring' '--enable-mbstr-enc-trans'
'--enable-dbx' '--enable-dbase' '--enable-sockets'
Server API => Command Line Interface
Virtual Directory Support => disabled
Configuration File (php.ini) Path => /usr/lib
PHP API => 20020918
PHP Extension => 20020429
Zend Extension => 90021012
Debug Build => no
Thread Safety => disabled
Registered PHP Streams => php, http, ftp
This program makes use of the Zend Scripting Language Engine:
Zend Engine v2.0.0-dev, Copyright (c) 1998-2003 Zend Technologies
_______________________________________________________________________
Configuration
PHP Core
Directive => Local Value => Master Value
allow_call_time_pass_reference => On => On
allow_url_fopen => On => On
always_populate_raw_post_data => Off => Off
arg_separator.input => & => &
arg_separator.output => & => &
asp_tags => Off => Off
auto_append_file => no value => no value
auto_prepend_file => no value => no value
browscap => no value => no value
default_charset => no value => no value
default_mimetype => text/html => text/html
define_syslog_variables => Off => Off
disable_functions => no value => no value
display_errors => On => On
display_startup_errors => Off => Off
doc_root => no value => no value
docref_ext => no value => no value
docref_root => http://www.php.net/ => http://www.php.net/
enable_dl => On => On
error_append_string => no value => no value
error_log => no value => no value
error_prepend_string => no value => no value
error_reporting => no value => no value
expose_php => On => On
extension_dir => /usr/lib/php/extensions/no-debug-non-zts-20020429 =>
/usr/lib/php/extensions/no-debug-non-zts-20020429
file_uploads => On => On
gpc_order => GPC => GPC
highlight.bg => #FFFFFF => #FFFFFF
highlight.comment => #FF8000 => #FF8000
highlight.default => #0000BB => #0000BB
highlight.html => #000000 => #000000
highlight.keyword => #007700 => #007700
highlight.string => #DD0000 => #DD0000
html_errors => Off => On
ignore_repeated_errors => Off => Off
ignore_repeated_source => Off => Off
ignore_user_abort => Off => Off
implicit_flush => On => Off
include_path => .:/usr/lib/php => .:/usr/lib/php
log_errors => Off => Off
log_errors_max_len => 1024 => 1024
magic_quotes_gpc => On => On
magic_quotes_runtime => Off => Off
magic_quotes_sybase => Off => Off
max_execution_time => 0 => 30
max_input_time => -1 => -1
open_basedir => no value => no value
output_buffering => 0 => 0
output_handler => no value => no value
post_max_size => 8M => 8M
precision => 14 => 14
register_argc_argv => On => On
register_globals => Off => Off
report_memleaks => On => On
report_zend_debug => On => On
safe_mode => Off => Off
safe_mode_exec_dir => 1 => 1
safe_mode_gid => Off => Off
safe_mode_include_dir => no value => no value
sendmail_from => no value => no value
sendmail_path => /usr/sbin/sendmail -t -i => /usr/sbin/sendmail -t -i
short_open_tag => On => On
SMTP => localhost => localhost
smtp_port => 25 => 25
sql.safe_mode => Off => Off
track_errors => Off => Off
unserialize_callback_func => no value => no value
upload_max_filesize => 2M => 2M
upload_tmp_dir => no value => no value
user_dir => no value => no value
variables_order => no value => no value
xmlrpc_error_number => 0 => 0
xmlrpc_errors => Off => Off
y2k_compliance => On => On
zend2.implicit_clone => no value => no value
ctype
ctype functions => enabled
curl
CURL support => enabled
CURL Information => libcurl/7.10.2 OpenSSL/0.9.6e ipv6 zlib/1.1.3
dbx
dbx support => enabled
dbx version => 1.0.0
supported databases => MySQL
ODBC
PostgreSQL
Microsoft SQL Server
FrontBase
Oracle 8 (oci8)
Sybase-CT
Directive => Local Value => Master Value
dbx.colnames_case => unchanged => unchanged
exif
EXIF Support => enabled
EXIF Version => 1.4 $Id: exif.c,v 1.137 2002/12/31 16:06:32 sebastian Exp $
Supported EXIF Version => 0220
Supported filetypes => JPEG,TIFF
ftp
FTP support => enabled
gmp
gmp support => enabled
mbstring
Multibyte Support => enabled
Japanese support => enabled
Multibyte (japanese) regex support => enabled
Directive => Local Value => Master Value
mbstring.detect_order => no value => no value
mbstring.encoding_translation => Off => Off
mbstring.func_overload => 0 => 0
mbstring.http_input => pass => pass
mbstring.http_output => pass => pass
mbstring.internal_encoding => none => none
mbstring.language => neutral => neutral
mbstring.substitute_character => no value => no value
mysql
MySQL Support => enabled
Active Persistent Links => 0
Active Links => 0
Client API version => 3.23.49
MYSQL_MODULE_TYPE => builtin
MYSQL_SOCKET => /tmp/mysql.sock
MYSQL_INCLUDE =>
MYSQL_LIBS =>
Directive => Local Value => Master Value
mysql.allow_persistent => On => On
mysql.connect_timeout => -1 => -1
mysql.default_host => no value => no value
mysql.default_password => no value => no value
mysql.default_port => no value => no value
mysql.default_socket => no value => no value
mysql.default_user => no value => no value
mysql.max_links => Unlimited => Unlimited
mysql.max_persistent => Unlimited => Unlimited
mysql.trace_mode => Off => Off
pcre
PCRE (Perl Compatible Regular Expressions) Support => enabled
PCRE Library Version => 3.92 11-Sep-2002
posix
Revision => $Revision: 1.52 $
session
Session Support => enabled
Registered save handlers => files user
Directive => Local Value => Master Value
session.auto_start => Off => Off
session.bug_compat_42 => On => On
session.bug_compat_warn => On => On
session.cache_expire => 180 => 180
session.cache_limiter => nocache => nocache
session.cookie_domain => no value => no value
session.cookie_lifetime => 0 => 0
session.cookie_path => / => /
session.cookie_secure => Off => Off
session.entropy_file => no value => no value
session.entropy_length => 0 => 0
session.gc_dividend => 100 => 100
session.gc_maxlifetime => 1440 => 1440
session.gc_probability => 1 => 1
session.hash_bits_per_character => 4 => 4
session.hash_function => 0 => 0
session.name => PHPSESSID => PHPSESSID
session.referer_check => no value => no value
session.save_handler => files => files
session.save_path => /tmp => /tmp
session.serialize_handler => php => php
session.use_cookies => On => On
session.use_only_cookies => Off => Off
session.use_trans_sid => Off => Off
sockets
Sockets Support => enabled
standard
Regex Library => Bundled library enabled
Dynamic Library Support => enabled
Path to sendmail => /usr/sbin/sendmail -t -i
Directive => Local Value => Master Value
assert.active => 1 => 1
assert.bail => 0 => 0
assert.callback => no value => no value
assert.quiet_eval => 0 => 0
assert.warning => 1 => 1
auto_detect_line_endings => 0 => 0
default_socket_timeout => 60 => 60
safe_mode_allowed_env_vars => PHP_ => PHP_
safe_mode_protected_env_vars => LD_LIBRARY_PATH => LD_LIBRARY_PATH
url_rewriter.tags => a=href,area=href,frame=src,form=,fieldset= =>
a=href,area=href,frame=src,form=,fieldset=
user_agent => no value => no value
tokenizer
Tokenizer Support => enabled
wddx
WDDX Support => enabled
WDDX Session Serializer => enabled
xml
XML Support => active
XML Namespace Support => active
EXPAT Version => 1.95.5
Additional Modules
Module Name
dbase
Environment
Variable => Value
PWD => /Users/imac/bin/php5-200301181230
MAKEFLAGS =>
VENDOR => apple
MFLAGS =>
REDIRECT_STATUS =>
TEST_PHP_EXECUTABLE => /Users/imac/bin/php5-200301181230/sapi/cli/php
TERM_PROGRAM => Apple_Terminal
CC => gcc
USER => imac
MACHTYPE => powerpc
SCRIPT_FILENAME =>
PATH_TRANSLATED =>
TERMCAP => ¿ÿØ
LANG => fr_FR
QUERY_STRING =>
CONTENT_LENGTH =>
HOST => iMac.local.
MAKELEVEL => 1
SSH_CLIENT => deleted
SHLVL => 3
LOGNAME => imac
GROUP => staff
_ => /Users/imac/bin/php5-200301181230/sapi/cli/php
REQUEST_METHOD =>
SHELL => /bin/sh
HOSTTYPE => macintosh
TEST_PHP_SRCDIR => /Users/imac/bin/php5-200301181230
OSTYPE => darwin
TERM => vt100
HOME => /Users/imac
TERM_PROGRAM_VERSION => 81
SSH_AUTH_SOCK => deleted
PATH => /bin:/sbin:/usr/bin:/usr/sbin
__CF_USER_TEXT_ENCODING => 0x1F5:0:1
SSH_TTY => deleted
CONTENT_TYPE =>
PHP Variables
Variable => Value
_SERVER["PWD"] => /Users/imac/bin/php5-200301181230
_SERVER["MAKEFLAGS"] =>
_SERVER["VENDOR"] => apple
_SERVER["MFLAGS"] =>
_SERVER["REDIRECT_STATUS"] =>
_SERVER["TEST_PHP_EXECUTABLE"] => /Users/imac/bin/php5-200301181230/sapi/cli/php
_SERVER["TERM_PROGRAM"] => Apple_Terminal
_SERVER["CC"] => gcc
_SERVER["USER"] => imac
_SERVER["MACHTYPE"] => powerpc
_SERVER["SCRIPT_FILENAME"] =>
_SERVER["PATH_TRANSLATED"] =>
_SERVER["TERMCAP"] => ¿ÿØ
_SERVER["LANG"] => fr_FR
_SERVER["QUERY_STRING"] =>
_SERVER["CONTENT_LENGTH"] =>
_SERVER["HOST"] => iMac.local.
_SERVER["MAKELEVEL"] => 1
_SERVER["SSH_CLIENT"] => deleted
_SERVER["SHLVL"] => 3
_SERVER["LOGNAME"] => imac
_SERVER["GROUP"] => staff
_SERVER["_"] => /Users/imac/bin/php5-200301181230/sapi/cli/php
_SERVER["REQUEST_METHOD"] =>
_SERVER["SHELL"] => /bin/sh
_SERVER["HOSTTYPE"] => macintosh
_SERVER["TEST_PHP_SRCDIR"] => /Users/imac/bin/php5-200301181230
_SERVER["OSTYPE"] => darwin
_SERVER["TERM"] => vt100
_SERVER["HOME"] => /Users/imac
_SERVER["TERM_PROGRAM_VERSION"] => 81
_SERVER["SSH_AUTH_SOCK"] => deleted
_SERVER["PATH"] => /bin:/sbin:/usr/bin:/usr/sbin
_SERVER["__CF_USER_TEXT_ENCODING"] => 0x1F5:0:1
_SERVER["SSH_TTY"] => deleted
_SERVER["CONTENT_TYPE"] =>
_SERVER["PHP_SELF"] =>
_SERVER["SCRIPT_NAME"] =>
_SERVER["DOCUMENT_ROOT"] =>
_SERVER["argv"] => Array
(
)
_SERVER["argc"] => 0
_ENV["PWD"] => /Users/imac/bin/php5-200301181230
_ENV["MAKEFLAGS"] =>
_ENV["VENDOR"] => apple
_ENV["MFLAGS"] =>
_ENV["REDIRECT_STATUS"] =>
_ENV["TEST_PHP_EXECUTABLE"] => /Users/imac/bin/php5-200301181230/sapi/cli/php
_ENV["TERM_PROGRAM"] => Apple_Terminal
_ENV["CC"] => gcc
_ENV["USER"] => imac
_ENV["MACHTYPE"] => powerpc
_ENV["SCRIPT_FILENAME"] =>
_ENV["PATH_TRANSLATED"] =>
_ENV["TERMCAP"] => ¿ÿØ
_ENV["LANG"] => fr_FR
_ENV["QUERY_STRING"] =>
_ENV["CONTENT_LENGTH"] =>
_ENV["HOST"] => iMac.local.
_ENV["MAKELEVEL"] => 1
_ENV["SSH_CLIENT"] => deleted
_ENV["SHLVL"] => 3
_ENV["LOGNAME"] => imac
_ENV["GROUP"] => staff
_ENV["_"] => /Users/imac/bin/php5-200301181230/sapi/cli/php
_ENV["REQUEST_METHOD"] =>
_ENV["SHELL"] => /bin/sh
_ENV["HOSTTYPE"] => macintosh
_ENV["TEST_PHP_SRCDIR"] => /Users/imac/bin/php5-200301181230
_ENV["OSTYPE"] => darwin
_ENV["TERM"] => vt100
_ENV["HOME"] => /Users/imac
_ENV["TERM_PROGRAM_VERSION"] => 81
_ENV["SSH_AUTH_SOCK"] => deleted
_ENV["PATH"] => /bin:/sbin:/usr/bin:/usr/sbin
_ENV["__CF_USER_TEXT_ENCODING"] => 0x1F5:0:1
_ENV["SSH_TTY"] => deleted
_ENV["CONTENT_TYPE"] =>
PHP License
This program is free software; you can redistribute it and/or modify
it under the terms of the PHP License as published by the PHP Group
and included in the distribution in the file: LICENSE
This program is distributed in the hope that it will be useful,
but WITHOUT ANY WARRANTY; without even the implied warranty of
MERCHANTABILITY or FITNESS FOR A PARTICULAR PURPOSE.
If you did not receive a copy of the PHP license, or have any
questions about PHP licensing, please contact license@php.net.