Test results [failed]

From: Date: Tue, 21 Jan 2003 08:25:48 +0000
Subject: Test results [failed]
Groups: php.qa 
Request: Send a blank email to php-qa+get-8300@lists.php.net to get a copy of this message
===================================================================== FAILED TEST SUMMARY --------------------------------------------------------------------- Output buffering tests [tests/func/006.phpt] Bug #20175 (Static vars can't store ref to new instance) [tests/lang/bug20175.phpt] Bug #21094 (set_error_handler not accepting methods) [tests/lang/bug21094.phpt] Bug #21600 (assign by reference function call changes variable contents) [tests/lang/bug21600.phpt] Formatted print functions [tests/strings/002.phpt] Test pcntl wait functionality [ext/pcntl/tests/001.phpt] PostgreSQL notice function [ext/pgsql/tests/09notice.phpt] session object deserialization [ext/session/tests/003.phpt] session_set_save_handler test [ext/session/tests/004.phpt] custom save handler, multiple session_start()s, complex data structure test. [ext/session/tests/005.phpt] bug compatibility: global is used albeit register_globals=0 [ext/session/tests/008-php4.2.3.phpt] unset($_SESSION["name"]); should work with register_globals=off [ext/session/tests/009.phpt] redefining SID should not cause warnings [ext/session/tests/013.phpt] a script should not be able to modify session.use_trans_sid [ext/session/tests/014.phpt] use_trans_sid should not affect SID [ext/session/tests/015.phpt] rewriter correctly handles attribute names which contain dashes [ext/session/tests/018.phpt] serializing references test case using globals [ext/session/tests/019.phpt] rewriter uses arg_seperator.output for modifying URLs [ext/session/tests/020.phpt] rewriter handles form and fieldset tags correctly [ext/session/tests/021.phpt] aggregating everything [ext/standard/tests/aggregation/aggregate.phpt] aggregating all methods [ext/standard/tests/aggregation/aggregate_methods.phpt] aggregating methods specified in the list [ext/standard/tests/aggregation/aggregate_methods_by_list.phpt] aggregating methods matching regular expression [ext/standard/tests/aggregation/aggregate_methods_by_regexp.phpt] Bug #21744 (strip_tags misses exclamation marks in alt text) [ext/standard/tests/strings/bug21744.phpt] ===================================================================== ===================================================================== TEST RESULT SUMMARY --------------------------------------------------------------------- Exts skipped : 88 Exts tested : 19 --------------------------------------------------------------------- Number of tests : 470 Tests skipped : 194 (41.3%) Tests failed : 24 ( 5.1%) Tests passed : 252 (53.6%) --------------------------------------------------------------------- Time taken : 20 seconds ===================================================================== ================================================================================ /usr/src/php4/tests/func/006.phpt ================================================================================ ---- EXPECTED OUTPUT string(2) "2B" string(2) "1A" ---- ACTUAL OUTPUT string(2) "3B" string(2) "2A" ---- FAILED ================================================================================ 001- string(2) "2B" 001+ string(2) "3B" 002- string(2) "1A" 002+ string(2) "2A" ================================================================================ ================================================================================ /usr/src/php4/tests/lang/bug20175.phpt ================================================================================ ---- EXPECTED OUTPUT %s foo_static() foo_global() foo:1 foo_static() foo:1 bar_static() bar_global() bar:1 bar_static() bar_global() bar:2 wow_static() wow_global() wow:1 wow_static() wow:1 oop_test() oop_static() oop_class() oop:1 oop_static() oop:1 oop_test() oop_static() oop:1 ---- ACTUAL OUTPUT Parse error: parse error, unexpected ')', expecting '(' in /usr/src/php4/tests/lang/bug20175.php on line 109 ---- FAILED ================================================================================ 001- %s 001+ Parse error: parse error, unexpected ')', expecting '(' in /usr/src/php4/tests/lang/bug20175.php on line 109 002- foo_static() 003- foo_global() 004- foo:1 005- foo_static() 006- foo:1 007- bar_static() 008- bar_global() 009- bar:1 010- bar_static() 011- bar_global() 012- bar:2 013- wow_static() 014- wow_global() 015- wow:1 016- wow_static() 017- wow:1 018- oop_test() 019- oop_static() 020- oop_class() 021- oop:1 022- oop_static() 023- oop:1 024- oop_test() 025- oop_static() 026- oop:1 ================================================================================ ================================================================================ /usr/src/php4/tests/lang/bug21094.phpt ================================================================================ ---- EXPECTED OUTPUT [1024] errstr: test, errfile: %s, errline: %d ---- ACTUAL OUTPUT Notice: Array to string conversion in /usr/src/php4/tests/lang/bug21094.php on line 8 Notice: test in /usr/src/php4/tests/lang/bug21094.php on line 10 ---- FAILED ================================================================================ 001- [1024] errstr: test, errfile: %s, errline: %d 001+ Notice: Array to string conversion in /usr/src/php4/tests/lang/bug21094.php on line 8 002+ 003+ Notice: test in /usr/src/php4/tests/lang/bug21094.php on line 10 ================================================================================ ================================================================================ /usr/src/php4/tests/lang/bug21600.phpt ================================================================================ ---- EXPECTED OUTPUT array(1) { ["foo"]=> string(4) "test" } ---- ACTUAL OUTPUT array(1) { ["foo"]=> &string(4) "test" } ---- FAILED ================================================================================ 003- string(4) "test" 003+ &string(4) "test" ================================================================================ ================================================================================ /usr/src/php4/tests/strings/002.phpt ================================================================================ ---- EXPECTED OUTPUT printf test 1:simple string printf test 2:42 printf test 3:3.333333 printf test 4:3.3333333333 printf test 5:2.50 printf test 6:2.50000000000 printf test 7:0000000002.50 printf test 8:< foo> printf test 9:<bar > printf test 10: 123456789012345 printf test 10:<høyesterettsjustitiarius> printf test 11: 123456789012345678901234567890 printf test 11:< høyesterettsjustitiarius> printf test 12: -12.34 printf test 13: -12 printf test 14:@ printf test 15:10101010 printf test 16:aa printf test 17:AA printf test 18: 10101010 printf test 19: aa printf test 20: AA printf test 21:0000000010101010 printf test 22:00000000000000aa printf test 23:00000000000000AA printf test 24:abcde printf test 25:gazonk printf test 26:2 1 printf test 27:3 1 2 printf test 28:02 1 printf test 29:2 1 printf test 30:x vprintf test 1:2 1 fprintf test 1:abcde int(20) ---- ACTUAL OUTPUT fprintf test 1:abcde printf test 1:simple string printf test 2:42 printf test 3:3.333333 printf test 4:3.3333333333 printf test 5:2.50 printf test 6:2.50000000000 printf test 7:0000000002.50 printf test 8:< foo> printf test 9:<bar > printf test 10: 123456789012345 printf test 10:<høyesterettsjustitiarius> printf test 11: 123456789012345678901234567890 printf test 11:< høyesterettsjustitiarius> printf test 12: -12.34 printf test 13: -12 printf test 14:@ printf test 15:10101010 printf test 16:aa printf test 17:AA printf test 18: 10101010 printf test 19: aa printf test 20: AA printf test 21:0000000010101010 printf test 22:00000000000000aa printf test 23:00000000000000AA printf test 24:abcde printf test 25:gazonk printf test 26:2 1 printf test 27:3 1 2 printf test 28:02 1 printf test 29:2 1 printf test 30:x vprintf test 1:2 1 int(20) ---- FAILED ================================================================================ 001- printf test 1:simple string 001+ fprintf test 1:abcde 002- printf test 2:42 002+ printf test 1:simple string 003- printf test 3:3.333333 003+ printf test 2:42 004- printf test 4:3.3333333333 004+ printf test 3:3.333333 005- printf test 5:2.50 005+ printf test 4:3.3333333333 006- printf test 6:2.50000000000 006+ printf test 5:2.50 007- printf test 7:0000000002.50 007+ printf test 6:2.50000000000 008- printf test 8:< foo> 008+ printf test 7:0000000002.50 009- printf test 9:<bar > 009+ printf test 8:< foo> 010- printf test 10: 123456789012345 010+ printf test 9:<bar > 011- printf test 10:<høyesterettsjustitiarius> 011+ printf test 10: 123456789012345 012- printf test 11: 123456789012345678901234567890 012+ printf test 10:<høyesterettsjustitiarius> 013- printf test 11:< høyesterettsjustitiarius> 013+ printf test 11: 123456789012345678901234567890 014- printf test 12: -12.34 014+ printf test 11:< høyesterettsjustitiarius> 015- printf test 13: -12 015+ printf test 12: -12.34 016- printf test 14:@ 016+ printf test 13: -12 017- printf test 15:10101010 017+ printf test 14:@ 018- printf test 16:aa 018+ printf test 15:10101010 019- printf test 17:AA 019+ printf test 16:aa 020- printf test 18: 10101010 020+ printf test 17:AA 021- printf test 19: aa 021+ printf test 18: 10101010 022- printf test 20: AA 022+ printf test 19: aa 023- printf test 21:0000000010101010 023+ printf test 20: AA 024- printf test 22:00000000000000aa 024+ printf test 21:0000000010101010 025- printf test 23:00000000000000AA 025+ printf test 22:00000000000000aa 026- printf test 24:abcde 026+ printf test 23:00000000000000AA 027- printf test 25:gazonk 027+ printf test 24:abcde 028- printf test 26:2 1 028+ printf test 25:gazonk 029- printf test 27:3 1 2 029+ printf test 26:2 1 030- printf test 28:02 1 030+ printf test 27:3 1 2 031- printf test 29:2 1 031+ printf test 28:02 1 032- printf test 30:x 032+ printf test 29:2 1 033- vprintf test 1:2 1 033+ printf test 30:x 034- fprintf test 1:abcde 034+ vprintf test 1:2 1 ================================================================================ ================================================================================ /usr/src/php4/ext/pcntl/tests/001.phpt ================================================================================ ---- EXPECTED OUTPUT Staring wait.h tests.... Testing pcntl_wifexited and wexitstatus.... Exited With: -1 Testing pcntl_wifsignaled.... Process was terminated by signal : SIGTERM Testing pcntl_wifstopped and pcntl_wstopsig.... Process was stoped by signal : SIGSTOP ---- ACTUAL OUTPUT Staring wait.h tests.... Testing pcntl_wifexited and wexitstatus....Staring wait.h tests.... Testing pcntl_wifexited and wexitstatus.... Exited With: -1 Testing pcntl_wifsignaled.... Process was terminated by signal : SIGTERM Testing pcntl_wifstopped and pcntl_wstopsig.... Process was stoped by signal : SIGSTOPStaring wait.h tests.... Testing pcntl_wifexited and wexitstatus.... Exited With: -1 Testing pcntl_wifsignaled.... Process was terminated by signal : SIGTERM Testing pcntl_wifstopped and pcntl_wstopsig.... ---- FAILED ================================================================================ 003- Testing pcntl_wifexited and wexitstatus.... 003+ Testing pcntl_wifexited and wexitstatus....Staring wait.h tests.... 004- Exited With: -1 004+ 005- 005+ Testing pcntl_wifexited and wexitstatus.... 006- Testing pcntl_wifsignaled.... 006+ Exited With: -1 007- Process was terminated by signal : SIGTERM 007+ 008- 008+ Testing pcntl_wifsignaled.... 009- Testing pcntl_wifstopped and pcntl_wstopsig.... 009+ Process was terminated by signal : SIGTERM 010- Process was stoped by signal : SIGSTOP 010+ 011+ Testing pcntl_wifstopped and pcntl_wstopsig.... 012+ Process was stoped by signal : SIGSTOPStaring wait.h tests.... 013+ 014+ Testing pcntl_wifexited and wexitstatus.... 015+ Exited With: -1 016+ 017+ Testing pcntl_wifsignaled.... 018+ Process was terminated by signal : SIGTERM 019+ 020+ Testing pcntl_wifstopped and pcntl_wstopsig.... ================================================================================ ================================================================================ /usr/src/php4/ext/pgsql/tests/09notice.phpt ================================================================================ ---- EXPECTED OUTPUT NOTICE: BEGIN: already a transaction in progress NOTICE: BEGIN: already a transaction in progress pg_last_notice() is Ok ---- ACTUAL OUTPUT NOTICE: BEGIN: eine Transaktion is bereits begonnen NOTICE: BEGIN: eine Transaktion is bereits begonnen pg_last_notice() is Ok ---- FAILED ================================================================================ 001- NOTICE: BEGIN: already a transaction in progress 001+ NOTICE: BEGIN: eine Transaktion is bereits begonnen 003- NOTICE: BEGIN: already a transaction in progress 003+ NOTICE: BEGIN: eine Transaktion is bereits begonnen ================================================================================ ================================================================================ /usr/src/php4/ext/session/tests/003.phpt ================================================================================ ---- EXPECTED OUTPUT object(foo)(2) { ["bar"]=> string(2) "ok" ["yes"]=> int(2) } array(1) { [3]=> &object(foo)(2) { ["bar"]=> string(2) "ok" ["yes"]=> int(2) } } ---- ACTUAL OUTPUT object(foo)(2) { ["bar"]=> string(2) "ok" ["yes"]=> int(2) } array(1) { [3]=> object(foo)(2) { ["bar"]=> string(2) "ok" ["yes"]=> int(2) } } Warning: session_destroy() [/phpmanual/function.session-destroy.html]: Session object destruction failed in /usr/src/php4/ext/session/tests/003.php on line 18 ---- FAILED ================================================================================ 009- &object(foo)(2) { 009+ object(foo)(2) { 016+ 017+ Warning: session_destroy() [/phpmanual/function.session-destroy.html]: Session object destruction failed in /usr/src/php4/ext/session/tests/003.php on line 18 ================================================================================ ================================================================================ /usr/src/php4/ext/session/tests/004.phpt ================================================================================ ---- EXPECTED OUTPUT OPEN: PHPSESSID READ: abtest object(foo)(2) { ["bar"]=> string(2) "ok" ["yes"]=> int(2) } array(1) { [3]=> &object(foo)(2) { ["bar"]=> string(2) "ok" ["yes"]=> int(2) } } WRITE: abtest, baz|O:3:"foo":2:{s:3:"bar";s:2:"ok";s:3:"yes";i:2;}arr|a:1:{i:3;O:3:"foo":2:{s:3:"bar";s:2:"ok";s:3:"yes";i:2;}} OPEN: PHPSESSID READ: abtest object(foo)(2) { ["bar"]=> string(2) "ok" ["yes"]=> int(2) } array(1) { [3]=> object(foo)(2) { ["bar"]=> string(2) "ok" ["yes"]=> int(2) } } DESTROY: abtest ---- ACTUAL OUTPUT Notice: Undefined variable: baz in /usr/src/php4/ext/session/tests/004.php on line 48 Fatal error: Call to a member function method() on a non-object in /usr/src/php4/ext/session/tests/004.php on line 48 ---- FAILED ================================================================================ 001- OPEN: PHPSESSID 001+ Notice: Undefined variable: baz in /usr/src/php4/ext/session/tests/004.php on line 48 002- READ: abtest 002+ 003- object(foo)(2) { 003+ Fatal error: Call to a member function method() on a non-object in /usr/src/php4/ext/session/tests/004.php on line 48 004- ["bar"]=> 005- string(2) "ok" 006- ["yes"]=> 007- int(2) 008- } 009- array(1) { 010- [3]=> 011- &object(foo)(2) { 012- ["bar"]=> 013- string(2) "ok" 014- ["yes"]=> 015- int(2) 016- } 017- } 018- WRITE: abtest, baz|O:3:"foo":2:{s:3:"bar";s:2:"ok";s:3:"yes";i:2;}arr|a:1:{i:3;O:3:"foo":2:{s:3:"bar";s:2:"ok";s:3:"yes";i:2;}} 019- OPEN: PHPSESSID 020- READ: abtest 021- object(foo)(2) { 022- ["bar"]=> 023- string(2) "ok" 024- ["yes"]=> 025- int(2) 026- } 027- array(1) { 028- [3]=> 029- object(foo)(2) { 030- ["bar"]=> 031- string(2) "ok" 032- ["yes"]=> 033- int(2) 034- } 035- } 036- DESTROY: abtest ================================================================================ ================================================================================ /usr/src/php4/ext/session/tests/005.phpt ================================================================================ ---- EXPECTED OUTPUT OPEN: PHPSESSID READ: abtest object(foo)(2) { ["bar"]=> string(2) "ok" ["yes"]=> int(2) } array(1) { [3]=> &object(foo)(2) { ["bar"]=> string(2) "ok" ["yes"]=> int(2) } } WRITE: abtest, baz|O:3:"foo":2:{s:3:"bar";s:2:"ok";s:3:"yes";i:2;}arr|a:1:{i:3;O:3:"foo":2:{s:3:"bar";s:2:"ok";s:3:"yes";i:2;}} CLOSE OPEN: PHPSESSID READ: abtest object(foo)(2) { ["bar"]=> string(2) "ok" ["yes"]=> int(3) } array(1) { [3]=> &object(foo)(2) { ["bar"]=> string(2) "ok" ["yes"]=> int(3) } } int(123) WRITE: abtest, baz|O:3:"foo":2:{s:3:"bar";s:2:"ok";s:3:"yes";i:3;}arr|a:1:{i:3;O:3:"foo":2:{s:3:"bar";s:2:"ok";s:3:"yes";i:3;}}c|i:123; CLOSE OPEN: PHPSESSID READ: abtest object(foo)(2) { ["bar"]=> string(2) "ok" ["yes"]=> int(3) } array(1) { [3]=> object(foo)(2) { ["bar"]=> string(2) "ok" ["yes"]=> int(3) } } int(123) DESTROY: abtest CLOSE ---- ACTUAL OUTPUT Notice: Undefined variable: baz in /usr/src/php4/ext/session/tests/005.php on line 50 Fatal error: Call to a member function method() on a non-object in /usr/src/php4/ext/session/tests/005.php on line 50 ---- FAILED ================================================================================ 001- OPEN: PHPSESSID 001+ Notice: Undefined variable: baz in /usr/src/php4/ext/session/tests/005.php on line 50 002- READ: abtest 002+ 003- object(foo)(2) { 003+ Fatal error: Call to a member function method() on a non-object in /usr/src/php4/ext/session/tests/005.php on line 50 004- ["bar"]=> 005- string(2) "ok" 006- ["yes"]=> 007- int(2) 008- } 009- array(1) { 010- [3]=> 011- &object(foo)(2) { 012- ["bar"]=> 013- string(2) "ok" 014- ["yes"]=> 015- int(2) 016- } 017- } 018- WRITE: abtest, baz|O:3:"foo":2:{s:3:"bar";s:2:"ok";s:3:"yes";i:2;}arr|a:1:{i:3;O:3:"foo":2:{s:3:"bar";s:2:"ok";s:3:"yes";i:2;}} 019- CLOSE 020- OPEN: PHPSESSID 021- READ: abtest 022- object(foo)(2) { 023- ["bar"]=> 024- string(2) "ok" 025- ["yes"]=> 026- int(3) 027- } 028- array(1) { 029- [3]=> 030- &object(foo)(2) { 031- ["bar"]=> 032- string(2) "ok" 033- ["yes"]=> 034- int(3) 035- } 036- } 037- int(123) 038- WRITE: abtest, baz|O:3:"foo":2:{s:3:"bar";s:2:"ok";s:3:"yes";i:3;}arr|a:1:{i:3;O:3:"foo":2:{s:3:"bar";s:2:"ok";s:3:"yes";i:3;}}c|i:123; 039- CLOSE 040- OPEN: PHPSESSID 041- READ: abtest 042- object(foo)(2) { 043- ["bar"]=> 044- string(2) "ok" 045- ["yes"]=> 046- int(3) 047- } 048- array(1) { 049- [3]=> 050- object(foo)(2) { 051- ["bar"]=> 052- string(2) "ok" 053- ["yes"]=> 054- int(3) 055- } 056- } 057- int(123) 058- DESTROY: abtest 059- CLOSE ================================================================================ ================================================================================ /usr/src/php4/ext/session/tests/008-php4.2.3.phpt ================================================================================ ---- EXPECTED OUTPUT NULL Your script possibly relies on a session side-effect which existed until PHP 4.2.3. Please be advised that the session extension does not consider global variables as a source of data, unless register_globals is enabled. You can disable this functionality and this warning by setting session.bug_compat_42 or session.bug_compat_warn to off, respectively. array(1) { ["c"]=> float(3.14) } NULL array(1) { ["c"]=> float(3.14) } ---- ACTUAL OUTPUT Warning: session_destroy() [/phpmanual/function.session-destroy.html]: Session object destruction failed in /usr/src/php4/ext/session/tests/008-php4.2.3.php on line 6 NULL Your script possibly relies on a session side-effect which existed until PHP 4.2.3. Please be advised that the session extension does not consider global variables as a source of data, unless register_globals is enabled. You can disable this functionality and this warning by setting session.bug_compat_42 or session.bug_compat_warn to off, respectively. array(1) { ["c"]=> float(3.14) } NULL array(1) { ["c"]=> float(3.14) } ---- FAILED ================================================================================ 001- NULL 001+ Warning: session_destroy() [/phpmanual/function.session-destroy.html]: Session object destruction failed in /usr/src/php4/ext/session/tests/008-php4.2.3.php on line 6 002- Your script possibly relies on a session side-effect which existed until PHP 4.2.3. Please be advised that the session extension does not consider global variables as a source of data, unless register_globals is enabled. You can disable this functionality and this warning by setting session.bug_compat_42 or session.bug_compat_warn to off, respectively. 002+ NULL 003- array(1) { 003+ Your script possibly relies on a session side-effect which existed until PHP 4.2.3. Please be advised that the session extension does not consider global variables as a source of data, unless register_globals is enabled. You can disable this functionality and this warning by setting session.bug_compat_42 or session.bug_compat_warn to off, respectively. 004- ["c"]=> 004+ array(1) { 005- float(3.14) 005+ ["c"]=> 006- } 006+ float(3.14) 007- NULL 007+ } 008- array(1) { 008+ NULL 009- ["c"]=> 009+ array(1) { 010- float(3.14) 010+ ["c"]=> 011- } 011+ float(3.14) 012+ } ================================================================================ ================================================================================ /usr/src/php4/ext/session/tests/009.phpt ================================================================================ ---- EXPECTED OUTPUT array(0) { } array(1) { ["name"]=> string(3) "foo" } array(1) { ["name"]=> string(3) "foo" } array(0) { } array(0) { } ---- ACTUAL OUTPUT Warning: session_destroy() [/phpmanual/function.session-destroy.html]: Session object destruction failed in /usr/src/php4/ext/session/tests/009.php on line 8 array(0) { } array(1) { ["name"]=> string(3) "foo" } array(1) { ["name"]=> string(3) "foo" } array(0) { } array(0) { } ---- FAILED ================================================================================ 001- array(0) { 001+ Warning: session_destroy() [/phpmanual/function.session-destroy.html]: Session object destruction failed in /usr/src/php4/ext/session/tests/009.php on line 8 002- } 002+ array(0) { 003- array(1) { 003+ } 004- ["name"]=> 004+ array(1) { 005- string(3) "foo" 005+ ["name"]=> 006- } 006+ string(3) "foo" 007- array(1) { 007+ } 008- ["name"]=> 008+ array(1) { 009- string(3) "foo" 009+ ["name"]=> 010- } 010+ string(3) "foo" 011- array(0) { 011+ } 012- } 012+ array(0) { 013- array(0) { 013+ } 014- } 014+ array(0) { 015+ } ================================================================================ ================================================================================ /usr/src/php4/ext/session/tests/013.phpt ================================================================================ ---- EXPECTED OUTPUT I live ---- ACTUAL OUTPUT Warning: session_destroy() [/phpmanual/function.session-destroy.html]: Session object destruction failed in /usr/src/php4/ext/session/tests/013.php on line 6 I live ---- FAILED ================================================================================ 001- I live 001+ Warning: session_destroy() [/phpmanual/function.session-destroy.html]: Session object destruction failed in /usr/src/php4/ext/session/tests/013.php on line 6 002+ I live ================================================================================ ================================================================================ /usr/src/php4/ext/session/tests/014.phpt ================================================================================ ---- EXPECTED OUTPUT <a href="/link?PHPSESSID=abtest"> <a href="/link?PHPSESSID=abtest"> <a href="/link?PHPSESSID=abtest"> ---- ACTUAL OUTPUT <a href="/link?PHPSESSID=dcd4e4888794c2c1d21d3efaf826b4e3"> <a href="/link?PHPSESSID=dcd4e4888794c2c1d21d3efaf826b4e3"> <a href="/link?PHPSESSID=dcd4e4888794c2c1d21d3efaf826b4e3"> Warning: session_destroy() [/phpmanual/function.session-destroy.html]: Session object destruction failed in /usr/src/php4/ext/session/tests/014.php on line 18 ---- FAILED ================================================================================ 001- <a href="/link?PHPSESSID=abtest"> 001+ <a href="/link?PHPSESSID=dcd4e4888794c2c1d21d3efaf826b4e3"> 002- <a href="/link?PHPSESSID=abtest"> 002+ <a href="/link?PHPSESSID=dcd4e4888794c2c1d21d3efaf826b4e3"> 003- <a href="/link?PHPSESSID=abtest"> 003+ <a href="/link?PHPSESSID=dcd4e4888794c2c1d21d3efaf826b4e3"> 004+ 005+ Warning: session_destroy() [/phpmanual/function.session-destroy.html]: Session object destruction failed in /usr/src/php4/ext/session/tests/014.php on line 18 ================================================================================ ================================================================================ /usr/src/php4/ext/session/tests/015.phpt ================================================================================ ---- EXPECTED OUTPUT <a href="/link?PHPSESSID=abtest&PHPSESSID=abtest"> ---- ACTUAL OUTPUT <a href="/link?PHPSESSID=78f4f37e372c22f0d8e1ad34e4b2d744&PHPSESSID=78f4f37e372c22f0d8e1ad34e4b2d744"> Warning: session_destroy() [/phpmanual/function.session-destroy.html]: Session object destruction failed in /usr/src/php4/ext/session/tests/015.php on line 9 ---- FAILED ================================================================================ 001- <a href="/link?PHPSESSID=abtest&PHPSESSID=abtest"> 001+ <a href="/link?PHPSESSID=78f4f37e372c22f0d8e1ad34e4b2d744&PHPSESSID=78f4f37e372c22f0d8e1ad34e4b2d744"> 002+ 003+ Warning: session_destroy() [/phpmanual/function.session-destroy.html]: Session object destruction failed in /usr/src/php4/ext/session/tests/015.php on line 9 ================================================================================ ================================================================================ /usr/src/php4/ext/session/tests/018.phpt ================================================================================ ---- EXPECTED OUTPUT <form accept-charset="ISO-8859-15, ISO-8859-1" action=url.php><input type="hidden" name="PHPSESSID" value="abtest" /> ---- ACTUAL OUTPUT <form accept-charset="ISO-8859-15, ISO-8859-1" action=url.php><input type="hidden" name="PHPSESSID" value="455d73c736fda7bdee11502ef2ff9500" /> Warning: session_destroy() [/phpmanual/function.session-destroy.html]: Session object destruction failed in /usr/src/php4/ext/session/tests/018.php on line 10 ---- FAILED ================================================================================ 001- <form accept-charset="ISO-8859-15, ISO-8859-1" action=url.php><input type="hidden" name="PHPSESSID" value="abtest" /> 001+ <form accept-charset="ISO-8859-15, ISO-8859-1" action=url.php><input type="hidden" name="PHPSESSID" value="455d73c736fda7bdee11502ef2ff9500" /> 002+ 003+ Warning: session_destroy() [/phpmanual/function.session-destroy.html]: Session object destruction failed in /usr/src/php4/ext/session/tests/018.php on line 10 ================================================================================ ================================================================================ /usr/src/php4/ext/session/tests/019.phpt ================================================================================ ---- EXPECTED OUTPUT array(2) { ["o1"]=> &object(tfoo)(1) { ["c"]=> int(42) } ["o2"]=> &object(tfoo)(1) { ["c"]=> int(42) } } array(2) { ["o1"]=> &object(tfoo)(1) { ["c"]=> int(44) } ["o2"]=> &object(tfoo)(1) { ["c"]=> int(44) } } ---- ACTUAL OUTPUT ---- FAILED ================================================================================ 001- array(2) { 001+ 002- ["o1"]=> 003- &object(tfoo)(1) { 004- ["c"]=> 005- int(42) 006- } 007- ["o2"]=> 008- &object(tfoo)(1) { 009- ["c"]=> 010- int(42) 011- } 012- } 013- array(2) { 014- ["o1"]=> 015- &object(tfoo)(1) { 016- ["c"]=> 017- int(44) 018- } 019- ["o2"]=> 020- &object(tfoo)(1) { 021- ["c"]=> 022- int(44) 023- } 024- } ================================================================================ ================================================================================ /usr/src/php4/ext/session/tests/020.phpt ================================================================================ ---- EXPECTED OUTPUT <a href="link.php?a=b&amp;PHPSESSID=abtest"> ---- ACTUAL OUTPUT <a href="link.php?a=b&amp;PHPSESSID=301bbcaf34294ce673f91de252b34c23"> ---- FAILED ================================================================================ 001- <a href="link.php?a=b&amp;PHPSESSID=abtest"> 001+ <a href="link.php?a=b&amp;PHPSESSID=301bbcaf34294ce673f91de252b34c23"> ================================================================================ ================================================================================ /usr/src/php4/ext/session/tests/021.phpt ================================================================================ ---- EXPECTED OUTPUT <form><input type="hidden" name="PHPSESSID" value="abtest" /> <fieldset><input type="hidden" name="PHPSESSID" value="abtest" /> <form><input type="hidden" name="PHPSESSID" value="abtest" /> <fieldset> <form><input type="hidden" name="PHPSESSID" value="abtest" /> <fieldset> <form> <fieldset><input type="hidden" name="PHPSESSID" value="abtest" /> ---- ACTUAL OUTPUT <form><input type="hidden" name="PHPSESSID" value="ff295daea0371473b2d68435efe90f59" /> <fieldset><input type="hidden" name="PHPSESSID" value="ff295daea0371473b2d68435efe90f59" /> <form><input type="hidden" name="PHPSESSID" value="ff295daea0371473b2d68435efe90f59" /> <fieldset> <form><input type="hidden" name="PHPSESSID" value="ff295daea0371473b2d68435efe90f59" /> <fieldset> <form> <fieldset><input type="hidden" name="PHPSESSID" value="ff295daea0371473b2d68435efe90f59" /> Warning: session_destroy() [/phpmanual/function.session-destroy.html]: Session object destruction failed in /usr/src/php4/ext/session/tests/021.php on line 39 ---- FAILED ================================================================================ 001- <form><input type="hidden" name="PHPSESSID" value="abtest" /> 001+ <form><input type="hidden" name="PHPSESSID" value="ff295daea0371473b2d68435efe90f59" /> 002- <fieldset><input type="hidden" name="PHPSESSID" value="abtest" /> 002+ <fieldset><input type="hidden" name="PHPSESSID" value="ff295daea0371473b2d68435efe90f59" /> 003- <form><input type="hidden" name="PHPSESSID" value="abtest" /> 003+ <form><input type="hidden" name="PHPSESSID" value="ff295daea0371473b2d68435efe90f59" /> 005- <form><input type="hidden" name="PHPSESSID" value="abtest" /> 005+ <form><input type="hidden" name="PHPSESSID" value="ff295daea0371473b2d68435efe90f59" /> 008- <fieldset><input type="hidden" name="PHPSESSID" value="abtest" /> 008+ <fieldset><input type="hidden" name="PHPSESSID" value="ff295daea0371473b2d68435efe90f59" /> 009+ 010+ Warning: session_destroy() [/phpmanual/function.session-destroy.html]: Session object destruction failed in /usr/src/php4/ext/session/tests/021.php on line 39 ================================================================================ ================================================================================ /usr/src/php4/ext/standard/tests/aggregation/aggregate.phpt ================================================================================ ---- EXPECTED OUTPUT I'm alive! I'm helping! I'm aggregating! **** ---- ACTUAL OUTPUT I'm alive! Fatal error: Call to undefined function do_this() in /usr/src/php4/ext/standard/tests/aggregation/aggregate.php on line 7 ---- FAILED ================================================================================ 002- I'm helping! 002+ 003- I'm aggregating! 003+ Fatal error: Call to undefined function do_this() in /usr/src/php4/ext/standard/tests/aggregation/aggregate.php on line 7 004- **** ================================================================================ ================================================================================ /usr/src/php4/ext/standard/tests/aggregation/aggregate_methods.phpt ================================================================================ ---- EXPECTED OUTPUT I'm alive! mixing 100 simple,mix_it simple_prop mixing ---- ACTUAL OUTPUT I'm alive! Fatal error: Call to undefined function mix_it() in /usr/src/php4/ext/standard/tests/aggregation/aggregate_methods.php on line 6 ---- FAILED ================================================================================ 002- mixing 002+ 003- 100 003+ Fatal error: Call to undefined function mix_it() in /usr/src/php4/ext/standard/tests/aggregation/aggregate_methods.php on line 6 004- simple,mix_it 005- simple_prop 006- mixing ================================================================================ ================================================================================ /usr/src/php4/ext/standard/tests/aggregation/aggregate_methods_by_list.phpt ================================================================================ ---- EXPECTED OUTPUT I'm alive! simple,just_another_method I'm alive! simple,do_this,do_that yep, that's me ---- ACTUAL OUTPUT I'm alive! simple I'm alive! simple Fatal error: Call to undefined function just_another_method() in /usr/src/php4/ext/standard/tests/aggregation/aggregate_methods_by_list.php on line 10 ---- FAILED ================================================================================ 002- simple,just_another_method 002+ simple 004- simple,do_this,do_that 004+ simple 005- yep, that's me 005+ 006+ Fatal error: Call to undefined function just_another_method() in /usr/src/php4/ext/standard/tests/aggregation/aggregate_methods_by_list.php on line 10 ================================================================================ ================================================================================ /usr/src/php4/ext/standard/tests/aggregation/aggregate_methods_by_regexp.phpt ================================================================================ ---- EXPECTED OUTPUT I'm alive! simple,do_this,do_that I'm alive! simple,just_another_method ---- ACTUAL OUTPUT I'm alive! simple I'm alive! simple ---- FAILED ================================================================================ 002- simple,do_this,do_that 002+ simple 004- simple,just_another_method 004+ simple ================================================================================ ================================================================================ /usr/src/php4/ext/standard/tests/strings/bug21744.phpt ================================================================================ ---- EXPECTED OUTPUT test <a href="test?test\!!!test">test</a> ---- ACTUAL OUTPUT test <a href="test?test\!!!test&PHPSESSID=7ea02cfd96eda9ff412290a20d920379">test</a> ---- FAILED ================================================================================ 002- <a href="test?test\!!!test">test</a> 002+ <a href="test?test\!!!test&PHPSESSID=7ea02cfd96eda9ff412290a20d920379">test</a> ================================================================================ ================================================================================ BUILD ENVIRONMENT ================================================================================ OS: Linux Automake: automake (GNU automake) 1.6.3 Written by Tom Tromey <tromey@redhat.com>. Copyright 2002 Free Software Foundation, Inc. This is free software; see the source for copying conditions. There is NO warranty; not even for MERCHANTABILITY or FITNESS FOR A PARTICULAR PURPOSE. Autoconf: autoconf (GNU Autoconf) 2.53 Written by David J. MacKenzie and Akim Demaille. Copyright 2002 Free Software Foundation, Inc. This is free software; see the source for copying conditions. There is NO warranty; not even for MERCHANTABILITY or FITNESS FOR A PARTICULAR PURPOSE. Libtool: ltmain.sh (GNU libtool) 1.4.2 (1.922.2.53 2001/09/11 03:18:52) Compiler: Reading specs from /usr/lib/gcc-lib/i386-redhat-linux/3.2/specs Configured with: ../configure --prefix=/usr --mandir=/usr/share/man --infodir=/usr/share/info --enable-shared --enable-threads=posix --disable-checking --host=i386-redhat-linux --with-system-zlib --enable-__cxa_atexit Thread model: posix gcc version 3.2 20020903 (Red Hat Linux 8.0 3.2-7) Bison: bison (GNU Bison) 1.35 Copyright 1984, 1986, 1989, 1992, 2000, 2001, 2002 Free Software Foundation, Inc. Dies ist freie Software; die Kopierbedingungen stehen in den Quellen. Es gibt keine Garantie; auch nicht für VERKAUFBARKEIT oder FÜR SPEZIELLE ZWECKE. User's E-mail: ================================================================================ PHPINFO ================================================================================ phpinfo() PHP Version => 5.0.0-dev System => Linux app-server.inter-data.prv 2.4.18-17.8.0smp-appserver #1 SMP Die Okt 22 09:48:23 CEST 2002 i686 Build Date => Jan 20 2003 12:03:47 Configure Command => './configure' '--with-pgsql' '--disable-overload' '--without-mysql' '--prefix=/usr/local/php5' '--enable-pcntl' '--enable-sockets' '--enable-bcmath' '--enable-dbase' '--enable-dbx' '--enable-ftp' '--enable-dio' '--with-zlib' '--with-bz2' '--with-gmp' '--with-readline' '--enable-embed' '--with-apxs2' Server API => Command Line Interface Virtual Directory Support => disabled Configuration File (php.ini) Path => /usr/local/php5/lib/php.ini PHP API => 20020918 PHP Extension => 20020429 Zend Extension => 90021012 Debug Build => no Thread Safety => disabled Registered PHP Streams => php, http, ftp, compress.bzip2, compress.zlib This program makes use of the Zend Scripting Language Engine: Zend Engine v2.0.0-dev, Copyright (c) 1998-2003 Zend Technologies _______________________________________________________________________ Configuration PHP Core Directive => Local Value => Master Value allow_call_time_pass_reference => On => On allow_url_fopen => On => On always_populate_raw_post_data => Off => Off arg_separator.input => &amp; => &amp; arg_separator.output => &amp; => &amp; asp_tags => Off => Off auto_append_file => no value => no value auto_prepend_file => no value => no value browscap => no value => no value default_charset => no value => no value default_mimetype => text/html => text/html define_syslog_variables => Off => Off disable_functions => no value => no value display_errors => On => On display_startup_errors => Off => Off doc_root => no value => no value docref_ext => no value => no value docref_root => http://www.php.net/ => http://www.php.net/ enable_dl => On => On error_append_string => no value => no value error_log => no value => no value error_prepend_string => no value => no value error_reporting => no value => no value expose_php => On => On extension_dir => /usr/local/php5/lib/php/extensions/no-debug-non-zts-20020429 => /usr/local/php5/lib/php/extensions/no-debug-non-zts-20020429 file_uploads => On => On gpc_order => GPC => GPC highlight.bg => #FFFFFF => #FFFFFF highlight.comment => #FF8000 => #FF8000 highlight.default => #0000BB => #0000BB highlight.html => #000000 => #000000 highlight.keyword => #007700 => #007700 highlight.string => #DD0000 => #DD0000 html_errors => Off => On ignore_repeated_errors => Off => Off ignore_repeated_source => Off => Off ignore_user_abort => Off => Off implicit_flush => On => Off include_path => .:/usr/local/php5/lib/php => .:/usr/local/php5/lib/php log_errors => Off => Off log_errors_max_len => 1024 => 1024 magic_quotes_gpc => On => On magic_quotes_runtime => Off => Off magic_quotes_sybase => Off => Off max_execution_time => 0 => 30 max_input_time => -1 => -1 open_basedir => no value => no value output_buffering => 0 => 0 output_handler => no value => no value post_max_size => 8M => 8M precision => 14 => 14 register_argc_argv => On => On register_globals => Off => Off report_memleaks => On => On report_zend_debug => On => On safe_mode => Off => Off safe_mode_exec_dir => 1 => 1 safe_mode_gid => Off => Off safe_mode_include_dir => no value => no value sendmail_from => no value => no value sendmail_path => /usr/sbin/sendmail -t -i => /usr/sbin/sendmail -t -i short_open_tag => On => On SMTP => localhost => localhost smtp_port => 25 => 25 sql.safe_mode => Off => Off track_errors => Off => Off unserialize_callback_func => no value => no value upload_max_filesize => 2M => 2M upload_tmp_dir => no value => no value user_dir => no value => no value variables_order => no value => no value xmlrpc_error_number => 0 => 0 xmlrpc_errors => Off => Off y2k_compliance => On => On zend2.implicit_clone => no value => no value bcmath BCMath support => enabled bz2 BZip2 Support => Enabled BZip2 Version => 1.0.2, 30-Dec-2001 ctype ctype functions => enabled dbx dbx support => enabled dbx version => 1.0.0 supported databases => MySQL ODBC PostgreSQL Microsoft SQL Server FrontBase Oracle 8 (oci8) Sybase-CT Directive => Local Value => Master Value dbx.colnames_case => unchanged => unchanged dio dio support => enabled ftp FTP support => enabled gmp gmp support => enabled pcntl pcntl support => enabled pcre PCRE (Perl Compatible Regular Expressions) Support => enabled PCRE Library Version => 3.92 11-Sep-2002 pgsql PostgreSQL Support => enabled PostgreSQL(libpq) Version => 7.2.3 Multibyte character support => enabled SSL support => enabled Active Persistent Links => 0 Active Links => 0 Directive => Local Value => Master Value pgsql.allow_persistent => On => On pgsql.auto_reset_persistent => Off => Off pgsql.ignore_notice => Off => Off pgsql.log_notice => Off => Off pgsql.max_links => Unlimited => Unlimited pgsql.max_persistent => Unlimited => Unlimited posix Revision => $Revision: 1.54 $ session Session Support => enabled Registered save handlers => files user Directive => Local Value => Master Value session.auto_start => On => On session.bug_compat_42 => On => On session.bug_compat_warn => On => On session.cache_expire => 180 => 180 session.cache_limiter => nocache => nocache session.cookie_domain => no value => no value session.cookie_lifetime => 0 => 0 session.cookie_path => / => / session.cookie_secure => Off => Off session.entropy_file => no value => no value session.entropy_length => 0 => 0 session.gc_dividend => 100 => 100 session.gc_maxlifetime => 1440 => 1440 session.gc_probability => 1 => 1 session.hash_bits_per_character => 4 => 4 session.hash_function => 0 => 0 session.name => PHPSESSID => PHPSESSID session.referer_check => no value => no value session.save_handler => files => files session.save_path => /tmp => /tmp session.serialize_handler => php => php session.use_cookies => On => On session.use_only_cookies => Off => Off session.use_trans_sid => On => On sockets Sockets Support => enabled standard Regex Library => Bundled library enabled Dynamic Library Support => enabled Path to sendmail => /usr/sbin/sendmail -t -i Directive => Local Value => Master Value assert.active => 1 => 1 assert.bail => 0 => 0 assert.callback => no value => no value assert.quiet_eval => 0 => 0 assert.warning => 1 => 1 auto_detect_line_endings => 0 => 0 default_socket_timeout => 60 => 60 safe_mode_allowed_env_vars => PHP_ => PHP_ safe_mode_protected_env_vars => LD_LIBRARY_PATH => LD_LIBRARY_PATH url_rewriter.tags => a=href,area=href,frame=src,form=,fieldset= => a=href,area=href,frame=src,form=,fieldset= user_agent => no value => no value tokenizer Tokenizer Support => enabled xml XML Support => active XML Namespace Support => active EXPAT Version => 1.95.5 zlib ZLib Support => enabled Compiled Version => 1.1.4 Linked Version => 1.1.4 Directive => Local Value => Master Value zlib.output_compression => Off => Off zlib.output_compression_level => -1 => -1 zlib.output_handler => no value => no value Additional Modules Module Name dbase readline Environment Variable => Value HOSTNAME => app-server.inter-data.prv TEST_PHP_SRCDIR => /usr/src/php4 TERM => xterm SHELL => /bin/sh HISTSIZE => 1000 MAKEFLAGS => SSH_CLIENT => deleted QTDIR => /usr/lib/qt3-gcc3.2 SSH_TTY => deleted USER => root LS_COLORS => no=00:fi=00:di=00;34:ln=00;36:pi=40;33:so=00;35:bd=40;33;01:cd=40;33;01:or=01;05;37;41:mi=01;05;37;41:ex=00;32:*.cmd=00;32:*.exe=00;32:*.com=00;32:*.btm=00;32:*.bat=00;32:*.sh=00;32:*.csh=00;32:*.tar=00;31:*.tgz=00;31:*.arj=00;31:*.taz=00;31:*.lzh=00;31:*.zip=00;31:*.z=00;31:*.Z=00;31:*.gz=00;31:*.bz2=00;31:*.bz=00;31:*.tz=00;31:*.rpm=00;31:*.cpio=00;31:*.jpg=00;35:*.gif=00;35:*.bmp=00;35:*.xbm=00;35:*.xpm=00;35:*.png=00;35:*.tif=00;35: SCRIPT_FILENAME => SSH_AUTH_SOCK => deleted USERNAME => root MAKELEVEL => 1 MFLAGS => PATH => /bin:/sbin:/usr/bin:/usr/sbin:/usr/local/bin:/usr/local/sbin:/usr/bin/X11:/usr/X11R6/bin:/root/bin MAIL => /var/spool/mail/root _ => /usr/src/php4/sapi/cli/php PWD => /usr/src/php4 INPUTRC => /etc/inputrc LANG => de_DE TEST_PHP_EXECUTABLE => /usr/src/php4/sapi/cli/php REDIRECT_STATUS => PATH_TRANSLATED => SSH_ASKPASS => /usr/libexec/openssh/gnome-ssh-askpass HOME => /root SHLVL => 3 CONTENT_LENGTH => BASH_ENV => /root/.bashrc LOGNAME => root QUERY_STRING => LESSOPEN => |/usr/bin/lesspipe.sh %s CONTENT_TYPE => DISPLAY => station-12:1.0 CC => gcc REQUEST_METHOD => G_BROKEN_FILENAMES => 1 XAUTHORITY => /root/.xauthuRoSe1 PHP Variables Variable => Value _SERVER["HOSTNAME"] => app-server.inter-data.prv _SERVER["TEST_PHP_SRCDIR"] => /usr/src/php4 _SERVER["TERM"] => xterm _SERVER["SHELL"] => /bin/sh _SERVER["HISTSIZE"] => 1000 _SERVER["MAKEFLAGS"] => _SERVER["SSH_CLIENT"] => deleted _SERVER["QTDIR"] => /usr/lib/qt3-gcc3.2 _SERVER["SSH_TTY"] => deleted _SERVER["USER"] => root _SERVER["LS_COLORS"] => no=00:fi=00:di=00;34:ln=00;36:pi=40;33:so=00;35:bd=40;33;01:cd=40;33;01:or=01;05;37;41:mi=01;05;37;41:ex=00;32:*.cmd=00;32:*.exe=00;32:*.com=00;32:*.btm=00;32:*.bat=00;32:*.sh=00;32:*.csh=00;32:*.tar=00;31:*.tgz=00;31:*.arj=00;31:*.taz=00;31:*.lzh=00;31:*.zip=00;31:*.z=00;31:*.Z=00;31:*.gz=00;31:*.bz2=00;31:*.bz=00;31:*.tz=00;31:*.rpm=00;31:*.cpio=00;31:*.jpg=00;35:*.gif=00;35:*.bmp=00;35:*.xbm=00;35:*.xpm=00;35:*.png=00;35:*.tif=00;35: _SERVER["SCRIPT_FILENAME"] => _SERVER["SSH_AUTH_SOCK"] => deleted _SERVER["USERNAME"] => root _SERVER["MAKELEVEL"] => 1 _SERVER["MFLAGS"] => _SERVER["PATH"] => /bin:/sbin:/usr/bin:/usr/sbin:/usr/local/bin:/usr/local/sbin:/usr/bin/X11:/usr/X11R6/bin:/root/bin _SERVER["MAIL"] => /var/spool/mail/root _SERVER["_"] => /usr/src/php4/sapi/cli/php _SERVER["PWD"] => /usr/src/php4 _SERVER["INPUTRC"] => /etc/inputrc _SERVER["LANG"] => de_DE _SERVER["TEST_PHP_EXECUTABLE"] => /usr/src/php4/sapi/cli/php _SERVER["REDIRECT_STATUS"] => _SERVER["PATH_TRANSLATED"] => _SERVER["SSH_ASKPASS"] => /usr/libexec/openssh/gnome-ssh-askpass _SERVER["HOME"] => /root _SERVER["SHLVL"] => 3 _SERVER["CONTENT_LENGTH"] => _SERVER["BASH_ENV"] => /root/.bashrc _SERVER["LOGNAME"] => root _SERVER["QUERY_STRING"] => _SERVER["LESSOPEN"] => |/usr/bin/lesspipe.sh %s _SERVER["CONTENT_TYPE"] => _SERVER["DISPLAY"] => station-12:1.0 _SERVER["CC"] => gcc _SERVER["REQUEST_METHOD"] => _SERVER["G_BROKEN_FILENAMES"] => 1 _SERVER["XAUTHORITY"] => /root/.xauthuRoSe1 _SERVER["PHP_SELF"] => _SERVER["SCRIPT_NAME"] => _SERVER["DOCUMENT_ROOT"] => _SERVER["argv"] => Array ( ) _SERVER["argc"] => 0 _ENV["HOSTNAME"] => app-server.inter-data.prv _ENV["TEST_PHP_SRCDIR"] => /usr/src/php4 _ENV["TERM"] => xterm _ENV["SHELL"] => /bin/sh _ENV["HISTSIZE"] => 1000 _ENV["MAKEFLAGS"] => _ENV["SSH_CLIENT"] => deleted _ENV["QTDIR"] => /usr/lib/qt3-gcc3.2 _ENV["SSH_TTY"] => deleted _ENV["USER"] => root _ENV["LS_COLORS"] => no=00:fi=00:di=00;34:ln=00;36:pi=40;33:so=00;35:bd=40;33;01:cd=40;33;01:or=01;05;37;41:mi=01;05;37;41:ex=00;32:*.cmd=00;32:*.exe=00;32:*.com=00;32:*.btm=00;32:*.bat=00;32:*.sh=00;32:*.csh=00;32:*.tar=00;31:*.tgz=00;31:*.arj=00;31:*.taz=00;31:*.lzh=00;31:*.zip=00;31:*.z=00;31:*.Z=00;31:*.gz=00;31:*.bz2=00;31:*.bz=00;31:*.tz=00;31:*.rpm=00;31:*.cpio=00;31:*.jpg=00;35:*.gif=00;35:*.bmp=00;35:*.xbm=00;35:*.xpm=00;35:*.png=00;35:*.tif=00;35: _ENV["SCRIPT_FILENAME"] => _ENV["SSH_AUTH_SOCK"] => deleted _ENV["USERNAME"] => root _ENV["MAKELEVEL"] => 1 _ENV["MFLAGS"] => _ENV["PATH"] => /bin:/sbin:/usr/bin:/usr/sbin:/usr/local/bin:/usr/local/sbin:/usr/bin/X11:/usr/X11R6/bin:/root/bin _ENV["MAIL"] => /var/spool/mail/root _ENV["_"] => /usr/src/php4/sapi/cli/php _ENV["PWD"] => /usr/src/php4 _ENV["INPUTRC"] => /etc/inputrc _ENV["LANG"] => de_DE _ENV["TEST_PHP_EXECUTABLE"] => /usr/src/php4/sapi/cli/php _ENV["REDIRECT_STATUS"] => _ENV["PATH_TRANSLATED"] => _ENV["SSH_ASKPASS"] => /usr/libexec/openssh/gnome-ssh-askpass _ENV["HOME"] => /root _ENV["SHLVL"] => 3 _ENV["CONTENT_LENGTH"] => _ENV["BASH_ENV"] => /root/.bashrc _ENV["LOGNAME"] => root _ENV["QUERY_STRING"] => _ENV["LESSOPEN"] => |/usr/bin/lesspipe.sh %s _ENV["CONTENT_TYPE"] => _ENV["DISPLAY"] => station-12:1.0 _ENV["CC"] => gcc _ENV["REQUEST_METHOD"] => _ENV["G_BROKEN_FILENAMES"] => 1 _ENV["XAUTHORITY"] => /root/.xauthuRoSe1 PHP License This program is free software; you can redistribute it and/or modify it under the terms of the PHP License as published by the PHP Group and included in the distribution in the file: LICENSE This program is distributed in the hope that it will be useful, but WITHOUT ANY WARRANTY; without even the implied warranty of MERCHANTABILITY or FITNESS FOR A PARTICULAR PURPOSE. If you did not receive a copy of the PHP license, or have any questions about PHP licensing, please contact license@php.net.

« previous php.qa (#8300) next »