Test results [failed]
| From: | noreply@php.net | Date: | Tue, 21 Jan 2003 14:58:58 +0000 |
| Subject: | Test results [failed] | ||
| Groups: | php.qa | ||
| Request: | Send a blank email to php-qa+get-8308@lists.php.net to get a copy of this message | ||
=====================================================================
FAILED TEST SUMMARY
---------------------------------------------------------------------
Bug #21131: fopen($filename, "a+") has broken position
[ext/standard/tests/file/bug21131.phpt]
Simple math tests [ext/standard/tests/math/abs.phpt]
log() tests [ext/standard/tests/math/log.phpt]
Various pow() tests [ext/standard/tests/math/pow.phpt]
Simple math tests [ext/standard/tests/math/round.phpt]
Test strcspn() behavior [ext/standard/tests/strings/strcspn.phpt]
Test strspn() behavior [ext/standard/tests/strings/strspn.phpt]
microtime() function [ext/standard/tests/time/001.phpt]
strtotime() function [ext/standard/tests/time/002.phpt]
=====================================================================
=====================================================================
TEST RESULT SUMMARY
---------------------------------------------------------------------
Exts skipped : 79
Exts tested : 9
---------------------------------------------------------------------
Number of tests : 443
Tests skipped : 230 (51.9%)
Tests failed : 9 ( 2.0%)
Tests passed : 204 (46.0%)
---------------------------------------------------------------------
Time taken : 66 seconds
=====================================================================
================================================================================
/usr/local/sources/php-4.3.0/ext/standard/tests/file/bug21131.phpt
================================================================================
---- EXPECTED OUTPUT
int(6)
int(0)
foobar
---- ACTUAL OUTPUT
int(0)
int(0)
foobar
---- FAILED
================================================================================
001- int(6)
001+ int(0)
================================================================================
================================================================================
/usr/local/sources/php-4.3.0/ext/standard/tests/math/abs.phpt
================================================================================
---- EXPECTED OUTPUT
1,1,0,0
OK
---- ACTUAL OUTPUT
1,1,1,1
Assert failed:
-LONG_MIN+1 === abs(LONG_MIN-1)
Left: int(-9223372036854775807)
Right: int(9223372036854775807)
Assert failed:
-LONG_MIN === abs(LONG_MIN)
Left: int(-9223372036854775808)
Right: float(9.2233720368548E+18)
---- FAILED
================================================================================
001- 1,1,0,0
001+ 1,1,1,1
002- OK
002+
003+ Assert failed:
004+ -LONG_MIN+1 === abs(LONG_MIN-1)
005+ Left: int(-9223372036854775807)
006+ Right: int(9223372036854775807)
007+
008+ Assert failed:
009+ -LONG_MIN === abs(LONG_MIN)
010+ Left: int(-9223372036854775808)
011+ Right: float(9.2233720368548E+18)
================================================================================
================================================================================
/usr/local/sources/php-4.3.0/ext/standard/tests/math/log.phpt
================================================================================
---- EXPECTED OUTPUT
On failure, please mail result to php-dev@lists.php.net
200
50
50
50
50
50
50
50
50
50
---- ACTUAL OUTPUT
On failure, please mail result to php-dev@lists.php.net
200
---- FAILED
================================================================================
003- 50
004- 50
005- 50
006- 50
007- 50
008- 50
009- 50
010- 50
011- 50
================================================================================
================================================================================
/usr/local/sources/php-4.3.0/ext/standard/tests/math/pow.phpt
================================================================================
---- EXPECTED OUTPUT
1,1,0,0
On failure, please mail result to php-dev@lists.php.net
OK
---- ACTUAL OUTPUT
1,1,1,1
On failure, please mail result to php-dev@lists.php.net
Assert failed:
TRUE === is_infinite(pow(0,-2))
Left: bool(true)
Right: bool(false)
Assert failed:
TRUE === is_infinite(pow(0,-1))
Left: bool(true)
Right: bool(false)
Assert failed:
TRUE === is_infinite(pow(0,-2.0))
Left: bool(true)
Right: bool(false)
Assert failed:
TRUE === is_infinite(pow(0,-1.0))
Left: bool(true)
Right: bool(false)
Assert failed:
TRUE === is_infinite(pow(0.0,-2.0))
Left: bool(true)
Right: bool(false)
Assert failed:
TRUE === is_infinite(pow(0.0,-1.0))
Left: bool(true)
Right: bool(false)
Assert failed:
TRUE === is_infinite(pow( 0.0,-2))
Left: bool(true)
Right: bool(false)
Assert failed:
TRUE === is_infinite(pow( 0.0,-1))
Left: bool(true)
Right: bool(false)
Assert failed:
LONG_MAX-1 === pow(LONG_MAX-1,1)
Left: int(9223372036854775806)
Right: int(-9223372036854775808)
Assert failed:
LONG_MIN+1 === pow(LONG_MIN+1,1)
Left: int(-9223372036854775807)
Right: int(-9223372036854775808)
Assert failed:
LONG_MAX === pow(LONG_MAX,1)
Left: int(9223372036854775807)
Right: int(-9223372036854775808)
---- FAILED
================================================================================
001- 1,1,0,0
001+ 1,1,1,1
003- OK
003+
004+ Assert failed:
005+ TRUE === is_infinite(pow(0,-2))
006+ Left: bool(true)
007+ Right: bool(false)
008+
009+ Assert failed:
010+ TRUE === is_infinite(pow(0,-1))
011+ Left: bool(true)
012+ Right: bool(false)
013+
014+ Assert failed:
015+ TRUE === is_infinite(pow(0,-2.0))
016+ Left: bool(true)
017+ Right: bool(false)
018+
019+ Assert failed:
020+ TRUE === is_infinite(pow(0,-1.0))
021+ Left: bool(true)
022+ Right: bool(false)
023+
024+ Assert failed:
025+ TRUE === is_infinite(pow(0.0,-2.0))
026+ Left: bool(true)
027+ Right: bool(false)
028+
029+ Assert failed:
030+ TRUE === is_infinite(pow(0.0,-1.0))
031+ Left: bool(true)
032+ Right: bool(false)
033+
034+ Assert failed:
035+ TRUE === is_infinite(pow( 0.0,-2))
036+ Left: bool(true)
037+ Right: bool(false)
038+
039+ Assert failed:
040+ TRUE === is_infinite(pow( 0.0,-1))
041+ Left: bool(true)
042+ Right: bool(false)
043+
044+ Assert failed:
045+ LONG_MAX-1 === pow(LONG_MAX-1,1)
046+ Left: int(9223372036854775806)
047+ Right: int(-9223372036854775808)
048+
049+ Assert failed:
050+ LONG_MIN+1 === pow(LONG_MIN+1,1)
051+ Left: int(-9223372036854775807)
052+ Right: int(-9223372036854775808)
053+
054+ Assert failed:
055+ LONG_MAX === pow(LONG_MAX,1)
056+ Left: int(9223372036854775807)
057+ Right: int(-9223372036854775808)
================================================================================
================================================================================
/usr/local/sources/php-4.3.0/ext/standard/tests/math/round.phpt
================================================================================
---- EXPECTED OUTPUT
1,1,0,0
OK
---- ACTUAL OUTPUT
1,1,1,1
Assert failed:
LONG_MIN-1 ~== round(LONG_MIN - 0.6)
Left: int(9223372036854775807)
Right: float(-9.2233720368548E+18)
Assert failed:
LONG_MIN-1 ~== floor(LONG_MIN - 0.5)
Left: int(9223372036854775807)
Right: float(-9.2233720368548E+18)
Assert failed:
LONG_MAX+1 ~== ceil(LONG_MAX + 0.5)
Left: int(-9223372036854775808)
Right: float(9.2233720368548E+18)
Assert failed:
LONG_MAX+1 ~== round(LONG_MAX + 0.6)
Left: int(-9223372036854775808)
Right: float(9.2233720368548E+18)
---- FAILED
================================================================================
001- 1,1,0,0
001+ 1,1,1,1
002- OK
002+
003+ Assert failed:
004+ LONG_MIN-1 ~== round(LONG_MIN - 0.6)
005+ Left: int(9223372036854775807)
006+ Right: float(-9.2233720368548E+18)
007+
008+ Assert failed:
009+ LONG_MIN-1 ~== floor(LONG_MIN - 0.5)
010+ Left: int(9223372036854775807)
011+ Right: float(-9.2233720368548E+18)
012+
013+ Assert failed:
014+ LONG_MAX+1 ~== ceil(LONG_MAX + 0.5)
015+ Left: int(-9223372036854775808)
016+ Right: float(9.2233720368548E+18)
017+
018+ Assert failed:
019+ LONG_MAX+1 ~== round(LONG_MAX + 0.6)
020+ Left: int(-9223372036854775808)
021+ Right: float(9.2233720368548E+18)
================================================================================
================================================================================
/usr/local/sources/php-4.3.0/ext/standard/tests/strings/strcspn.phpt
================================================================================
---- EXPECTED OUTPUT
string(25) "22222222aaaa bbb1111 cccc"
string(4) "1234"
int(0)
int(7)
int(6)
---- ACTUAL OUTPUT
string(25) "22222222aaaa bbb1111 cccc"
string(4) "1234"
int(0)
int(0)
int(0)
---- FAILED
================================================================================
004- int(7)
004+ int(0)
005- int(6)
005+ int(0)
================================================================================
================================================================================
/usr/local/sources/php-4.3.0/ext/standard/tests/strings/strspn.phpt
================================================================================
---- EXPECTED OUTPUT
string(25) "22222222aaaa bbb1111 cccc"
string(4) "1234"
int(8)
int(6)
int(3)
---- ACTUAL OUTPUT
string(25) "22222222aaaa bbb1111 cccc"
string(4) "1234"
---- FAILED
================================================================================
003- int(8)
004- int(6)
005- int(3)
================================================================================
================================================================================
/usr/local/sources/php-4.3.0/ext/standard/tests/time/001.phpt
================================================================================
---- EXPECTED OUTPUT
Passed: 100000
Failed: 0
---- ACTUAL OUTPUT
Passed: 8412
Failed: 91588
000002: 1043160817 0.71443200 < 1043160817 0.71443200
000003: 1043160817 0.71443200 < 1043160817 0.71443200
000004: 1043160817 0.71443200 < 1043160817 0.71443200
000006: 1043160817 0.71540800 < 1043160817 0.71540800
000007: 1043160817 0.71540800 < 1043160817 0.71540800
000008: 1043160817 0.71540800 < 1043160817 0.71540800
000009: 1043160817 0.71540800 < 1043160817 0.71540800
000010: 1043160817 0.71540800 < 1043160817 0.71540800
000011: 1043160817 0.71540800 < 1043160817 0.71540800
000013: 1043160817 0.71638400 < 1043160817 0.71638400
000014: 1043160817 0.71638400 < 1043160817 0.71638400
---- FAILED
================================================================================
001- Passed: 100000
001+ Passed: 8412
002- Failed: 0
002+ Failed: 91588
003+ 000002: 1043160817 0.71443200 < 1043160817 0.71443200
004+ 000003: 1043160817 0.71443200 < 1043160817 0.71443200
005+ 000004: 1043160817 0.71443200 < 1043160817 0.71443200
006+ 000006: 1043160817 0.71540800 < 1043160817 0.71540800
007+ 000007: 1043160817 0.71540800 < 1043160817 0.71540800
008+ 000008: 1043160817 0.71540800 < 1043160817 0.71540800
009+ 000009: 1043160817 0.71540800 < 1043160817 0.71540800
010+ 000010: 1043160817 0.71540800 < 1043160817 0.71540800
011+ 000011: 1043160817 0.71540800 < 1043160817 0.71540800
012+ 000013: 1043160817 0.71638400 < 1043160817 0.71638400
013+ 000014: 1043160817 0.71638400 < 1043160817 0.71638400
================================================================================
================================================================================
/usr/local/sources/php-4.3.0/ext/standard/tests/time/002.phpt
================================================================================
---- EXPECTED OUTPUT
1999-10-13 00:00:00
1999-10-13 00:00:00
2000-01-19 00:00:00
2000-01-19 00:00:00
2001-12-21 00:00:00
2001-12-21 00:00:00
2001-12-21 12:16:00
2001-12-21 12:16:00
1969-12-31 23:59:59
2001-10-22 21:19:58
2001-10-22 23:19:58
2001-10-22 23:32:58
2001-10-22 19:19:58
2001-10-22 19:06:58
1999-10-13 00:00:00
1999-10-13 00:00:00
2000-01-19 00:00:00
2000-01-19 00:00:00
2001-12-21 00:00:00
2001-12-21 00:00:00
2001-12-21 12:16:00
2001-12-21 12:16:00
1970-01-01 00:59:59
2001-10-22 21:19:58
2001-10-23 01:19:58
2001-10-23 01:32:58
2001-10-22 21:19:58
2001-10-22 21:06:58
---- ACTUAL OUTPUT
1999-10-13 00:00:00
1999-10-13 00:00:00
2000-01-19 00:00:00
2000-01-19 00:00:00
2001-12-21 00:00:00
2001-12-21 00:00:00
2001-12-21 12:16:00
2001-12-21 12:16:00
1970-01-01 00:59:59
2001-10-22 21:19:58
2001-10-23 00:19:58
2001-10-23 00:32:58
2001-10-22 20:19:58
2001-10-22 20:06:58
1999-10-13 00:00:00
1999-10-13 00:00:00
2000-01-19 00:00:00
2000-01-19 00:00:00
2001-12-21 00:00:00
2001-12-21 00:00:00
2001-12-21 12:16:00
2001-12-21 12:16:00
1970-01-01 00:59:59
2001-10-22 21:19:58
2001-10-23 00:19:58
2001-10-23 00:32:58
2001-10-22 20:19:58
2001-10-22 20:06:58
---- FAILED
================================================================================
009- 1969-12-31 23:59:59
009+ 1970-01-01 00:59:59
011- 2001-10-22 23:19:58
011+ 2001-10-23 00:19:58
012- 2001-10-22 23:32:58
012+ 2001-10-23 00:32:58
013- 2001-10-22 19:19:58
013+ 2001-10-22 20:19:58
014- 2001-10-22 19:06:58
014+ 2001-10-22 20:06:58
025- 2001-10-23 01:19:58
025+ 2001-10-23 00:19:58
026- 2001-10-23 01:32:58
026+ 2001-10-23 00:32:58
027- 2001-10-22 21:19:58
027+ 2001-10-22 20:19:58
028- 2001-10-22 21:06:58
028+ 2001-10-22 20:06:58
================================================================================
================================================================================
BUILD ENVIRONMENT
================================================================================
OS:
OSF1
Automake:
Autoconf:
Autoconf version 2.10
Libtool:
ltmain.sh (GNU libtool) 1.4.2 (1.922.2.53 2001/09/11 03:18:52)
Compiler:
Compaq C V6.4-009 on Compaq Tru64 UNIX V5.1A (Rev. 1885)
Compiler Driver V6.4-008 (sys) cc Driver
Bison:
bison (GNU Bison) 1.75
Written by Robert Corbett and Richard Stallman.
Copyright (C) 2002 Free Software Foundation, Inc.
This is free software; see the source for copying conditions. There is NO
warranty; not even for MERCHANTABILITY or FITNESS FOR A PARTICULAR PURPOSE.
User's E-mail: elopes at cii dot fc dot ul dot pt
================================================================================
PHPINFO
================================================================================
phpinfo()
PHP Version => 4.3.0
System => OSF1 alf1.cii.fc.ul.pt V5.1 1885 alpha
Build Date => Jan 21 2003 14:39:10
Configure Command => './configure'
Server API => Command Line Interface
Virtual Directory Support => disabled
Configuration File (php.ini) Path => /usr/local/lib
PHP API => 20020918
PHP Extension => 20020429
Zend Extension => 20021010
Debug Build => no
Thread Safety => disabled
Registered PHP Streams => php, http, ftp
This program makes use of the Zend Scripting Language Engine:
Zend Engine v1.3.0, Copyright (c) 1998-2002 Zend Technologies
_______________________________________________________________________
Configuration
PHP Core
Directive => Local Value => Master Value
allow_call_time_pass_reference => On => On
allow_url_fopen => On => On
always_populate_raw_post_data => Off => Off
arg_separator.input => & => &
arg_separator.output => & => &
asp_tags => Off => Off
auto_append_file => no value => no value
auto_prepend_file => no value => no value
browscap => no value => no value
default_charset => no value => no value
default_mimetype => text/html => text/html
define_syslog_variables => Off => Off
disable_functions => no value => no value
display_errors => On => On
display_startup_errors => Off => Off
doc_root => no value => no value
docref_ext => no value => no value
docref_root => http://www.php.net/ => http://www.php.net/
enable_dl => On => On
error_append_string => no value => no value
error_log => no value => no value
error_prepend_string => no value => no value
error_reporting => no value => no value
expose_php => On => On
extension_dir => /usr/local/lib/php/extensions/no-debug-non-zts-20020429 =>
/usr/local/lib/php/extensions/no-debug-non-zts-20020429
file_uploads => On => On
gpc_order => GPC => GPC
highlight.bg => #FFFFFF => #FFFFFF
highlight.comment => #FF8000 => #FF8000
highlight.default => #0000BB => #0000BB
highlight.html => #000000 => #000000
highlight.keyword => #007700 => #007700
highlight.string => #DD0000 => #DD0000
html_errors => Off => On
ignore_repeated_errors => Off => Off
ignore_repeated_source => Off => Off
ignore_user_abort => Off => Off
implicit_flush => On => Off
include_path => .:/usr/local/lib/php => .:/usr/local/lib/php
log_errors => Off => Off
log_errors_max_len => 1024 => 1024
magic_quotes_gpc => On => On
magic_quotes_runtime => Off => Off
magic_quotes_sybase => Off => Off
max_execution_time => 0 => 30
max_input_time => -1 => -1
open_basedir => no value => no value
output_buffering => 0 => 0
output_handler => no value => no value
post_max_size => 8M => 8M
precision => 14 => 14
register_argc_argv => On => On
register_globals => Off => Off
report_memleaks => On => On
safe_mode => Off => Off
safe_mode_exec_dir => 1 => 1
safe_mode_gid => Off => Off
safe_mode_include_dir => no value => no value
sendmail_from => no value => no value
sendmail_path => /usr/sbin/sendmail -t -i => /usr/sbin/sendmail -t -i
short_open_tag => On => On
SMTP => localhost => localhost
smtp_port => 25 => 25
sql.safe_mode => Off => Off
track_errors => Off => Off
unserialize_callback_func => no value => no value
upload_max_filesize => 2M => 2M
upload_tmp_dir => no value => no value
user_dir => no value => no value
variables_order => no value => no value
xmlrpc_error_number => 0 => 0
xmlrpc_errors => Off => Off
y2k_compliance => On => On
ctype
ctype functions => enabled
mysql
MySQL Support => enabled
Active Persistent Links => 0
Active Links => 0
Client API version => 3.23.49
MYSQL_MODULE_TYPE => builtin
MYSQL_SOCKET => /tmp/mysql.sock
MYSQL_INCLUDE => MYSQL_LIBS =>
Directive => Local Value => Master Value
mysql.allow_persistent => On => On
mysql.connect_timeout => -1 => -1
mysql.default_host => no value => no value
mysql.default_password => no value => no value
mysql.default_port => no value => no value
mysql.default_socket => no value => no value
mysql.default_user => no value => no value
mysql.max_links => Unlimited => Unlimited
mysql.max_persistent => Unlimited => Unlimited
mysql.trace_mode => Off => Off
overload
User-Space Object Overloading Support => enabled
pcre
PCRE (Perl Compatible Regular Expressions) Support => enabled
PCRE Library Version => 3.92 11-Sep-2002
posix
Revision => $Revision: 1.51 $
session
Session Support => enabled
Registered save handlers => files user
Directive => Local Value => Master Value
session.auto_start => Off => Off
session.bug_compat_42 => On => On
session.bug_compat_warn => On => On
session.cache_expire => 180 => 180
session.cache_limiter => nocache => nocache
session.cookie_domain => no value => no value
session.cookie_lifetime => 0 => 0
session.cookie_path => / => /
session.cookie_secure => Off => Off
session.entropy_file => no value => no value
session.entropy_length => 0 => 0
session.gc_dividend => 100 => 100
session.gc_maxlifetime => 1440 => 1440
session.gc_probability => 1 => 1
session.name => PHPSESSID => PHPSESSID
session.referer_check => no value => no value
session.save_handler => files => files
session.save_path => /tmp => /tmp
session.serialize_handler => php => php
session.use_cookies => On => On
session.use_only_cookies => Off => Off
session.use_trans_sid => Off => Off
standard
Regex Library => Bundled library enabled
Dynamic Library Support => enabled
Path to sendmail => /usr/sbin/sendmail -t -i
Directive => Local Value => Master Value
assert.active => 1 => 1
assert.bail => 0 => 0
assert.callback => no value => no value
assert.quiet_eval => 0 => 0
assert.warning => 1 => 1
auto_detect_line_endings => 0 => 0
default_socket_timeout => 60 => 60
safe_mode_allowed_env_vars => PHP_ => PHP_
safe_mode_protected_env_vars => LD_LIBRARY_PATH => LD_LIBRARY_PATH
url_rewriter.tags => a=href,area=href,frame=src,form=,fieldset= =>
a=href,area=href,frame=src,form=,fieldset=
user_agent => no value => no value
tokenizer
Tokenizer Support => enabled
xml
XML Support => active
XML Namespace Support => active
EXPAT Version => 1.95.2
Additional Modules
Module Name
Environment
Variable => Value
MANPATH => //man:/usr/local/man:/man:/usr/share/man:/usr/local/lib/perl5/man
TMPDIR => /tmp2
WPWD => /usr/local/vni4/CTT2.0/ctt/bin
CTT_OS_VERSION => OSF1 V4.0 564 alpha
DNFLFLAGS => -w -fpe3 -I/usr/local/vni4/CTT2.0/../CTT2.0/include/axposf
QUERY_STRING => LINK_FNL_STATIC => -no_so -L/usr/local/vni4/CTT2.0/../CTT2.0/lib/lib.axposf
-limsl -limsls_err -lmpistub /usr/shlib/libdxml.so
SSH_TTY => /dev/pts/6
PATH =>
/usr/local/bin:/usr/bin:/usr/local/bin:/usr/bin/X11:/usr/bin:/bin:/usr/sbin:/sbin:/usr/local/bin::/usr/bin/mtools:/cern/pro/lib:/usr/local/xgv:/usr/sbin:/cern/pro/bin:/usr/local/reduce:/lib:/bin/:.:/sbin:/usr/sbin:/usr/ccs/bin:
VNI_F90_MSG => /usr/local/vni4/CTT2.0/../CTT2.0/bin/axposf
SCRIPT_FILENAME => CONTENT_TYPE => MATLAB => /usr/local/matlab
DECW_BOOK => /doc/osf/DOCUMENTATION/BOOKREADER /doc/soft/decw_book
LINK_F90_STATIC => -no_so -L/usr/local/vni4/CTT2.0/../CTT2.0/lib/lib.axposf -limsl -limsls_err
-lmpistub /usr/shlib/libdxml.so
SH_INIT_RAN => yes
NNTPSERVER => master.di.fc.ul.pt
LM_LICENSE_FILE => /usr/local/vni4/CTT2.0/../license/license.dat
XUSERFILESEARCHPATH =>
./%L/%N%C:./%l/%N%C:./%N%C:./%L/%N:./%l/%N:./%N://lib/X11/app-defaults/%L/%N%C://lib/X11/app-defaults/%l/%N%C://lib/X11/app-defaults/%N%C://lib/X11/app-defaults/%L/%N://lib/X11/app-defaults/%l/%N://lib/X11/app-defaults/%N://.app-defaults/%L/%N%C://.app-defaults/%l/%N%C://.app-defaults/%N%C://.app-defaults/%L/%N://.app-defaults/%l/%N://.app-defaults/%N://app-defaults/%L/%N%C://app-defaults/%l/%N%C://app-defaults/%N%C://app-defaults/%L/%N://app-defaults/%l/%N://app-defaults/%N://%L/%N%C://%l/%N%C://%N%C://%L/%N://%l/%N://%N:/usr/local/lib/X11/app-defaults/%L/%N%C:/usr/local/lib/X11/app-defaults/%l/%N%C:/usr/local/lib/X11/app-defaults/%N%C:/usr/local/lib/X11/app-defaults/%L/%N:/usr/local/lib/X11/app-defaults/%l/%N:/usr/local/lib/X11/app-defaults/%N
EDITOR => emacs
LINK_F90 => -L/usr/local/vni4/CTT2.0/../CTT2.0/lib/lib.axposf -limsl /usr/shlib/libdxml.so
CLASSPATH => /usr/local/bin/java/classes
LOGNAME => root
REDIRECT_STATUS => MAKEFLAGS => MAIL => /var/spool/mail/root
HOSTNAME => alf1.cii.fc.ul.pt
MOZILLA_HOME => /usr/local/bin
PS1 => $PWD>
LINK_MPIS => -no_so -L/usr/local/vni4/CTT2.0/../CTT2.0/lib/lib.axposf -limsl -limsls_err
-lmpistub /usr/shlib/libdxml.so
REQUEST_METHOD => USER => root
PATH_TRANSLATED => FFLAGS => -w -fpe3
WWW_HOME => http://alf1.cii.fc.ul.pt/
SHLVL => 1
LINK_MPI => -no_so -L/usr/local/vni4/CTT2.0/../CTT2.0/lib/lib.axposf -limsl -limslp_err -lmpistub
/usr/shlib/libdxml.so
LIB_ARCH => axposf
CC => cc
CONTENT_LENGTH => LINK_F90_SHARED => -L/usr/local/vni4/CTT2.0/../CTT2.0/lib/lib.axposf -limsl
/usr/shlib/libdxml.so
DISPLAY => alf1.cii.fc.ul.pt:12.0
MAKELEVEL => 1
TEST_PHP_EXECUTABLE => /usr/local/sources/php-4.3.0/sapi/cli/php
SHELL => /bin/ksh
HOSTTYPE => alpha
VNIWD => /usr/local/vni4/CTT2.0
GV_DIR => /usr/local/xgv
OSTYPE => osf4.0e
LINK_DNFL => -no_so -L/usr/local/vni4/CTT2.0/../CTT2.0/lib/lib.axposf -limsl -limslp_err
-lmpistub /usr/shlib/libdxml.so
HOME => /
VNI_DIR => /usr/local/vni4/CTT2.0/..
LINK_FNL_SHARED => -L/usr/local/vni4/CTT2.0/../CTT2.0/lib/lib.axposf -limsl /usr/shlib/libdxml.so
MACHINE => alpha
FC => f77
SSH_CONNECTION => ::ffff:194.117.6.90 32965 ::ffff:194.117.6.1 22
SSH_CLIENT => ::ffff:194.117.6.90 32965 22
TEST_PHP_SRCDIR => /usr/local/sources/php-4.3.0
LD_LIBRARY_PATH => /usr/local/vni4/CTT2.0/../CTT2.0/lib/lib.axposf::/usr/local/lib:/usr/lib
TERM => xterm
CTT_EXAMPLES => /usr/local/vni4/CTT2.0/../CTT2.0/examples/axposf
CTT_FORTRAN_COMPILER => Digital Fortran 90 V4.1-270
MFLAGS => VNI_ARCH => axposf
GR_HOME => /usr/local/acegr
PWD => /usr/local/sources/php-4.3.0
MACHTYPE => alpha-dec-osf4.0e
DECW_BOOKSHELF => /doc/soft/decw_book/library.decw_bookshelf
LINK_FNL => -L/usr/local/vni4/CTT2.0/../CTT2.0/lib/lib.axposf -limsl /usr/shlib/libdxml.so
F90 => f90
F90FLAGS => -w -fpe3 -I/usr/local/vni4/CTT2.0/../CTT2.0/include/axposf
reduce => /usr/local/reduce
CTT_DIR => /usr/local/vni4/CTT2.0/../CTT2.0
LICENSE_DIR => /usr/local/vni4/CTT2.0/../license
PHP Variables
Variable => Value
_SERVER["MANPATH"] => //man:/usr/local/man:/man:/usr/share/man:/usr/local/lib/perl5/man
_SERVER["TMPDIR"] => /tmp2
_SERVER["WPWD"] => /usr/local/vni4/CTT2.0/ctt/bin
_SERVER["CTT_OS_VERSION"] => OSF1 V4.0 564 alpha
_SERVER["DNFLFLAGS"] => -w -fpe3 -I/usr/local/vni4/CTT2.0/../CTT2.0/include/axposf
_SERVER["QUERY_STRING"] =>
_SERVER["LINK_FNL_STATIC"] => -no_so -L/usr/local/vni4/CTT2.0/../CTT2.0/lib/lib.axposf
-limsl -limsls_err -lmpistub /usr/shlib/libdxml.so
_SERVER["SSH_TTY"] => /dev/pts/6
_SERVER["PATH"] =>
/usr/local/bin:/usr/bin:/usr/local/bin:/usr/bin/X11:/usr/bin:/bin:/usr/sbin:/sbin:/usr/local/bin::/usr/bin/mtools:/cern/pro/lib:/usr/local/xgv:/usr/sbin:/cern/pro/bin:/usr/local/reduce:/lib:/bin/:.:/sbin:/usr/sbin:/usr/ccs/bin:
_SERVER["VNI_F90_MSG"] => /usr/local/vni4/CTT2.0/../CTT2.0/bin/axposf
_SERVER["SCRIPT_FILENAME"] =>
_SERVER["CONTENT_TYPE"] =>
_SERVER["MATLAB"] => /usr/local/matlab
_SERVER["DECW_BOOK"] => /doc/osf/DOCUMENTATION/BOOKREADER /doc/soft/decw_book
_SERVER["LINK_F90_STATIC"] => -no_so -L/usr/local/vni4/CTT2.0/../CTT2.0/lib/lib.axposf
-limsl -limsls_err -lmpistub /usr/shlib/libdxml.so
_SERVER["SH_INIT_RAN"] => yes
_SERVER["NNTPSERVER"] => master.di.fc.ul.pt
_SERVER["LM_LICENSE_FILE"] => /usr/local/vni4/CTT2.0/../license/license.dat
_SERVER["XUSERFILESEARCHPATH"] =>
./%L/%N%C:./%l/%N%C:./%N%C:./%L/%N:./%l/%N:./%N://lib/X11/app-defaults/%L/%N%C://lib/X11/app-defaults/%l/%N%C://lib/X11/app-defaults/%N%C://lib/X11/app-defaults/%L/%N://lib/X11/app-defaults/%l/%N://lib/X11/app-defaults/%N://.app-defaults/%L/%N%C://.app-defaults/%l/%N%C://.app-defaults/%N%C://.app-defaults/%L/%N://.app-defaults/%l/%N://.app-defaults/%N://app-defaults/%L/%N%C://app-defaults/%l/%N%C://app-defaults/%N%C://app-defaults/%L/%N://app-defaults/%l/%N://app-defaults/%N://%L/%N%C://%l/%N%C://%N%C://%L/%N://%l/%N://%N:/usr/local/lib/X11/app-defaults/%L/%N%C:/usr/local/lib/X11/app-defaults/%l/%N%C:/usr/local/lib/X11/app-defaults/%N%C:/usr/local/lib/X11/app-defaults/%L/%N:/usr/local/lib/X11/app-defaults/%l/%N:/usr/local/lib/X11/app-defaults/%N
_SERVER["EDITOR"] => emacs
_SERVER["LINK_F90"] => -L/usr/local/vni4/CTT2.0/../CTT2.0/lib/lib.axposf -limsl
/usr/shlib/libdxml.so
_SERVER["CLASSPATH"] => /usr/local/bin/java/classes
_SERVER["LOGNAME"] => root
_SERVER["REDIRECT_STATUS"] =>
_SERVER["MAKEFLAGS"] =>
_SERVER["MAIL"] => /var/spool/mail/root
_SERVER["HOSTNAME"] => alf1.cii.fc.ul.pt
_SERVER["MOZILLA_HOME"] => /usr/local/bin
_SERVER["PS1"] => $PWD>
_SERVER["LINK_MPIS"] => -no_so -L/usr/local/vni4/CTT2.0/../CTT2.0/lib/lib.axposf -limsl
-limsls_err -lmpistub /usr/shlib/libdxml.so
_SERVER["REQUEST_METHOD"] =>
_SERVER["USER"] => root
_SERVER["PATH_TRANSLATED"] =>
_SERVER["FFLAGS"] => -w -fpe3
_SERVER["WWW_HOME"] => http://alf1.cii.fc.ul.pt/
_SERVER["SHLVL"] => 1
_SERVER["LINK_MPI"] => -no_so -L/usr/local/vni4/CTT2.0/../CTT2.0/lib/lib.axposf -limsl
-limslp_err -lmpistub /usr/shlib/libdxml.so
_SERVER["LIB_ARCH"] => axposf
_SERVER["CC"] => cc
_SERVER["CONTENT_LENGTH"] =>
_SERVER["LINK_F90_SHARED"] => -L/usr/local/vni4/CTT2.0/../CTT2.0/lib/lib.axposf -limsl
/usr/shlib/libdxml.so
_SERVER["DISPLAY"] => alf1.cii.fc.ul.pt:12.0
_SERVER["MAKELEVEL"] => 1
_SERVER["TEST_PHP_EXECUTABLE"] => /usr/local/sources/php-4.3.0/sapi/cli/php
_SERVER["SHELL"] => /bin/ksh
_SERVER["HOSTTYPE"] => alpha
_SERVER["VNIWD"] => /usr/local/vni4/CTT2.0
_SERVER["GV_DIR"] => /usr/local/xgv
_SERVER["OSTYPE"] => osf4.0e
_SERVER["LINK_DNFL"] => -no_so -L/usr/local/vni4/CTT2.0/../CTT2.0/lib/lib.axposf -limsl
-limslp_err -lmpistub /usr/shlib/libdxml.so
_SERVER["HOME"] => /
_SERVER["VNI_DIR"] => /usr/local/vni4/CTT2.0/..
_SERVER["LINK_FNL_SHARED"] => -L/usr/local/vni4/CTT2.0/../CTT2.0/lib/lib.axposf -limsl
/usr/shlib/libdxml.so
_SERVER["MACHINE"] => alpha
_SERVER["FC"] => f77
_SERVER["SSH_CONNECTION"] => ::ffff:194.117.6.90 32965 ::ffff:194.117.6.1 22
_SERVER["SSH_CLIENT"] => ::ffff:194.117.6.90 32965 22
_SERVER["TEST_PHP_SRCDIR"] => /usr/local/sources/php-4.3.0
_SERVER["LD_LIBRARY_PATH"] =>
/usr/local/vni4/CTT2.0/../CTT2.0/lib/lib.axposf::/usr/local/lib:/usr/lib
_SERVER["TERM"] => xterm
_SERVER["CTT_EXAMPLES"] => /usr/local/vni4/CTT2.0/../CTT2.0/examples/axposf
_SERVER["CTT_FORTRAN_COMPILER"] => Digital Fortran 90 V4.1-270
_SERVER["MFLAGS"] =>
_SERVER["VNI_ARCH"] => axposf
_SERVER["GR_HOME"] => /usr/local/acegr
_SERVER["PWD"] => /usr/local/sources/php-4.3.0
_SERVER["MACHTYPE"] => alpha-dec-osf4.0e
_SERVER["DECW_BOOKSHELF"] => /doc/soft/decw_book/library.decw_bookshelf
_SERVER["LINK_FNL"] => -L/usr/local/vni4/CTT2.0/../CTT2.0/lib/lib.axposf -limsl
/usr/shlib/libdxml.so
_SERVER["F90"] => f90
_SERVER["F90FLAGS"] => -w -fpe3 -I/usr/local/vni4/CTT2.0/../CTT2.0/include/axposf
_SERVER["reduce"] => /usr/local/reduce
_SERVER["CTT_DIR"] => /usr/local/vni4/CTT2.0/../CTT2.0
_SERVER["LICENSE_DIR"] => /usr/local/vni4/CTT2.0/../license
_SERVER["PHP_SELF"] =>
_SERVER["SCRIPT_NAME"] =>
_SERVER["DOCUMENT_ROOT"] =>
_SERVER["argv"] => Array
(
)
_SERVER["argc"] => 0
_ENV["MANPATH"] => //man:/usr/local/man:/man:/usr/share/man:/usr/local/lib/perl5/man
_ENV["TMPDIR"] => /tmp2
_ENV["WPWD"] => /usr/local/vni4/CTT2.0/ctt/bin
_ENV["CTT_OS_VERSION"] => OSF1 V4.0 564 alpha
_ENV["DNFLFLAGS"] => -w -fpe3 -I/usr/local/vni4/CTT2.0/../CTT2.0/include/axposf
_ENV["QUERY_STRING"] =>
_ENV["LINK_FNL_STATIC"] => -no_so -L/usr/local/vni4/CTT2.0/../CTT2.0/lib/lib.axposf
-limsl -limsls_err -lmpistub /usr/shlib/libdxml.so
_ENV["SSH_TTY"] => /dev/pts/6
_ENV["PATH"] =>
/usr/local/bin:/usr/bin:/usr/local/bin:/usr/bin/X11:/usr/bin:/bin:/usr/sbin:/sbin:/usr/local/bin::/usr/bin/mtools:/cern/pro/lib:/usr/local/xgv:/usr/sbin:/cern/pro/bin:/usr/local/reduce:/lib:/bin/:.:/sbin:/usr/sbin:/usr/ccs/bin:
_ENV["VNI_F90_MSG"] => /usr/local/vni4/CTT2.0/../CTT2.0/bin/axposf
_ENV["SCRIPT_FILENAME"] =>
_ENV["CONTENT_TYPE"] =>
_ENV["MATLAB"] => /usr/local/matlab
_ENV["DECW_BOOK"] => /doc/osf/DOCUMENTATION/BOOKREADER /doc/soft/decw_book
_ENV["LINK_F90_STATIC"] => -no_so -L/usr/local/vni4/CTT2.0/../CTT2.0/lib/lib.axposf
-limsl -limsls_err -lmpistub /usr/shlib/libdxml.so
_ENV["SH_INIT_RAN"] => yes
_ENV["NNTPSERVER"] => master.di.fc.ul.pt
_ENV["LM_LICENSE_FILE"] => /usr/local/vni4/CTT2.0/../license/license.dat
_ENV["XUSERFILESEARCHPATH"] =>
./%L/%N%C:./%l/%N%C:./%N%C:./%L/%N:./%l/%N:./%N://lib/X11/app-defaults/%L/%N%C://lib/X11/app-defaults/%l/%N%C://lib/X11/app-defaults/%N%C://lib/X11/app-defaults/%L/%N://lib/X11/app-defaults/%l/%N://lib/X11/app-defaults/%N://.app-defaults/%L/%N%C://.app-defaults/%l/%N%C://.app-defaults/%N%C://.app-defaults/%L/%N://.app-defaults/%l/%N://.app-defaults/%N://app-defaults/%L/%N%C://app-defaults/%l/%N%C://app-defaults/%N%C://app-defaults/%L/%N://app-defaults/%l/%N://app-defaults/%N://%L/%N%C://%l/%N%C://%N%C://%L/%N://%l/%N://%N:/usr/local/lib/X11/app-defaults/%L/%N%C:/usr/local/lib/X11/app-defaults/%l/%N%C:/usr/local/lib/X11/app-defaults/%N%C:/usr/local/lib/X11/app-defaults/%L/%N:/usr/local/lib/X11/app-defaults/%l/%N:/usr/local/lib/X11/app-defaults/%N
_ENV["EDITOR"] => emacs
_ENV["LINK_F90"] => -L/usr/local/vni4/CTT2.0/../CTT2.0/lib/lib.axposf -limsl
/usr/shlib/libdxml.so
_ENV["CLASSPATH"] => /usr/local/bin/java/classes
_ENV["LOGNAME"] => root
_ENV["REDIRECT_STATUS"] =>
_ENV["MAKEFLAGS"] =>
_ENV["MAIL"] => /var/spool/mail/root
_ENV["HOSTNAME"] => alf1.cii.fc.ul.pt
_ENV["MOZILLA_HOME"] => /usr/local/bin
_ENV["PS1"] => $PWD>
_ENV["LINK_MPIS"] => -no_so -L/usr/local/vni4/CTT2.0/../CTT2.0/lib/lib.axposf -limsl
-limsls_err -lmpistub /usr/shlib/libdxml.so
_ENV["REQUEST_METHOD"] =>
_ENV["USER"] => root
_ENV["PATH_TRANSLATED"] =>
_ENV["FFLAGS"] => -w -fpe3
_ENV["WWW_HOME"] => http://alf1.cii.fc.ul.pt/
_ENV["SHLVL"] => 1
_ENV["LINK_MPI"] => -no_so -L/usr/local/vni4/CTT2.0/../CTT2.0/lib/lib.axposf -limsl
-limslp_err -lmpistub /usr/shlib/libdxml.so
_ENV["LIB_ARCH"] => axposf
_ENV["CC"] => cc
_ENV["CONTENT_LENGTH"] =>
_ENV["LINK_F90_SHARED"] => -L/usr/local/vni4/CTT2.0/../CTT2.0/lib/lib.axposf -limsl
/usr/shlib/libdxml.so
_ENV["DISPLAY"] => alf1.cii.fc.ul.pt:12.0
_ENV["MAKELEVEL"] => 1
_ENV["TEST_PHP_EXECUTABLE"] => /usr/local/sources/php-4.3.0/sapi/cli/php
_ENV["SHELL"] => /bin/ksh
_ENV["HOSTTYPE"] => alpha
_ENV["VNIWD"] => /usr/local/vni4/CTT2.0
_ENV["GV_DIR"] => /usr/local/xgv
_ENV["OSTYPE"] => osf4.0e
_ENV["LINK_DNFL"] => -no_so -L/usr/local/vni4/CTT2.0/../CTT2.0/lib/lib.axposf -limsl
-limslp_err -lmpistub /usr/shlib/libdxml.so
_ENV["HOME"] => /
_ENV["VNI_DIR"] => /usr/local/vni4/CTT2.0/..
_ENV["LINK_FNL_SHARED"] => -L/usr/local/vni4/CTT2.0/../CTT2.0/lib/lib.axposf -limsl
/usr/shlib/libdxml.so
_ENV["MACHINE"] => alpha
_ENV["FC"] => f77
_ENV["SSH_CONNECTION"] => ::ffff:194.117.6.90 32965 ::ffff:194.117.6.1 22
_ENV["SSH_CLIENT"] => ::ffff:194.117.6.90 32965 22
_ENV["TEST_PHP_SRCDIR"] => /usr/local/sources/php-4.3.0
_ENV["LD_LIBRARY_PATH"] =>
/usr/local/vni4/CTT2.0/../CTT2.0/lib/lib.axposf::/usr/local/lib:/usr/lib
_ENV["TERM"] => xterm
_ENV["CTT_EXAMPLES"] => /usr/local/vni4/CTT2.0/../CTT2.0/examples/axposf
_ENV["CTT_FORTRAN_COMPILER"] => Digital Fortran 90 V4.1-270
_ENV["MFLAGS"] =>
_ENV["VNI_ARCH"] => axposf
_ENV["GR_HOME"] => /usr/local/acegr
_ENV["PWD"] => /usr/local/sources/php-4.3.0
_ENV["MACHTYPE"] => alpha-dec-osf4.0e
_ENV["DECW_BOOKSHELF"] => /doc/soft/decw_book/library.decw_bookshelf
_ENV["LINK_FNL"] => -L/usr/local/vni4/CTT2.0/../CTT2.0/lib/lib.axposf -limsl
/usr/shlib/libdxml.so
_ENV["F90"] => f90
_ENV["F90FLAGS"] => -w -fpe3 -I/usr/local/vni4/CTT2.0/../CTT2.0/include/axposf
_ENV["reduce"] => /usr/local/reduce
_ENV["CTT_DIR"] => /usr/local/vni4/CTT2.0/../CTT2.0
_ENV["LICENSE_DIR"] => /usr/local/vni4/CTT2.0/../license
PHP License
This program is free software; you can redistribute it and/or modify
it under the terms of the PHP License as published by the PHP Group
and included in the distribution in the file: LICENSE
This program is distributed in the hope that it will be useful,
but WITHOUT ANY WARRANTY; without even the implied warranty of
MERCHANTABILITY or FITNESS FOR A PARTICULAR PURPOSE.
If you did not receive a copy of the PHP license, or have any
questions about PHP licensing, please contact license@php.net.