Test results [failed]

From: Date: Wed, 22 Jan 2003 23:05:52 +0000
Subject: Test results [failed]
Groups: php.qa 
Request: Send a blank email to php-qa+get-8363@lists.php.net to get a copy of this message
===================================================================== FAILED TEST SUMMARY --------------------------------------------------------------------- Output buffering tests [tests/func/006.phpt] session object deserialization [ext/session/tests/003.phpt] session_set_save_handler test [ext/session/tests/004.phpt] custom save handler, multiple session_start()s, complex data structure test. [ext/session/tests/005.phpt] bug compatibility: global is used albeit register_globals=0 [ext/session/tests/008-php4.2.3.phpt] unset($_SESSION["name"]); should work with register_globals=off [ext/session/tests/009.phpt] redefining SID should not cause warnings [ext/session/tests/013.phpt] a script should not be able to modify session.use_trans_sid [ext/session/tests/014.phpt] use_trans_sid should not affect SID [ext/session/tests/015.phpt] invalid session.save_path should not cause a segfault [ext/session/tests/016.phpt] rewriter correctly handles attribute names which contain dashes [ext/session/tests/018.phpt] rewriter uses arg_seperator.output for modifying URLs [ext/session/tests/020.phpt] rewriter handles form and fieldset tags correctly [ext/session/tests/021.phpt] ===================================================================== ===================================================================== TEST RESULT SUMMARY --------------------------------------------------------------------- Exts skipped : 76 Exts tested : 12 --------------------------------------------------------------------- Number of tests : 443 Tests skipped : 208 (47.0%) Tests failed : 13 ( 2.9%) Tests passed : 222 (50.1%) --------------------------------------------------------------------- Time taken : 119 seconds ===================================================================== ================================================================================ /usr/src/php-4.3.0/tests/func/006.phpt ================================================================================ ---- EXPECTED OUTPUT string(2) "2B" string(2) "1A" ---- ACTUAL OUTPUT string(2) "3B" string(2) "2A" ---- FAILED ================================================================================ 001- string(2) "2B" 001+ string(2) "3B" 002- string(2) "1A" 002+ string(2) "2A" ================================================================================ ================================================================================ /usr/src/php-4.3.0/ext/session/tests/003.phpt ================================================================================ ---- EXPECTED OUTPUT object(foo)(2) { ["bar"]=> string(2) "ok" ["yes"]=> int(2) } array(1) { [3]=> &object(foo)(2) { ["bar"]=> string(2) "ok" ["yes"]=> int(2) } } ---- ACTUAL OUTPUT object(foo)(2) { ["bar"]=> string(2) "ok" ["yes"]=> int(2) } array(1) { [3]=> &object(foo)(2) { ["bar"]=> string(2) "ok" ["yes"]=> int(2) } } Warning: session_destroy() [/phpmanual/function.session-destroy.html]: Session object destruction failed in /usr/src/php-4.3.0/ext/session/tests/003.php on line 18 ---- FAILED ================================================================================ 016+ 017+ Warning: session_destroy() [/phpmanual/function.session-destroy.html]: Session object destruction failed in /usr/src/php-4.3.0/ext/session/tests/003.php on line 18 ================================================================================ ================================================================================ /usr/src/php-4.3.0/ext/session/tests/004.phpt ================================================================================ ---- EXPECTED OUTPUT OPEN: PHPSESSID READ: abtest object(foo)(2) { ["bar"]=> string(2) "ok" ["yes"]=> int(2) } array(1) { [3]=> &object(foo)(2) { ["bar"]=> string(2) "ok" ["yes"]=> int(2) } } WRITE: abtest, baz|O:3:"foo":2:{s:3:"bar";s:2:"ok";s:3:"yes";i:2;}arr|a:1:{i:3;O:3:"foo":2:{s:3:"bar";s:2:"ok";s:3:"yes";i:2;}} OPEN: PHPSESSID READ: abtest object(foo)(2) { ["bar"]=> string(2) "ok" ["yes"]=> int(2) } array(1) { [3]=> object(foo)(2) { ["bar"]=> string(2) "ok" ["yes"]=> int(2) } } DESTROY: abtest ---- ACTUAL OUTPUT Fatal error: Call to a member function on a non-object in /usr/src/php-4.3.0/ext/session/tests/004.php on line 48 ---- FAILED ================================================================================ 001- OPEN: PHPSESSID 001+ Fatal error: Call to a member function on a non-object in /usr/src/php-4.3.0/ext/session/tests/004.php on line 48 002- READ: abtest 003- object(foo)(2) { 004- ["bar"]=> 005- string(2) "ok" 006- ["yes"]=> 007- int(2) 008- } 009- array(1) { 010- [3]=> 011- &object(foo)(2) { 012- ["bar"]=> 013- string(2) "ok" 014- ["yes"]=> 015- int(2) 016- } 017- } 018- WRITE: abtest, baz|O:3:"foo":2:{s:3:"bar";s:2:"ok";s:3:"yes";i:2;}arr|a:1:{i:3;O:3:"foo":2:{s:3:"bar";s:2:"ok";s:3:"yes";i:2;}} 019- OPEN: PHPSESSID 020- READ: abtest 021- object(foo)(2) { 022- ["bar"]=> 023- string(2) "ok" 024- ["yes"]=> 025- int(2) 026- } 027- array(1) { 028- [3]=> 029- object(foo)(2) { 030- ["bar"]=> 031- string(2) "ok" 032- ["yes"]=> 033- int(2) 034- } 035- } 036- DESTROY: abtest ================================================================================ ================================================================================ /usr/src/php-4.3.0/ext/session/tests/005.phpt ================================================================================ ---- EXPECTED OUTPUT OPEN: PHPSESSID READ: abtest object(foo)(2) { ["bar"]=> string(2) "ok" ["yes"]=> int(2) } array(1) { [3]=> &object(foo)(2) { ["bar"]=> string(2) "ok" ["yes"]=> int(2) } } WRITE: abtest, baz|O:3:"foo":2:{s:3:"bar";s:2:"ok";s:3:"yes";i:2;}arr|a:1:{i:3;O:3:"foo":2:{s:3:"bar";s:2:"ok";s:3:"yes";i:2;}} CLOSE OPEN: PHPSESSID READ: abtest object(foo)(2) { ["bar"]=> string(2) "ok" ["yes"]=> int(3) } array(1) { [3]=> &object(foo)(2) { ["bar"]=> string(2) "ok" ["yes"]=> int(3) } } int(123) WRITE: abtest, baz|O:3:"foo":2:{s:3:"bar";s:2:"ok";s:3:"yes";i:3;}arr|a:1:{i:3;O:3:"foo":2:{s:3:"bar";s:2:"ok";s:3:"yes";i:3;}}c|i:123; CLOSE OPEN: PHPSESSID READ: abtest object(foo)(2) { ["bar"]=> string(2) "ok" ["yes"]=> int(3) } array(1) { [3]=> object(foo)(2) { ["bar"]=> string(2) "ok" ["yes"]=> int(3) } } int(123) DESTROY: abtest CLOSE ---- ACTUAL OUTPUT Fatal error: Call to a member function on a non-object in /usr/src/php-4.3.0/ext/session/tests/005.php on line 50 ---- FAILED ================================================================================ 001- OPEN: PHPSESSID 001+ Fatal error: Call to a member function on a non-object in /usr/src/php-4.3.0/ext/session/tests/005.php on line 50 002- READ: abtest 003- object(foo)(2) { 004- ["bar"]=> 005- string(2) "ok" 006- ["yes"]=> 007- int(2) 008- } 009- array(1) { 010- [3]=> 011- &object(foo)(2) { 012- ["bar"]=> 013- string(2) "ok" 014- ["yes"]=> 015- int(2) 016- } 017- } 018- WRITE: abtest, baz|O:3:"foo":2:{s:3:"bar";s:2:"ok";s:3:"yes";i:2;}arr|a:1:{i:3;O:3:"foo":2:{s:3:"bar";s:2:"ok";s:3:"yes";i:2;}} 019- CLOSE 020- OPEN: PHPSESSID 021- READ: abtest 022- object(foo)(2) { 023- ["bar"]=> 024- string(2) "ok" 025- ["yes"]=> 026- int(3) 027- } 028- array(1) { 029- [3]=> 030- &object(foo)(2) { 031- ["bar"]=> 032- string(2) "ok" 033- ["yes"]=> 034- int(3) 035- } 036- } 037- int(123) 038- WRITE: abtest, baz|O:3:"foo":2:{s:3:"bar";s:2:"ok";s:3:"yes";i:3;}arr|a:1:{i:3;O:3:"foo":2:{s:3:"bar";s:2:"ok";s:3:"yes";i:3;}}c|i:123; 039- CLOSE 040- OPEN: PHPSESSID 041- READ: abtest 042- object(foo)(2) { 043- ["bar"]=> 044- string(2) "ok" 045- ["yes"]=> 046- int(3) 047- } 048- array(1) { 049- [3]=> 050- object(foo)(2) { 051- ["bar"]=> 052- string(2) "ok" 053- ["yes"]=> 054- int(3) 055- } 056- } 057- int(123) 058- DESTROY: abtest 059- CLOSE ================================================================================ ================================================================================ /usr/src/php-4.3.0/ext/session/tests/008-php4.2.3.phpt ================================================================================ ---- EXPECTED OUTPUT NULL Your script possibly relies on a session side-effect which existed until PHP 4.2.3. Please be advised that the session extension does not consider global variables as a source of data, unless register_globals is enabled. You can disable this functionality and this warning by setting session.bug_compat_42 or session.bug_compat_warn to off, respectively. array(1) { ["c"]=> float(3.14) } NULL array(1) { ["c"]=> float(3.14) } ---- ACTUAL OUTPUT Warning: session_destroy() [/phpmanual/function.session-destroy.html]: Session object destruction failed in /usr/src/php-4.3.0/ext/session/tests/008-php4.2.3.php on line 6 NULL Your script possibly relies on a session side-effect which existed until PHP 4.2.3. Please be advised that the session extension does not consider global variables as a source of data, unless register_globals is enabled. You can disable this functionality and this warning by setting session.bug_compat_42 or session.bug_compat_warn to off, respectively. array(1) { ["c"]=> float(3.14) } NULL array(1) { ["c"]=> float(3.14) } ---- FAILED ================================================================================ 001- NULL 001+ Warning: session_destroy() [/phpmanual/function.session-destroy.html]: Session object destruction failed in /usr/src/php-4.3.0/ext/session/tests/008-php4.2.3.php on line 6 002- Your script possibly relies on a session side-effect which existed until PHP 4.2.3. Please be advised that the session extension does not consider global variables as a source of data, unless register_globals is enabled. You can disable this functionality and this warning by setting session.bug_compat_42 or session.bug_compat_warn to off, respectively. 002+ NULL 003- array(1) { 003+ Your script possibly relies on a session side-effect which existed until PHP 4.2.3. Please be advised that the session extension does not consider global variables as a source of data, unless register_globals is enabled. You can disable this functionality and this warning by setting session.bug_compat_42 or session.bug_compat_warn to off, respectively. 004- ["c"]=> 004+ array(1) { 005- float(3.14) 005+ ["c"]=> 006- } 006+ float(3.14) 007- NULL 007+ } 008- array(1) { 008+ NULL 009- ["c"]=> 009+ array(1) { 010- float(3.14) 010+ ["c"]=> 011- } 011+ float(3.14) 012+ } ================================================================================ ================================================================================ /usr/src/php-4.3.0/ext/session/tests/009.phpt ================================================================================ ---- EXPECTED OUTPUT array(0) { } array(1) { ["name"]=> string(3) "foo" } array(1) { ["name"]=> string(3) "foo" } array(0) { } array(0) { } ---- ACTUAL OUTPUT Warning: session_destroy() [/phpmanual/function.session-destroy.html]: Session object destruction failed in /usr/src/php-4.3.0/ext/session/tests/009.php on line 8 array(0) { } array(1) { ["name"]=> string(3) "foo" } array(1) { ["name"]=> string(3) "foo" } array(0) { } array(0) { } ---- FAILED ================================================================================ 001- array(0) { 001+ Warning: session_destroy() [/phpmanual/function.session-destroy.html]: Session object destruction failed in /usr/src/php-4.3.0/ext/session/tests/009.php on line 8 002- } 002+ array(0) { 003- array(1) { 003+ } 004- ["name"]=> 004+ array(1) { 005- string(3) "foo" 005+ ["name"]=> 006- } 006+ string(3) "foo" 007- array(1) { 007+ } 008- ["name"]=> 008+ array(1) { 009- string(3) "foo" 009+ ["name"]=> 010- } 010+ string(3) "foo" 011- array(0) { 011+ } 012- } 012+ array(0) { 013- array(0) { 013+ } 014- } 014+ array(0) { 015+ } ================================================================================ ================================================================================ /usr/src/php-4.3.0/ext/session/tests/013.phpt ================================================================================ ---- EXPECTED OUTPUT I live ---- ACTUAL OUTPUT Warning: session_destroy() [/phpmanual/function.session-destroy.html]: Session object destruction failed in /usr/src/php-4.3.0/ext/session/tests/013.php on line 6 I live ---- FAILED ================================================================================ 001- I live 001+ Warning: session_destroy() [/phpmanual/function.session-destroy.html]: Session object destruction failed in /usr/src/php-4.3.0/ext/session/tests/013.php on line 6 002+ I live ================================================================================ ================================================================================ /usr/src/php-4.3.0/ext/session/tests/014.phpt ================================================================================ ---- EXPECTED OUTPUT <a href="/link?PHPSESSID=abtest"> <a href="/link?PHPSESSID=abtest"> <a href="/link?PHPSESSID=abtest"> ---- ACTUAL OUTPUT <a href="/link?PHPSESSID=d367110cd6768fa6a32e3bfc0205f118"> <a href="/link?PHPSESSID=d367110cd6768fa6a32e3bfc0205f118"> <a href="/link?PHPSESSID=d367110cd6768fa6a32e3bfc0205f118"> Warning: session_destroy() [/phpmanual/function.session-destroy.html]: Session object destruction failed in /usr/src/php-4.3.0/ext/session/tests/014.php on line 18 ---- FAILED ================================================================================ 001- <a href="/link?PHPSESSID=abtest"> 001+ <a href="/link?PHPSESSID=d367110cd6768fa6a32e3bfc0205f118"> 002- <a href="/link?PHPSESSID=abtest"> 002+ <a href="/link?PHPSESSID=d367110cd6768fa6a32e3bfc0205f118"> 003- <a href="/link?PHPSESSID=abtest"> 003+ <a href="/link?PHPSESSID=d367110cd6768fa6a32e3bfc0205f118"> 004+ 005+ Warning: session_destroy() [/phpmanual/function.session-destroy.html]: Session object destruction failed in /usr/src/php-4.3.0/ext/session/tests/014.php on line 18 ================================================================================ ================================================================================ /usr/src/php-4.3.0/ext/session/tests/015.phpt ================================================================================ ---- EXPECTED OUTPUT <a href="/link?PHPSESSID=abtest&PHPSESSID=abtest"> ---- ACTUAL OUTPUT <a href="/link?PHPSESSID=5e8dddf46e7dc05c910cd44b3a31532d&PHPSESSID=5e8dddf46e7dc05c910cd44b3a31532d"> Warning: session_destroy() [/phpmanual/function.session-destroy.html]: Session object destruction failed in /usr/src/php-4.3.0/ext/session/tests/015.php on line 9 ---- FAILED ================================================================================ 001- <a href="/link?PHPSESSID=abtest&PHPSESSID=abtest"> 001+ <a href="/link?PHPSESSID=5e8dddf46e7dc05c910cd44b3a31532d&PHPSESSID=5e8dddf46e7dc05c910cd44b3a31532d"> 002+ 003+ Warning: session_destroy() [/phpmanual/function.session-destroy.html]: Session object destruction failed in /usr/src/php-4.3.0/ext/session/tests/015.php on line 9 ================================================================================ ================================================================================ /usr/src/php-4.3.0/ext/session/tests/016.phpt ================================================================================ ---- EXPECTED OUTPUT I live ---- ACTUAL OUTPUT HTTP/1.0 0 X X-Powered-By: PHP/4.3.0 Content-type: text/html Warning: Unknown(): open(:/really\\completely:::/invalid;;,23123;213"/sess_f75ab36e56848f2e8613be93d5d58524, O_RDWR) failed: No such file or directory (2) in Unknown on line 0 I live ---- FAILED ================================================================================ 001- I live 001+ HTTP/1.0 0 X 002+ X-Powered-By: PHP/4.3.0 003+ Content-type: text/html 004+ 005+ 006+ Warning: Unknown(): open(:/really\\completely:::/invalid;;,23123;213"/sess_f75ab36e56848f2e8613be93d5d58524, O_RDWR) failed: No such file or directory (2) in Unknown on line 0 007+ I live ================================================================================ ================================================================================ /usr/src/php-4.3.0/ext/session/tests/018.phpt ================================================================================ ---- EXPECTED OUTPUT <form accept-charset="ISO-8859-15, ISO-8859-1" action=url.php><input type="hidden" name="PHPSESSID" value="abtest" /> ---- ACTUAL OUTPUT <form accept-charset="ISO-8859-15, ISO-8859-1" action=url.php><input type="hidden" name="PHPSESSID" value="de30daea5f037b52ed9af9aacd9af903" /> Warning: session_destroy() [/phpmanual/function.session-destroy.html]: Session object destruction failed in /usr/src/php-4.3.0/ext/session/tests/018.php on line 10 ---- FAILED ================================================================================ 001- <form accept-charset="ISO-8859-15, ISO-8859-1" action=url.php><input type="hidden" name="PHPSESSID" value="abtest" /> 001+ <form accept-charset="ISO-8859-15, ISO-8859-1" action=url.php><input type="hidden" name="PHPSESSID" value="de30daea5f037b52ed9af9aacd9af903" /> 002+ 003+ Warning: session_destroy() [/phpmanual/function.session-destroy.html]: Session object destruction failed in /usr/src/php-4.3.0/ext/session/tests/018.php on line 10 ================================================================================ ================================================================================ /usr/src/php-4.3.0/ext/session/tests/020.phpt ================================================================================ ---- EXPECTED OUTPUT <a href="link.php?a=b&amp;PHPSESSID=abtest"> ---- ACTUAL OUTPUT <a href="link.php?a=b&amp;PHPSESSID=2b765abd6a40a3b6188dda5605029f9b"> Warning: session_destroy() [/phpmanual/function.session-destroy.html]: Session object destruction failed in /usr/src/php-4.3.0/ext/session/tests/020.php on line 10 ---- FAILED ================================================================================ 001- <a href="link.php?a=b&amp;PHPSESSID=abtest"> 001+ <a href="link.php?a=b&amp;PHPSESSID=2b765abd6a40a3b6188dda5605029f9b"> 002+ 003+ Warning: session_destroy() [/phpmanual/function.session-destroy.html]: Session object destruction failed in /usr/src/php-4.3.0/ext/session/tests/020.php on line 10 ================================================================================ ================================================================================ /usr/src/php-4.3.0/ext/session/tests/021.phpt ================================================================================ ---- EXPECTED OUTPUT <form><input type="hidden" name="PHPSESSID" value="abtest" /> <fieldset><input type="hidden" name="PHPSESSID" value="abtest" /> <form><input type="hidden" name="PHPSESSID" value="abtest" /> <fieldset> <form><input type="hidden" name="PHPSESSID" value="abtest" /> <fieldset> <form> <fieldset><input type="hidden" name="PHPSESSID" value="abtest" /> ---- ACTUAL OUTPUT <form><input type="hidden" name="PHPSESSID" value="c7031cbf05a68aa97b8f6661cd8006ef" /> <fieldset><input type="hidden" name="PHPSESSID" value="c7031cbf05a68aa97b8f6661cd8006ef" /> <form><input type="hidden" name="PHPSESSID" value="c7031cbf05a68aa97b8f6661cd8006ef" /> <fieldset> <form><input type="hidden" name="PHPSESSID" value="c7031cbf05a68aa97b8f6661cd8006ef" /> <fieldset> <form> <fieldset><input type="hidden" name="PHPSESSID" value="c7031cbf05a68aa97b8f6661cd8006ef" /> Warning: session_destroy() [/phpmanual/function.session-destroy.html]: Session object destruction failed in /usr/src/php-4.3.0/ext/session/tests/021.php on line 39 ---- FAILED ================================================================================ 001- <form><input type="hidden" name="PHPSESSID" value="abtest" /> 001+ <form><input type="hidden" name="PHPSESSID" value="c7031cbf05a68aa97b8f6661cd8006ef" /> 002- <fieldset><input type="hidden" name="PHPSESSID" value="abtest" /> 002+ <fieldset><input type="hidden" name="PHPSESSID" value="c7031cbf05a68aa97b8f6661cd8006ef" /> 003- <form><input type="hidden" name="PHPSESSID" value="abtest" /> 003+ <form><input type="hidden" name="PHPSESSID" value="c7031cbf05a68aa97b8f6661cd8006ef" /> 005- <form><input type="hidden" name="PHPSESSID" value="abtest" /> 005+ <form><input type="hidden" name="PHPSESSID" value="c7031cbf05a68aa97b8f6661cd8006ef" /> 008- <fieldset><input type="hidden" name="PHPSESSID" value="abtest" /> 008+ <fieldset><input type="hidden" name="PHPSESSID" value="c7031cbf05a68aa97b8f6661cd8006ef" /> 009+ 010+ Warning: session_destroy() [/phpmanual/function.session-destroy.html]: Session object destruction failed in /usr/src/php-4.3.0/ext/session/tests/021.php on line 39 ================================================================================ ================================================================================ BUILD ENVIRONMENT ================================================================================ OS: Linux Automake: automake (GNU automake) 1.4-p5 Copyright (C) 1999, 2001 Free Software Foundation, Inc. This is free software; see the source for copying conditions. There is NO warranty; not even for MERCHANTABILITY or FITNESS FOR A PARTICULAR PURPOSE. Written by Tom Tromey <tromey@cygnus.com> Autoconf: Autoconf version 2.13 Libtool: ltmain.sh (GNU libtool) 1.4.2 (1.922.2.53 2001/09/11 03:18:52) Compiler: Reading specs from /usr/lib/gcc-lib/i386-redhat-linux/2.96/specs gcc version 2.96 20000731 (Red Hat Linux 7.3 2.96-113) Bison: bison (GNU Bison) 1.35 Copyright 1984, 1986, 1989, 1992, 2000, 2001, 2002 Free Software Foundation, Inc. This is free software; see the source for copying conditions. There is NO warranty; not even for MERCHANTABILITY or FITNESS FOR A PARTICULAR PURPOSE. User's E-mail: mmoseley at bizland-inc dot com ================================================================================ PHPINFO ================================================================================ phpinfo() PHP Version => 4.3.0 System => Linux jeckle.bl-stage.com 2.4.18-10smp #1 SMP Wed Aug 7 11:17:48 EDT 2002 i686 Build Date => Jan 22 2003 17:58:09 Configure Command => './configure' '--prefix=/usr/local/lib/php-4.3.0' '--with-apxs=/usr/local/apache/apache_1.3.27_perl5.8.0/bin/apxs' '--with-zlib' '--enable-magic-quotes' '--with-db3' '--with-gd' '--with-mm' '--with-mysql=/usr' '--enable-trans-sid' Server API => Command Line Interface Virtual Directory Support => disabled Configuration File (php.ini) Path => /usr/local/lib/php-4.3.0/lib/php.ini PHP API => 20020918 PHP Extension => 20020429 Zend Extension => 20021010 Debug Build => no Thread Safety => disabled Registered PHP Streams => php, http, ftp, compress.zlib This program makes use of the Zend Scripting Language Engine: Zend Engine v1.3.0, Copyright (c) 1998-2002 Zend Technologies _______________________________________________________________________ Configuration PHP Core Directive => Local Value => Master Value allow_call_time_pass_reference => On => On allow_url_fopen => On => On always_populate_raw_post_data => Off => Off arg_separator.input => &amp; => &amp; arg_separator.output => &amp; => &amp; asp_tags => On => On auto_append_file => no value => no value auto_prepend_file => no value => no value browscap => no value => no value default_charset => no value => no value default_mimetype => text/html => text/html define_syslog_variables => Off => Off disable_functions => no value => no value display_errors => On => On display_startup_errors => On => On doc_root => no value => no value docref_ext => no value => no value docref_root => http://www.php.net/ => http://www.php.net/ enable_dl => On => On error_append_string => &lt;/font&gt; => &lt;/font&gt; error_log => syslog => syslog error_prepend_string => &lt;font color=ff0000&gt; => &lt;font color=ff0000&gt; error_reporting => 2047 => 2047 expose_php => On => On extension_dir => ./ => ./ file_uploads => On => On gpc_order => GPC => GPC highlight.bg => #FFFFFF => #FFFFFF highlight.comment => #FF9900 => #FF9900 highlight.default => #0000CC => #0000CC highlight.html => #000000 => #000000 highlight.keyword => #006600 => #006600 highlight.string => #CC0000 => #CC0000 html_errors => Off => On ignore_repeated_errors => Off => Off ignore_repeated_source => Off => Off ignore_user_abort => Off => Off implicit_flush => On => Off include_path => .:/usr/local/lib/php-4.3.0/lib/php => .:/usr/local/lib/php-4.3.0/lib/php log_errors => On => On log_errors_max_len => 1024 => 1024 magic_quotes_gpc => On => On magic_quotes_runtime => On => On magic_quotes_sybase => Off => Off max_execution_time => 0 => 30 max_input_time => -1 => -1 open_basedir => no value => no value output_buffering => 4096 => 4096 output_handler => no value => no value post_max_size => 8M => 8M precision => 14 => 14 register_argc_argv => On => On register_globals => On => On report_memleaks => On => On safe_mode => Off => Off safe_mode_exec_dir => no value => no value safe_mode_gid => Off => Off safe_mode_include_dir => no value => no value sendmail_from => me@localhost.com => me@localhost.com sendmail_path => /usr/sbin/sendmail -t -i => /usr/sbin/sendmail -t -i short_open_tag => On => On SMTP => localhost => localhost smtp_port => 25 => 25 sql.safe_mode => Off => Off track_errors => On => On unserialize_callback_func => no value => no value upload_max_filesize => 10M => 10M upload_tmp_dir => /tmp => /tmp user_dir => no value => no value variables_order => EGPCS => EGPCS xmlrpc_error_number => 0 => 0 xmlrpc_errors => Off => Off y2k_compliance => Off => Off ctype ctype functions => enabled dba DBA support => enabled Supported handlers => db3 gd GD Support => enabled GD Version => bundled (2.0 compatible) GIF Read Support => enabled PNG Support => enabled WBMP Support => enabled mysql MySQL Support => enabled Active Persistent Links => 0 Active Links => 0 Client API version => 3.23.49 MYSQL_MODULE_TYPE => external MYSQL_SOCKET => /var/lib/mysql/mysql.sock MYSQL_INCLUDE => -I/usr/include/mysql MYSQL_LIBS => -L/usr/lib/mysql -lmysqlclient Directive => Local Value => Master Value mysql.allow_persistent => On => On mysql.connect_timeout => -1 => -1 mysql.default_host => no value => no value mysql.default_password => no value => no value mysql.default_port => no value => no value mysql.default_socket => no value => no value mysql.default_user => no value => no value mysql.max_links => Unlimited => Unlimited mysql.max_persistent => Unlimited => Unlimited mysql.trace_mode => Off => Off overload User-Space Object Overloading Support => enabled pcre PCRE (Perl Compatible Regular Expressions) Support => enabled PCRE Library Version => 3.92 11-Sep-2002 posix Revision => $Revision: 1.51 $ session Session Support => enabled Registered save handlers => files user mm Directive => Local Value => Master Value session.auto_start => On => On session.bug_compat_42 => On => On session.bug_compat_warn => On => On session.cache_expire => 180 => 180 session.cache_limiter => nocache => nocache session.cookie_domain => no value => no value session.cookie_lifetime => 0 => 0 session.cookie_path => / => / session.cookie_secure => Off => Off session.entropy_file => no value => no value session.entropy_length => 0 => 0 session.gc_dividend => 100 => 100 session.gc_maxlifetime => 1440 => 1440 session.gc_probability => 1 => 1 session.name => PHPSESSID => PHPSESSID session.referer_check => no value => no value session.save_handler => files => files session.save_path => /var/php_sessions => /var/php_sessions session.serialize_handler => php => php session.use_cookies => On => On session.use_only_cookies => Off => Off session.use_trans_sid => On => On standard Regex Library => Bundled library enabled Dynamic Library Support => enabled Path to sendmail => /usr/sbin/sendmail -t -i Directive => Local Value => Master Value assert.active => 1 => 1 assert.bail => 0 => 0 assert.callback => no value => no value assert.quiet_eval => 0 => 0 assert.warning => 1 => 1 auto_detect_line_endings => 0 => 0 default_socket_timeout => 60 => 60 safe_mode_allowed_env_vars => PHP_ => PHP_ safe_mode_protected_env_vars => LD_LIBRARY_PATH => LD_LIBRARY_PATH url_rewriter.tags => a=href,area=href,frame=src,input=src,form=fakeentry => a=href,area=href,frame=src,input=src,form=fakeentry user_agent => no value => no value tokenizer Tokenizer Support => enabled xml XML Support => active XML Namespace Support => active EXPAT Version => 1.95.2 zlib ZLib Support => enabled Compiled Version => 1.1.3 Linked Version => 1.1.3 Directive => Local Value => Master Value zlib.output_compression => Off => Off zlib.output_compression_level => -1 => -1 zlib.output_handler => no value => no value Additional Modules Module Name Environment Variable => Value PWD => /usr/src/php-4.3.0 MAKEFLAGS => MFLAGS => HOSTNAME => jeckle.bl-stage.com REDIRECT_STATUS => TEST_PHP_EXECUTABLE => /usr/src/php-4.3.0/sapi/cli/php PVM_RSH => /usr/bin/rsh QTDIR => /usr/lib/qt3-gcc2.96 LESSOPEN => |/usr/bin/lesspipe.sh %s CC => gcc XPVM_ROOT => /usr/share/pvm3/xpvm LS_COLORS => no=00:fi=00:di=01;34:ln=01;36:pi=40;33:so=01;35:bd=40;33;01:cd=40;33;01:or=01;05;37;41:mi=01;05;37;41:ex=01;32:*.cmd=01;32:*.exe=01;32:*.com=01;32:*.btm=01;32:*.bat=01;32:*.sh=01;32:*.csh=01;32:*.tar=01;31:*.tgz=01;31:*.arj=01;31:*.taz=01;31:*.lzh=01;31:*.zip=01;31:*.z=01;31:*.Z=01;31:*.gz=01;31:*.bz2=01;31:*.bz=01;31:*.tz=01;31:*.rpm=01;31:*.cpio=01;31:*.jpg=01;35:*.gif=01;35:*.bmp=01;35:*.xbm=01;35:*.xpm=01;35:*.png=01;35:*.tif=01;35: USER => moseley SCRIPT_FILENAME => MAIL => /var/spool/mail/moseley INPUTRC => /etc/inputrc PATH_TRANSLATED => LANG => en_US.iso885915 QUERY_STRING => CONTENT_LENGTH => MAKELEVEL => 1 SSH_CLIENT => 10.2.0.163 32801 22 SHLVL => 4 LOGNAME => moseley _ => /usr/src/php-4.3.0/sapi/cli/php REQUEST_METHOD => SHELL => /bin/sh CVSROOT => /usr/local/cvs TEST_PHP_SRCDIR => /usr/src/php-4.3.0 PVM_ROOT => /usr/share/pvm3 LAMHELPFILE => /etc/lam/lam-helpfile HISTSIZE => 1000 TERM => vt100 HOME => /root SSH_ASKPASS => /usr/libexec/openssh/gnome-ssh-askpass PATH => /usr/kerberos/sbin:/usr/kerberos/bin:/usr/local/bin:/bin:/usr/bin:/usr/local/sbin:/usr/local/apache/apache/bin:/usr/X11R6/bin:/home/moseley/bin:/sbin:/usr/sbin:/usr/local/apache/apache/bin SSH_TTY => /dev/pts/0 CONTENT_TYPE => PHP Variables Variable => Value PHP_SELF => _SERVER["PWD"] => /usr/src/php-4.3.0 _SERVER["MAKEFLAGS"] => _SERVER["MFLAGS"] => _SERVER["HOSTNAME"] => jeckle.bl-stage.com _SERVER["REDIRECT_STATUS"] => _SERVER["TEST_PHP_EXECUTABLE"] => /usr/src/php-4.3.0/sapi/cli/php _SERVER["PVM_RSH"] => /usr/bin/rsh _SERVER["QTDIR"] => /usr/lib/qt3-gcc2.96 _SERVER["LESSOPEN"] => |/usr/bin/lesspipe.sh %s _SERVER["CC"] => gcc _SERVER["XPVM_ROOT"] => /usr/share/pvm3/xpvm _SERVER["LS_COLORS"] => no=00:fi=00:di=01;34:ln=01;36:pi=40;33:so=01;35:bd=40;33;01:cd=40;33;01:or=01;05;37;41:mi=01;05;37;41:ex=01;32:*.cmd=01;32:*.exe=01;32:*.com=01;32:*.btm=01;32:*.bat=01;32:*.sh=01;32:*.csh=01;32:*.tar=01;31:*.tgz=01;31:*.arj=01;31:*.taz=01;31:*.lzh=01;31:*.zip=01;31:*.z=01;31:*.Z=01;31:*.gz=01;31:*.bz2=01;31:*.bz=01;31:*.tz=01;31:*.rpm=01;31:*.cpio=01;31:*.jpg=01;35:*.gif=01;35:*.bmp=01;35:*.xbm=01;35:*.xpm=01;35:*.png=01;35:*.tif=01;35: _SERVER["USER"] => moseley _SERVER["SCRIPT_FILENAME"] => _SERVER["MAIL"] => /var/spool/mail/moseley _SERVER["INPUTRC"] => /etc/inputrc _SERVER["PATH_TRANSLATED"] => _SERVER["LANG"] => en_US.iso885915 _SERVER["QUERY_STRING"] => _SERVER["CONTENT_LENGTH"] => _SERVER["MAKELEVEL"] => 1 _SERVER["SSH_CLIENT"] => 10.2.0.163 32801 22 _SERVER["SHLVL"] => 4 _SERVER["LOGNAME"] => moseley _SERVER["_"] => /usr/src/php-4.3.0/sapi/cli/php _SERVER["REQUEST_METHOD"] => _SERVER["SHELL"] => /bin/sh _SERVER["CVSROOT"] => /usr/local/cvs _SERVER["TEST_PHP_SRCDIR"] => /usr/src/php-4.3.0 _SERVER["PVM_ROOT"] => /usr/share/pvm3 _SERVER["LAMHELPFILE"] => /etc/lam/lam-helpfile _SERVER["HISTSIZE"] => 1000 _SERVER["TERM"] => vt100 _SERVER["HOME"] => /root _SERVER["SSH_ASKPASS"] => /usr/libexec/openssh/gnome-ssh-askpass _SERVER["PATH"] => /usr/kerberos/sbin:/usr/kerberos/bin:/usr/local/bin:/bin:/usr/bin:/usr/local/sbin:/usr/local/apache/apache/bin:/usr/X11R6/bin:/home/moseley/bin:/sbin:/usr/sbin:/usr/local/apache/apache/bin _SERVER["SSH_TTY"] => /dev/pts/0 _SERVER["CONTENT_TYPE"] => _SERVER["PHP_SELF"] => _SERVER["SCRIPT_NAME"] => _SERVER["DOCUMENT_ROOT"] => _SERVER["argv"] => Array ( ) _SERVER["argc"] => 0 _ENV["PWD"] => /usr/src/php-4.3.0 _ENV["MAKEFLAGS"] => _ENV["MFLAGS"] => _ENV["HOSTNAME"] => jeckle.bl-stage.com _ENV["REDIRECT_STATUS"] => _ENV["TEST_PHP_EXECUTABLE"] => /usr/src/php-4.3.0/sapi/cli/php _ENV["PVM_RSH"] => /usr/bin/rsh _ENV["QTDIR"] => /usr/lib/qt3-gcc2.96 _ENV["LESSOPEN"] => |/usr/bin/lesspipe.sh %s _ENV["CC"] => gcc _ENV["XPVM_ROOT"] => /usr/share/pvm3/xpvm _ENV["LS_COLORS"] => no=00:fi=00:di=01;34:ln=01;36:pi=40;33:so=01;35:bd=40;33;01:cd=40;33;01:or=01;05;37;41:mi=01;05;37;41:ex=01;32:*.cmd=01;32:*.exe=01;32:*.com=01;32:*.btm=01;32:*.bat=01;32:*.sh=01;32:*.csh=01;32:*.tar=01;31:*.tgz=01;31:*.arj=01;31:*.taz=01;31:*.lzh=01;31:*.zip=01;31:*.z=01;31:*.Z=01;31:*.gz=01;31:*.bz2=01;31:*.bz=01;31:*.tz=01;31:*.rpm=01;31:*.cpio=01;31:*.jpg=01;35:*.gif=01;35:*.bmp=01;35:*.xbm=01;35:*.xpm=01;35:*.png=01;35:*.tif=01;35: _ENV["USER"] => moseley _ENV["SCRIPT_FILENAME"] => _ENV["MAIL"] => /var/spool/mail/moseley _ENV["INPUTRC"] => /etc/inputrc _ENV["PATH_TRANSLATED"] => _ENV["LANG"] => en_US.iso885915 _ENV["QUERY_STRING"] => _ENV["CONTENT_LENGTH"] => _ENV["MAKELEVEL"] => 1 _ENV["SSH_CLIENT"] => 10.2.0.163 32801 22 _ENV["SHLVL"] => 4 _ENV["LOGNAME"] => moseley _ENV["_"] => /usr/src/php-4.3.0/sapi/cli/php _ENV["REQUEST_METHOD"] => _ENV["SHELL"] => /bin/sh _ENV["CVSROOT"] => /usr/local/cvs _ENV["TEST_PHP_SRCDIR"] => /usr/src/php-4.3.0 _ENV["PVM_ROOT"] => /usr/share/pvm3 _ENV["LAMHELPFILE"] => /etc/lam/lam-helpfile _ENV["HISTSIZE"] => 1000 _ENV["TERM"] => vt100 _ENV["HOME"] => /root _ENV["SSH_ASKPASS"] => /usr/libexec/openssh/gnome-ssh-askpass _ENV["PATH"] => /usr/kerberos/sbin:/usr/kerberos/bin:/usr/local/bin:/bin:/usr/bin:/usr/local/sbin:/usr/local/apache/apache/bin:/usr/X11R6/bin:/home/moseley/bin:/sbin:/usr/sbin:/usr/local/apache/apache/bin _ENV["SSH_TTY"] => /dev/pts/0 _ENV["CONTENT_TYPE"] => PHP License This program is free software; you can redistribute it and/or modify it under the terms of the PHP License as published by the PHP Group and included in the distribution in the file: LICENSE This program is distributed in the hope that it will be useful, but WITHOUT ANY WARRANTY; without even the implied warranty of MERCHANTABILITY or FITNESS FOR A PARTICULAR PURPOSE. If you did not receive a copy of the PHP license, or have any questions about PHP licensing, please contact license@php.net.

« previous php.qa (#8363) next »