Test results [failed]

From: Date: Fri, 24 Jan 2003 11:14:08 +0000
Subject: Test results [failed]
Groups: php.qa 
Request: Send a blank email to php-qa+get-8417@lists.php.net to get a copy of this message
===================================================================== FAILED TEST SUMMARY --------------------------------------------------------------------- Bug #20175 (Static vars can't store ref to new instance) [tests/lang/bug20175.phpt] Bug #21094 (set_error_handler not accepting methods) [tests/lang/bug21094.phpt] Bug #21600 (assign by reference function call changes variable contents) [tests/lang/bug21600.phpt] Bug #21800 (Segfault under interactive mode) [tests/lang/bug21800.phpt] Bug #21849 (self::constant doesn't work as method's default parameter) [tests/lang/bug21849.phpt] session object deserialization [ext/session/tests/003.phpt] session_set_save_handler test [ext/session/tests/004.phpt] custom save handler, multiple session_start()s, complex data structure test. [ext/session/tests/005.phpt] serializing references test case using globals [ext/session/tests/019.phpt] rewriter uses arg_seperator.output for modifying URLs [ext/session/tests/020.phpt] rewriter handles form and fieldset tags correctly [ext/session/tests/021.phpt] aggregating everything [ext/standard/tests/aggregation/aggregate.phpt] aggregating all methods [ext/standard/tests/aggregation/aggregate_methods.phpt] aggregating methods specified in the list [ext/standard/tests/aggregation/aggregate_methods_by_list.phpt] aggregating methods matching regular expression [ext/standard/tests/aggregation/aggregate_methods_by_regexp.phpt] Simple math tests [ext/standard/tests/math/abs.phpt] log() tests [ext/standard/tests/math/log.phpt] Various pow() tests [ext/standard/tests/math/pow.phpt] Simple math tests [ext/standard/tests/math/round.phpt] Test strcspn() behavior [ext/standard/tests/strings/strcspn.phpt] Test strspn() behavior [ext/standard/tests/strings/strspn.phpt] microtime() function [ext/standard/tests/time/001.phpt] strtotime() function [ext/standard/tests/time/002.phpt] ===================================================================== ===================================================================== TEST RESULT SUMMARY --------------------------------------------------------------------- Exts skipped : 79 Exts tested : 6 --------------------------------------------------------------------- Number of tests : 474 Tests skipped : 251 (53.0%) Tests failed : 23 ( 4.9%) Tests passed : 200 (42.2%) --------------------------------------------------------------------- Time taken : 154 seconds ===================================================================== ================================================================================ /php/php5/tests/lang/bug20175.phpt ================================================================================ ---- EXPECTED OUTPUT %s foo_static() foo_global() foo:1 foo_static() foo:1 bar_static() bar_global() bar:1 bar_static() bar_global() bar:2 wow_static() wow_global() wow:1 wow_static() wow:1 oop_test() oop_static() oop_class() oop:1 oop_static() oop:1 oop_test() oop_static() oop:1 ---- ACTUAL OUTPUT Parse error: parse error, expecting `'('' in /php/php5/tests/lang/bug20175.php on line 109 ---- FAILED ================================================================================ 001- %s 001+ Parse error: parse error, expecting `'('' in /php/php5/tests/lang/bug20175.php on line 109 002- foo_static() 003- foo_global() 004- foo:1 005- foo_static() 006- foo:1 007- bar_static() 008- bar_global() 009- bar:1 010- bar_static() 011- bar_global() 012- bar:2 013- wow_static() 014- wow_global() 015- wow:1 016- wow_static() 017- wow:1 018- oop_test() 019- oop_static() 020- oop_class() 021- oop:1 022- oop_static() 023- oop:1 024- oop_test() 025- oop_static() 026- oop:1 ================================================================================ ================================================================================ /php/php5/tests/lang/bug21094.phpt ================================================================================ ---- EXPECTED OUTPUT [1024] errstr: test, errfile: %s, errline: %d ---- ACTUAL OUTPUT Notice: Array to string conversion in /php/php5/tests/lang/bug21094.php on line 8 Notice: test in /php/php5/tests/lang/bug21094.php on line 10 ---- FAILED ================================================================================ 001- [1024] errstr: test, errfile: %s, errline: %d 001+ Notice: Array to string conversion in /php/php5/tests/lang/bug21094.php on line 8 002+ 003+ Notice: test in /php/php5/tests/lang/bug21094.php on line 10 ================================================================================ ================================================================================ /php/php5/tests/lang/bug21600.phpt ================================================================================ ---- EXPECTED OUTPUT array(1) { ["foo"]=> string(4) "test" } ---- ACTUAL OUTPUT array(1) { ["foo"]=> &string(4) "test" } ---- FAILED ================================================================================ 003- string(4) "test" 003+ &string(4) "test" ================================================================================ ================================================================================ /php/php5/tests/lang/bug21800.phpt ================================================================================ ---- EXPECTED OUTPUT Interactive mode enabled :test: ---- ACTUAL OUTPUT ---- FAILED ================================================================================ 001- Interactive mode enabled 001+ 002- 003- :test: ================================================================================ ================================================================================ /php/php5/tests/lang/bug21849.phpt ================================================================================ ---- EXPECTED OUTPUT fubar ---- ACTUAL OUTPUT Fatal error: Undefined class 'self' in /php/php5/tests/lang/bug21849.php on line 5 ---- FAILED ================================================================================ 001- fubar 001+ Fatal error: Undefined class 'self' in /php/php5/tests/lang/bug21849.php on line 5 ================================================================================ ================================================================================ /php/php5/ext/session/tests/003.phpt ================================================================================ ---- EXPECTED OUTPUT object(foo)(2) { ["bar"]=> string(2) "ok" ["yes"]=> int(2) } array(1) { [3]=> &object(foo)(2) { ["bar"]=> string(2) "ok" ["yes"]=> int(2) } } ---- ACTUAL OUTPUT object(foo)(2) { ["bar"]=> string(2) "ok" ["yes"]=> int(2) } array(1) { [3]=> object(foo)(2) { ["bar"]=> string(2) "ok" ["yes"]=> int(2) } } ---- FAILED ================================================================================ 009- &object(foo)(2) { 009+ object(foo)(2) { ================================================================================ ================================================================================ /php/php5/ext/session/tests/004.phpt ================================================================================ ---- EXPECTED OUTPUT OPEN: PHPSESSID READ: abtest object(foo)(2) { ["bar"]=> string(2) "ok" ["yes"]=> int(2) } array(1) { [3]=> &object(foo)(2) { ["bar"]=> string(2) "ok" ["yes"]=> int(2) } } WRITE: abtest, baz|O:3:"foo":2:{s:3:"bar";s:2:"ok";s:3:"yes";i:2;}arr|a:1:{i:3;O:3:"foo":2:{s:3:"bar";s:2:"ok";s:3:"yes";i:2;}} OPEN: PHPSESSID READ: abtest object(foo)(2) { ["bar"]=> string(2) "ok" ["yes"]=> int(2) } array(1) { [3]=> object(foo)(2) { ["bar"]=> string(2) "ok" ["yes"]=> int(2) } } DESTROY: abtest ---- ACTUAL OUTPUT OPEN: PHPSESSID READ: abtest object(foo)(2) { ["bar"]=> string(2) "ok" ["yes"]=> int(2) } array(1) { [3]=> object(foo)(2) { ["bar"]=> string(2) "ok" ["yes"]=> int(2) } } WRITE: abtest, baz|O:3:"foo":2:{s:3:"bar";s:2:"ok";s:3:"yes";i:2;}arr|a:1:{i:3;O:3:"foo":2:{s:3:"bar";s:2:"ok";s:3:"yes";i:2;}} OPEN: PHPSESSID READ: abtest object(foo)(2) { ["bar"]=> string(2) "ok" ["yes"]=> int(2) } array(1) { [3]=> object(foo)(2) { ["bar"]=> string(2) "ok" ["yes"]=> int(2) } } DESTROY: abtest ---- FAILED ================================================================================ 011- &object(foo)(2) { 011+ object(foo)(2) { ================================================================================ ================================================================================ /php/php5/ext/session/tests/005.phpt ================================================================================ ---- EXPECTED OUTPUT OPEN: PHPSESSID READ: abtest object(foo)(2) { ["bar"]=> string(2) "ok" ["yes"]=> int(2) } array(1) { [3]=> &object(foo)(2) { ["bar"]=> string(2) "ok" ["yes"]=> int(2) } } WRITE: abtest, baz|O:3:"foo":2:{s:3:"bar";s:2:"ok";s:3:"yes";i:2;}arr|a:1:{i:3;O:3:"foo":2:{s:3:"bar";s:2:"ok";s:3:"yes";i:2;}} CLOSE OPEN: PHPSESSID READ: abtest object(foo)(2) { ["bar"]=> string(2) "ok" ["yes"]=> int(3) } array(1) { [3]=> &object(foo)(2) { ["bar"]=> string(2) "ok" ["yes"]=> int(3) } } int(123) WRITE: abtest, baz|O:3:"foo":2:{s:3:"bar";s:2:"ok";s:3:"yes";i:3;}arr|a:1:{i:3;O:3:"foo":2:{s:3:"bar";s:2:"ok";s:3:"yes";i:3;}}c|i:123; CLOSE OPEN: PHPSESSID READ: abtest object(foo)(2) { ["bar"]=> string(2) "ok" ["yes"]=> int(3) } array(1) { [3]=> object(foo)(2) { ["bar"]=> string(2) "ok" ["yes"]=> int(3) } } int(123) DESTROY: abtest CLOSE ---- ACTUAL OUTPUT OPEN: PHPSESSID READ: abtest object(foo)(2) { ["bar"]=> string(2) "ok" ["yes"]=> int(2) } array(1) { [3]=> object(foo)(2) { ["bar"]=> string(2) "ok" ["yes"]=> int(2) } } WRITE: abtest, baz|O:3:"foo":2:{s:3:"bar";s:2:"ok";s:3:"yes";i:2;}arr|a:1:{i:3;O:3:"foo":2:{s:3:"bar";s:2:"ok";s:3:"yes";i:2;}} CLOSE OPEN: PHPSESSID READ: abtest object(foo)(2) { ["bar"]=> string(2) "ok" ["yes"]=> int(3) } array(1) { [3]=> object(foo)(2) { ["bar"]=> string(2) "ok" ["yes"]=> int(3) } } int(123) WRITE: abtest, baz|O:3:"foo":2:{s:3:"bar";s:2:"ok";s:3:"yes";i:3;}arr|a:1:{i:3;O:3:"foo":2:{s:3:"bar";s:2:"ok";s:3:"yes";i:3;}}c|i:123; CLOSE OPEN: PHPSESSID READ: abtest object(foo)(2) { ["bar"]=> string(2) "ok" ["yes"]=> int(3) } array(1) { [3]=> object(foo)(2) { ["bar"]=> string(2) "ok" ["yes"]=> int(3) } } int(123) DESTROY: abtest CLOSE ---- FAILED ================================================================================ 011- &object(foo)(2) { 011+ object(foo)(2) { 030- &object(foo)(2) { 030+ object(foo)(2) { ================================================================================ ================================================================================ /php/php5/ext/session/tests/019.phpt ================================================================================ ---- EXPECTED OUTPUT array(2) { ["o1"]=> &object(tfoo)(1) { ["c"]=> int(42) } ["o2"]=> &object(tfoo)(1) { ["c"]=> int(42) } } array(2) { ["o1"]=> &object(tfoo)(1) { ["c"]=> int(44) } ["o2"]=> &object(tfoo)(1) { ["c"]=> int(44) } } ---- ACTUAL OUTPUT ---- FAILED ================================================================================ 001- array(2) { 001+ 002- ["o1"]=> 003- &object(tfoo)(1) { 004- ["c"]=> 005- int(42) 006- } 007- ["o2"]=> 008- &object(tfoo)(1) { 009- ["c"]=> 010- int(42) 011- } 012- } 013- array(2) { 014- ["o1"]=> 015- &object(tfoo)(1) { 016- ["c"]=> 017- int(44) 018- } 019- ["o2"]=> 020- &object(tfoo)(1) { 021- ["c"]=> 022- int(44) 023- } 024- } ================================================================================ ================================================================================ /php/php5/ext/session/tests/020.phpt ================================================================================ ---- EXPECTED OUTPUT <a href="link.php?a=b&amp;PHPSESSID=abtest"> ---- ACTUAL OUTPUT ---- FAILED ================================================================================ 001- <a href="link.php?a=b&amp;PHPSESSID=abtest"> 001+ ================================================================================ ================================================================================ /php/php5/ext/session/tests/021.phpt ================================================================================ ---- EXPECTED OUTPUT <form><input type="hidden" name="PHPSESSID" value="abtest" /> <fieldset><input type="hidden" name="PHPSESSID" value="abtest" /> <form><input type="hidden" name="PHPSESSID" value="abtest" /> <fieldset> <form><input type="hidden" name="PHPSESSID" value="abtest" /> <fieldset> <form> <fieldset><input type="hidden" name="PHPSESSID" value="abtest" /> ---- ACTUAL OUTPUT ---- FAILED ================================================================================ 001- <form><input type="hidden" name="PHPSESSID" value="abtest" /> 001+ 002- <fieldset><input type="hidden" name="PHPSESSID" value="abtest" /> 003- <form><input type="hidden" name="PHPSESSID" value="abtest" /> 004- <fieldset> 005- <form><input type="hidden" name="PHPSESSID" value="abtest" /> 006- <fieldset> 007- <form> 008- <fieldset><input type="hidden" name="PHPSESSID" value="abtest" /> ================================================================================ ================================================================================ /php/php5/ext/standard/tests/aggregation/aggregate.phpt ================================================================================ ---- EXPECTED OUTPUT I'm alive! I'm helping! I'm aggregating! **** ---- ACTUAL OUTPUT I'm alive! Fatal error: Call to undefined function do_this() in /php/php5/ext/standard/tests/aggregation/aggregate.php on line 7 ---- FAILED ================================================================================ 002- I'm helping! 002+ 003- I'm aggregating! 003+ Fatal error: Call to undefined function do_this() in /php/php5/ext/standard/tests/aggregation/aggregate.php on line 7 004- **** ================================================================================ ================================================================================ /php/php5/ext/standard/tests/aggregation/aggregate_methods.phpt ================================================================================ ---- EXPECTED OUTPUT I'm alive! mixing 100 simple,mix_it simple_prop mixing ---- ACTUAL OUTPUT I'm alive! Fatal error: Call to undefined function mix_it() in /php/php5/ext/standard/tests/aggregation/aggregate_methods.php on line 6 ---- FAILED ================================================================================ 002- mixing 002+ 003- 100 003+ Fatal error: Call to undefined function mix_it() in /php/php5/ext/standard/tests/aggregation/aggregate_methods.php on line 6 004- simple,mix_it 005- simple_prop 006- mixing ================================================================================ ================================================================================ /php/php5/ext/standard/tests/aggregation/aggregate_methods_by_list.phpt ================================================================================ ---- EXPECTED OUTPUT I'm alive! simple,just_another_method I'm alive! simple,do_this,do_that yep, that's me ---- ACTUAL OUTPUT I'm alive! simple I'm alive! simple Fatal error: Call to undefined function just_another_method() in /php/php5/ext/standard/tests/aggregation/aggregate_methods_by_list.php on line 10 ---- FAILED ================================================================================ 002- simple,just_another_method 002+ simple 004- simple,do_this,do_that 004+ simple 005- yep, that's me 005+ 006+ Fatal error: Call to undefined function just_another_method() in /php/php5/ext/standard/tests/aggregation/aggregate_methods_by_list.php on line 10 ================================================================================ ================================================================================ /php/php5/ext/standard/tests/aggregation/aggregate_methods_by_regexp.phpt ================================================================================ ---- EXPECTED OUTPUT I'm alive! simple,do_this,do_that I'm alive! simple,just_another_method ---- ACTUAL OUTPUT I'm alive! simple I'm alive! simple ---- FAILED ================================================================================ 002- simple,do_this,do_that 002+ simple 004- simple,just_another_method 004+ simple ================================================================================ ================================================================================ /php/php5/ext/standard/tests/math/abs.phpt ================================================================================ ---- EXPECTED OUTPUT 1,1,0,0 OK ---- ACTUAL OUTPUT 1,1,1,1 Assert failed: -LONG_MIN+1 === abs(LONG_MIN-1) Left: int(-9223372036854775807) Right: int(9223372036854775807) Assert failed: -LONG_MIN === abs(LONG_MIN) Left: int(-9223372036854775808) Right: float(9.22337203685E+18) ---- FAILED ================================================================================ 001- 1,1,0,0 001+ 1,1,1,1 002- OK 002+ 003+ Assert failed: 004+ -LONG_MIN+1 === abs(LONG_MIN-1) 005+ Left: int(-9223372036854775807) 006+ Right: int(9223372036854775807) 007+ 008+ Assert failed: 009+ -LONG_MIN === abs(LONG_MIN) 010+ Left: int(-9223372036854775808) 011+ Right: float(9.22337203685E+18) ================================================================================ ================================================================================ /php/php5/ext/standard/tests/math/log.phpt ================================================================================ ---- EXPECTED OUTPUT On failure, please mail result to php-dev@lists.php.net 200 50 50 50 50 50 50 50 50 50 ---- ACTUAL OUTPUT On failure, please mail result to php-dev@lists.php.net 200 ---- FAILED ================================================================================ 003- 50 004- 50 005- 50 006- 50 007- 50 008- 50 009- 50 010- 50 011- 50 ================================================================================ ================================================================================ /php/php5/ext/standard/tests/math/pow.phpt ================================================================================ ---- EXPECTED OUTPUT 1,1,0,0 On failure, please mail result to php-dev@lists.php.net OK ---- ACTUAL OUTPUT 1,1,1,1 On failure, please mail result to php-dev@lists.php.net Assert failed: TRUE === is_infinite(pow(0,-2)) Left: bool(true) Right: bool(false) Assert failed: TRUE === is_infinite(pow(0,-1)) Left: bool(true) Right: bool(false) Assert failed: TRUE === is_infinite(pow(0,-2.0)) Left: bool(true) Right: bool(false) Assert failed: TRUE === is_infinite(pow(0,-1.0)) Left: bool(true) Right: bool(false) Assert failed: TRUE === is_infinite(pow(0.0,-2.0)) Left: bool(true) Right: bool(false) Assert failed: TRUE === is_infinite(pow(0.0,-1.0)) Left: bool(true) Right: bool(false) Assert failed: TRUE === is_infinite(pow( 0.0,-2)) Left: bool(true) Right: bool(false) Assert failed: TRUE === is_infinite(pow( 0.0,-1)) Left: bool(true) Right: bool(false) Assert failed: LONG_MAX-1 === pow(LONG_MAX-1,1) Left: int(9223372036854775806) Right: int(-9223372036854775808) Assert failed: LONG_MIN+1 === pow(LONG_MIN+1,1) Left: int(-9223372036854775807) Right: int(-9223372036854775808) Assert failed: LONG_MAX === pow(LONG_MAX,1) Left: int(9223372036854775807) Right: int(-9223372036854775808) ---- FAILED ================================================================================ 001- 1,1,0,0 001+ 1,1,1,1 003- OK 003+ 004+ Assert failed: 005+ TRUE === is_infinite(pow(0,-2)) 006+ Left: bool(true) 007+ Right: bool(false) 008+ 009+ Assert failed: 010+ TRUE === is_infinite(pow(0,-1)) 011+ Left: bool(true) 012+ Right: bool(false) 013+ 014+ Assert failed: 015+ TRUE === is_infinite(pow(0,-2.0)) 016+ Left: bool(true) 017+ Right: bool(false) 018+ 019+ Assert failed: 020+ TRUE === is_infinite(pow(0,-1.0)) 021+ Left: bool(true) 022+ Right: bool(false) 023+ 024+ Assert failed: 025+ TRUE === is_infinite(pow(0.0,-2.0)) 026+ Left: bool(true) 027+ Right: bool(false) 028+ 029+ Assert failed: 030+ TRUE === is_infinite(pow(0.0,-1.0)) 031+ Left: bool(true) 032+ Right: bool(false) 033+ 034+ Assert failed: 035+ TRUE === is_infinite(pow( 0.0,-2)) 036+ Left: bool(true) 037+ Right: bool(false) 038+ 039+ Assert failed: 040+ TRUE === is_infinite(pow( 0.0,-1)) 041+ Left: bool(true) 042+ Right: bool(false) 043+ 044+ Assert failed: 045+ LONG_MAX-1 === pow(LONG_MAX-1,1) 046+ Left: int(9223372036854775806) 047+ Right: int(-9223372036854775808) 048+ 049+ Assert failed: 050+ LONG_MIN+1 === pow(LONG_MIN+1,1) 051+ Left: int(-9223372036854775807) 052+ Right: int(-9223372036854775808) 053+ 054+ Assert failed: 055+ LONG_MAX === pow(LONG_MAX,1) 056+ Left: int(9223372036854775807) 057+ Right: int(-9223372036854775808) ================================================================================ ================================================================================ /php/php5/ext/standard/tests/math/round.phpt ================================================================================ ---- EXPECTED OUTPUT 1,1,0,0 OK ---- ACTUAL OUTPUT 1,1,1,1 Assert failed: LONG_MIN-1 ~== round(LONG_MIN - 0.6) Left: int(9223372036854775807) Right: float(-9.22337203685E+18) Assert failed: LONG_MIN-1 ~== floor(LONG_MIN - 0.5) Left: int(9223372036854775807) Right: float(-9.22337203685E+18) Assert failed: LONG_MAX+1 ~== ceil(LONG_MAX + 0.5) Left: int(-9223372036854775808) Right: float(9.22337203685E+18) Assert failed: LONG_MAX+1 ~== round(LONG_MAX + 0.6) Left: int(-9223372036854775808) Right: float(9.22337203685E+18) ---- FAILED ================================================================================ 001- 1,1,0,0 001+ 1,1,1,1 002- OK 002+ 003+ Assert failed: 004+ LONG_MIN-1 ~== round(LONG_MIN - 0.6) 005+ Left: int(9223372036854775807) 006+ Right: float(-9.22337203685E+18) 007+ 008+ Assert failed: 009+ LONG_MIN-1 ~== floor(LONG_MIN - 0.5) 010+ Left: int(9223372036854775807) 011+ Right: float(-9.22337203685E+18) 012+ 013+ Assert failed: 014+ LONG_MAX+1 ~== ceil(LONG_MAX + 0.5) 015+ Left: int(-9223372036854775808) 016+ Right: float(9.22337203685E+18) 017+ 018+ Assert failed: 019+ LONG_MAX+1 ~== round(LONG_MAX + 0.6) 020+ Left: int(-9223372036854775808) 021+ Right: float(9.22337203685E+18) ================================================================================ ================================================================================ /php/php5/ext/standard/tests/strings/strcspn.phpt ================================================================================ ---- EXPECTED OUTPUT string(25) "22222222aaaa bbb1111 cccc" string(4) "1234" int(0) int(7) int(6) ---- ACTUAL OUTPUT string(25) "22222222aaaa bbb1111 cccc" string(4) "1234" int(0) int(0) int(0) ---- FAILED ================================================================================ 004- int(7) 004+ int(0) 005- int(6) 005+ int(0) ================================================================================ ================================================================================ /php/php5/ext/standard/tests/strings/strspn.phpt ================================================================================ ---- EXPECTED OUTPUT string(25) "22222222aaaa bbb1111 cccc" string(4) "1234" int(8) int(6) int(3) ---- ACTUAL OUTPUT string(25) "22222222aaaa bbb1111 cccc" string(4) "1234" int(25) int(23) int(3) ---- FAILED ================================================================================ 003- int(8) 003+ int(25) 004- int(6) 004+ int(23) ================================================================================ ================================================================================ /php/php5/ext/standard/tests/time/001.phpt ================================================================================ ---- EXPECTED OUTPUT Passed: 100000 Failed: 0 ---- ACTUAL OUTPUT Passed: 18140 Failed: 81860 000002: 1043406383 0.77913200 < 1043406383 0.77913200 000004: 1043406383 0.78010800 < 1043406383 0.78010800 000005: 1043406383 0.78010800 < 1043406383 0.78010800 000006: 1043406383 0.78010800 < 1043406383 0.78010800 000008: 1043406383 0.78108500 < 1043406383 0.78108500 000009: 1043406383 0.78108500 < 1043406383 0.78108500 000010: 1043406383 0.78108500 < 1043406383 0.78108500 000012: 1043406383 0.78206100 < 1043406383 0.78206100 000013: 1043406383 0.78206100 < 1043406383 0.78206100 000015: 1043406383 0.78303800 < 1043406383 0.78303800 000016: 1043406383 0.78303800 < 1043406383 0.78303800 ---- FAILED ================================================================================ 001- Passed: 100000 001+ Passed: 18140 002- Failed: 0 002+ Failed: 81860 003+ 000002: 1043406383 0.77913200 < 1043406383 0.77913200 004+ 000004: 1043406383 0.78010800 < 1043406383 0.78010800 005+ 000005: 1043406383 0.78010800 < 1043406383 0.78010800 006+ 000006: 1043406383 0.78010800 < 1043406383 0.78010800 007+ 000008: 1043406383 0.78108500 < 1043406383 0.78108500 008+ 000009: 1043406383 0.78108500 < 1043406383 0.78108500 009+ 000010: 1043406383 0.78108500 < 1043406383 0.78108500 010+ 000012: 1043406383 0.78206100 < 1043406383 0.78206100 011+ 000013: 1043406383 0.78206100 < 1043406383 0.78206100 012+ 000015: 1043406383 0.78303800 < 1043406383 0.78303800 013+ 000016: 1043406383 0.78303800 < 1043406383 0.78303800 ================================================================================ ================================================================================ /php/php5/ext/standard/tests/time/002.phpt ================================================================================ ---- EXPECTED OUTPUT 1999-10-13 00:00:00 1999-10-13 00:00:00 2000-01-19 00:00:00 2000-01-19 00:00:00 2001-12-21 00:00:00 2001-12-21 00:00:00 2001-12-21 12:16:00 2001-12-21 12:16:00 1969-12-31 23:59:59 2001-10-22 21:19:58 2001-10-22 23:19:58 2001-10-22 23:32:58 2001-10-22 19:19:58 2001-10-22 19:06:58 1999-10-13 00:00:00 1999-10-13 00:00:00 2000-01-19 00:00:00 2000-01-19 00:00:00 2001-12-21 00:00:00 2001-12-21 00:00:00 2001-12-21 12:16:00 2001-12-21 12:16:00 1970-01-01 00:59:59 2001-10-22 21:19:58 2001-10-23 01:19:58 2001-10-23 01:32:58 2001-10-22 21:19:58 2001-10-22 21:06:58 ---- ACTUAL OUTPUT 1999-10-13 00:00:00 1999-10-13 00:00:00 2000-01-19 00:00:00 2000-01-19 00:00:00 2001-12-21 00:00:00 2001-12-21 00:00:00 2001-12-21 12:16:00 2001-12-21 12:16:00 1970-01-01 00:59:59 2001-10-22 21:19:58 2001-10-23 01:19:58 2001-10-23 01:32:58 2001-10-22 21:19:58 2001-10-22 21:06:58 1999-10-13 00:00:00 1999-10-13 00:00:00 2000-01-19 00:00:00 2000-01-19 00:00:00 2001-12-21 00:00:00 2001-12-21 00:00:00 2001-12-21 12:16:00 2001-12-21 12:16:00 1970-01-01 00:59:59 2001-10-22 21:19:58 2001-10-23 01:19:58 2001-10-23 01:32:58 2001-10-22 21:19:58 2001-10-22 21:06:58 ---- FAILED ================================================================================ 009- 1969-12-31 23:59:59 009+ 1970-01-01 00:59:59 011- 2001-10-22 23:19:58 011+ 2001-10-23 01:19:58 012- 2001-10-22 23:32:58 012+ 2001-10-23 01:32:58 013- 2001-10-22 19:19:58 013+ 2001-10-22 21:19:58 014- 2001-10-22 19:06:58 014+ 2001-10-22 21:06:58 ================================================================================ ================================================================================ BUILD ENVIRONMENT ================================================================================ OS: OSF1 Automake: automake (GNU automake) 1.4 Copyright (C) 1999 Free Software Foundation, Inc. This is free software; see the source for copying conditions. There is NO warranty; not even for MERCHANTABILITY or FITNESS FOR A PARTICULAR PURPOSE. Written by Tom Tromey <tromey@cygnus.com> Autoconf: Autoconf version 2.13 Libtool: ltmain.sh (GNU libtool) 1.4.2 (1.922.2.53 2001/09/11 03:18:52) Compiler: Compaq C V6.3-025 on Compaq Tru64 UNIX V5.1 (Rev. 732) Compiler Driver V6.3-026 (sys) cc Driver Bison: GNU Bison version 1.28 User's E-mail: novell at kiruna dot se ================================================================================ PHPINFO ================================================================================ phpinfo() PHP Version => 5.0.0-dev System => OSF1 netsrv5.netiic.com V5.1 732 alpha Build Date => Jan 24 2003 11:04:16 Configure Command => './configure' '--prefix=/usr/local/php' '--disable-all' '--disable-cgi' '--enable-sockets' '--disable-yp' '--enable-cli' '--disable-ipv6' '--enable-posix' '--enable-session' '--enable-short-path' '--enable-rpath' '--with-pear' '--with-pcre-regex' '--enable-recode' '--with-mysql=/my_db' '--enable-sysmsg' Server API => Command Line Interface Virtual Directory Support => disabled Configuration File (php.ini) Path => /usr/local/php/lib/php.ini PHP API => 20020918 PHP Extension => 20020429 Zend Extension => 90021012 Debug Build => no Thread Safety => disabled Registered PHP Streams => php, http, ftp This program makes use of the Zend Scripting Language Engine: Zend Engine v2.0.0-dev, Copyright (c) 1998-2003 Zend Technologies _______________________________________________________________________ Configuration PHP Core Directive => Local Value => Master Value allow_call_time_pass_reference => On => On allow_url_fopen => On => On always_populate_raw_post_data => Off => Off arg_separator.input => &amp; => &amp; arg_separator.output => &amp; => &amp; asp_tags => Off => Off auto_append_file => no value => no value auto_prepend_file => no value => no value browscap => no value => no value default_charset => no value => no value default_mimetype => text/html => text/html define_syslog_variables => Off => Off disable_functions => no value => no value display_errors => On => On display_startup_errors => Off => Off doc_root => no value => no value docref_ext => no value => no value docref_root => http://www.php.net/ => http://www.php.net/ enable_dl => On => On error_append_string => no value => no value error_log => no value => no value error_prepend_string => no value => no value error_reporting => 2039 => 2039 expose_php => On => On extension_dir => ./ => ./ file_uploads => On => On gpc_order => GPC => GPC highlight.bg => #FFFFFF => #FFFFFF highlight.comment => #FF8000 => #FF8000 highlight.default => #0000BB => #0000BB highlight.html => #000000 => #000000 highlight.keyword => #007700 => #007700 highlight.string => #DD0000 => #DD0000 html_errors => Off => On ignore_repeated_errors => Off => Off ignore_repeated_source => Off => Off ignore_user_abort => Off => Off implicit_flush => On => Off include_path => .:/usr/local/php/lib/php => .:/usr/local/php/lib/php log_errors => Off => Off log_errors_max_len => 1024 => 1024 magic_quotes_gpc => On => On magic_quotes_runtime => Off => Off magic_quotes_sybase => Off => Off max_execution_time => 0 => 30 max_input_time => 60 => 60 open_basedir => no value => no value output_buffering => no value => no value output_handler => no value => no value post_max_size => 8M => 8M precision => 12 => 12 register_argc_argv => On => On register_globals => Off => Off report_memleaks => On => On report_zend_debug => On => On safe_mode => On => On safe_mode_exec_dir => no value => no value safe_mode_gid => Off => Off safe_mode_include_dir => no value => no value sendmail_from => novell@kiruna.se => novell@kiruna.se sendmail_path => /usr/sbin/sendmail -t -i => /usr/sbin/sendmail -t -i short_open_tag => On => On SMTP => 10.0.1.2 => 10.0.1.2 smtp_port => 25 => 25 sql.safe_mode => Off => Off track_errors => Off => Off unserialize_callback_func => no value => no value upload_max_filesize => 2M => 2M upload_tmp_dir => no value => no value user_dir => no value => no value variables_order => EGPCS => EGPCS xmlrpc_error_number => 0 => 0 xmlrpc_errors => Off => Off y2k_compliance => On => On zend2.implicit_clone => no value => no value mysql MySQL Support => enabled Active Persistent Links => 0 Active Links => 0 Client API version => 4.0.8-gamma MYSQL_MODULE_TYPE => external MYSQL_SOCKET => /tmp/mysql.sock MYSQL_INCLUDE => -I/my_db/include/mysql MYSQL_LIBS => -L/my_db/lib/mysql -lmysqlclient Directive => Local Value => Master Value mysql.allow_persistent => On => On mysql.connect_timeout => -1 => -1 mysql.default_host => no value => no value mysql.default_password => no value => no value mysql.default_port => no value => no value mysql.default_socket => no value => no value mysql.default_user => no value => no value mysql.max_links => Unlimited => Unlimited mysql.max_persistent => Unlimited => Unlimited mysql.trace_mode => Off => Off pcre PCRE (Perl Compatible Regular Expressions) Support => enabled PCRE Library Version => 3.92 11-Sep-2002 posix Revision => $Revision: 1.54 $ session Session Support => enabled Registered save handlers => files user Directive => Local Value => Master Value session.auto_start => Off => Off session.bug_compat_42 => On => On session.bug_compat_warn => On => On session.cache_expire => 180 => 180 session.cache_limiter => nocache => nocache session.cookie_domain => no value => no value session.cookie_lifetime => 0 => 0 session.cookie_path => / => / session.cookie_secure => Off => Off session.entropy_file => no value => no value session.entropy_length => 0 => 0 session.gc_dividend => 100 => 100 session.gc_maxlifetime => 1440 => 1440 session.gc_probability => 1 => 1 session.hash_bits_per_character => 4 => 4 session.hash_function => 0 => 0 session.name => PHPSESSID => PHPSESSID session.referer_check => no value => no value session.save_handler => files => files session.save_path => /tmp => /tmp session.serialize_handler => php => php session.use_cookies => On => On session.use_only_cookies => Off => Off session.use_trans_sid => Off => Off sockets Sockets Support => enabled standard Regex Library => Bundled library enabled Dynamic Library Support => enabled Path to sendmail => /usr/sbin/sendmail -t -i Directive => Local Value => Master Value assert.active => 1 => 1 assert.bail => 0 => 0 assert.callback => no value => no value assert.quiet_eval => 0 => 0 assert.warning => 1 => 1 auto_detect_line_endings => 0 => 0 default_socket_timeout => 60 => 60 safe_mode_allowed_env_vars => PHP_ => PHP_ safe_mode_protected_env_vars => LD_LIBRARY_PATH => LD_LIBRARY_PATH url_rewriter.tags => a=href,area=href,frame=src,input=src,form=,fieldset= => a=href,area=href,frame=src,input=src,form=,fieldset= user_agent => no value => no value Additional Modules Module Name Environment Variable => Value QUERY_STRING => SSH_TTY => deleted PATH => /usr/local/bin:/usr/local/sbin:/sbin:/usr/sbin:/usr/bin:/usr/ccs/bin:/usr/bin/X11:/usr/local/php/bin OLDPWD => /php/php5/ext SCRIPT_FILENAME => CONTENT_TYPE => SSH2_TTY => /dev/pts/1 SSH_AUTH_SOCK => deleted MAKE => gmake LOGNAME => root REDIRECT_STATUS => MAKEFLAGS => MAIL => /var/spool/mail/root HOSTNAME => netsrv5.netiic.com REQUEST_METHOD => USER => root PATH_TRANSLATED => SHLVL => 1 CC => cc CONTENT_LENGTH => MAKELEVEL => 1 TEST_PHP_EXECUTABLE => /php/php5/sapi/cli/php SHELL => /bin/sh HOSTTYPE => alpha SSH2_CLIENT => 10.0.2.1 34882 10.0.1.5 22 OSTYPE => osf5.1 HOME => /root SSH_CLIENT => deleted TEST_PHP_SRCDIR => /php/php5 TERM => xterm MFLAGS => PWD => /php/php5 MACHTYPE => alpha-dec-osf5.1 PHP Variables Variable => Value _SERVER["QUERY_STRING"] => _SERVER["SSH_TTY"] => deleted _SERVER["PATH"] => /usr/local/bin:/usr/local/sbin:/sbin:/usr/sbin:/usr/bin:/usr/ccs/bin:/usr/bin/X11:/usr/local/php/bin _SERVER["OLDPWD"] => /php/php5/ext _SERVER["SCRIPT_FILENAME"] => _SERVER["CONTENT_TYPE"] => _SERVER["SSH2_TTY"] => /dev/pts/1 _SERVER["SSH_AUTH_SOCK"] => deleted _SERVER["MAKE"] => gmake _SERVER["LOGNAME"] => root _SERVER["REDIRECT_STATUS"] => _SERVER["MAKEFLAGS"] => _SERVER["MAIL"] => /var/spool/mail/root _SERVER["HOSTNAME"] => netsrv5.netiic.com _SERVER["REQUEST_METHOD"] => _SERVER["USER"] => root _SERVER["PATH_TRANSLATED"] => _SERVER["SHLVL"] => 1 _SERVER["CC"] => cc _SERVER["CONTENT_LENGTH"] => _SERVER["MAKELEVEL"] => 1 _SERVER["TEST_PHP_EXECUTABLE"] => /php/php5/sapi/cli/php _SERVER["SHELL"] => /bin/sh _SERVER["HOSTTYPE"] => alpha _SERVER["SSH2_CLIENT"] => 10.0.2.1 34882 10.0.1.5 22 _SERVER["OSTYPE"] => osf5.1 _SERVER["HOME"] => /root _SERVER["SSH_CLIENT"] => deleted _SERVER["TEST_PHP_SRCDIR"] => /php/php5 _SERVER["TERM"] => xterm _SERVER["MFLAGS"] => _SERVER["PWD"] => /php/php5 _SERVER["MACHTYPE"] => alpha-dec-osf5.1 _SERVER["PHP_SELF"] => _SERVER["SCRIPT_NAME"] => _SERVER["DOCUMENT_ROOT"] => _SERVER["argv"] => Array ( ) _SERVER["argc"] => 0 _ENV["QUERY_STRING"] => _ENV["SSH_TTY"] => deleted _ENV["PATH"] => /usr/local/bin:/usr/local/sbin:/sbin:/usr/sbin:/usr/bin:/usr/ccs/bin:/usr/bin/X11:/usr/local/php/bin _ENV["OLDPWD"] => /php/php5/ext _ENV["SCRIPT_FILENAME"] => _ENV["CONTENT_TYPE"] => _ENV["SSH2_TTY"] => /dev/pts/1 _ENV["SSH_AUTH_SOCK"] => deleted _ENV["MAKE"] => gmake _ENV["LOGNAME"] => root _ENV["REDIRECT_STATUS"] => _ENV["MAKEFLAGS"] => _ENV["MAIL"] => /var/spool/mail/root _ENV["HOSTNAME"] => netsrv5.netiic.com _ENV["REQUEST_METHOD"] => _ENV["USER"] => root _ENV["PATH_TRANSLATED"] => _ENV["SHLVL"] => 1 _ENV["CC"] => cc _ENV["CONTENT_LENGTH"] => _ENV["MAKELEVEL"] => 1 _ENV["TEST_PHP_EXECUTABLE"] => /php/php5/sapi/cli/php _ENV["SHELL"] => /bin/sh _ENV["HOSTTYPE"] => alpha _ENV["SSH2_CLIENT"] => 10.0.2.1 34882 10.0.1.5 22 _ENV["OSTYPE"] => osf5.1 _ENV["HOME"] => /root _ENV["SSH_CLIENT"] => deleted _ENV["TEST_PHP_SRCDIR"] => /php/php5 _ENV["TERM"] => xterm _ENV["MFLAGS"] => _ENV["PWD"] => /php/php5 _ENV["MACHTYPE"] => alpha-dec-osf5.1 PHP License This program is free software; you can redistribute it and/or modify it under the terms of the PHP License as published by the PHP Group and included in the distribution in the file: LICENSE This program is distributed in the hope that it will be useful, but WITHOUT ANY WARRANTY; without even the implied warranty of MERCHANTABILITY or FITNESS FOR A PARTICULAR PURPOSE. If you did not receive a copy of the PHP license, or have any questions about PHP licensing, please contact license@php.net.

« previous php.qa (#8417) next »