Test results [failed]

From: Date: Sun, 02 Feb 2003 19:07:56 +0000
Subject: Test results [failed]
Groups: php.qa 
Request: Send a blank email to php-qa+get-8690@lists.php.net to get a copy of this message
===================================================================== FAILED TEST SUMMARY --------------------------------------------------------------------- jdtojewish() function [D:\work\php5\ext\calendar\tests\jdtojewish.phpt] range() [D:\work\php5\ext\standard\tests\array\range.phpt] File type functions [D:\work\php5\ext\standard\tests\file\001.phpt] is_*() and file_exists() return values are boolean. [D:\work\php5\ext\standard\tests\file\003.phpt] Bug #21131: fopen($filename, "a+") has broken position [D:\work\php5\ext\standard\tests\file\bug21131.phpt] User-space filters [D:\work\php5\ext\standard\tests\file\userfilters.phpt] quoted_printable_decode() function test with CR/LF [D:\work\php5\ext\standard\tests\general_functions\006.phpt] MD5 / Base64 [D:\work\php5\ext\standard\tests\general_functions\007.phpt] getopt [D:\work\php5\ext\standard\tests\general_functions\getopt.phpt] GetImageSize() [D:\work\php5\ext\standard\tests\image\getimagesize.phpt] image_type_to_mime_type() [D:\work\php5\ext\standard\tests\image\image_type_to_mime_type.phpt] Various pow() tests [D:\work\php5\ext\standard\tests\math\pow.phpt] Test split() [D:\work\php5\ext\standard\tests\reg\009.phpt] unserialize() floats with E notation (#18654) [D:\work\php5\ext\standard\tests\serialize\003.phpt] Bug #21453 (handling of non-encoded <) [D:\work\php5\ext\standard\tests\strings\bug21453.phpt] nl2br() function [D:\work\php5\ext\standard\tests\strings\nl2br.phpt] wordwrap() function [D:\work\php5\ext\standard\tests\strings\wordwrap.phpt] strtotime() function [D:\work\php5\ext\standard\tests\time\002.phpt] Check for mktime with out-of-range parameters [D:\work\php5\ext\standard\tests\time\003.phpt] Testing register_shutdown_function() with timeout. (Bug: #21513) [D:\work\php5\tests\func\005a.phpt] Bug #21094 (set_error_handler not accepting methods) [D:\work\php5\tests\lang\bug21094.phpt] Bug #21600 (assign by reference function call changes variable contents) [D:\work\php5\tests\lang\bug21600.phpt] Bug #21849 (self::constant doesn't work as method's default parameter) [D:\work\php5\tests\lang\bug21849.phpt] Formatted print functions [D:\work\php5\tests\strings\002.phpt] ===================================================================== ===================================================================== TEST RESULT SUMMARY --------------------------------------------------------------------- Exts skipped : 91 Exts tested : 15 --------------------------------------------------------------------- Number of tests : 475 Tests skipped : 231 (48.6%) Tests failed : 24 ( 5.1%) Tests passed : 220 (46.3%) --------------------------------------------------------------------- Time taken : 39 seconds ===================================================================== ============================================================================ ==== D:\work\php5\ext\calendar\tests\jdtojewish.phpt ============================================================================ ==== ---- EXPECTED OUTPUT string(184) "2/22/5763 ëá çùåï äúùñâ ëá çùåï ä'úùñâ ëá çùåï ä àìôéí úùñâ ëá çùåï ä' àìôéí úùñâ ë"á çùåï äúùñ"â á' çùåï äúùñ"â á' çùåï ä'úùñ"â á' çùåï ä àìôéí úùñ"â á' çùåï ä' àìôéí úùñ"â " ---- ACTUAL OUTPUT Notice: Use of undefined constant CAL_JEWISH_ADD_ALAFIM_GERESH - assumed 'CAL_JEWISH_ADD_ALAFIM_GERESH' in D:\work\php5\ext\calendar\tests\jdtojewish.php on line 5 Warning: Wrong parameter count for jdtojewish() in D:\work\php5\ext\calendar\tests\jdtojewish.php on line 5 Notice: Use of undefined constant CAL_JEWISH_ADD_ALAFIM - assumed 'CAL_JEWISH_ADD_ALAFIM' in D:\work\php5\ext\calendar\tests\jdtojewish.php on line 6 Warning: Wrong parameter count for jdtojewish() in D:\work\php5\ext\calendar\tests\jdtojewish.php on line 6 Notice: Use of undefined constant CAL_JEWISH_ADD_ALAFIM_GERESH - assumed 'CAL_JEWISH_ADD_ALAFIM_GERESH' in D:\work\php5\ext\calendar\tests\jdtojewish.php on line 7 Notice: Use of undefined constant CAL_JEWISH_ADD_ALAFIM - assumed 'CAL_JEWISH_ADD_ALAFIM' in D:\work\php5\ext\calendar\tests\jdtojewish.php on line 7 Warning: Wrong parameter count for jdtojewish() in D:\work\php5\ext\calendar\tests\jdtojewish.php on line 7 Notice: Use of undefined constant CAL_JEWISH_ADD_GERESHAYIM - assumed 'CAL_JEWISH_ADD_GERESHAYIM' in D:\work\php5\ext\calendar\tests\jdtojewish.php on line 8 Warning: Wrong parameter count for jdtojewish() in D:\work\php5\ext\calendar\tests\jdtojewish.php on line 8 Notice: Use of undefined constant CAL_JEWISH_ADD_GERESHAYIM - assumed 'CAL_JEWISH_ADD_GERESHAYIM' in D:\work\php5\ext\calendar\tests\jdtojewish.php on line 9 Warning: Wrong parameter count for jdtojewish() in D:\work\php5\ext\calendar\tests\jdtojewish.php on line 9 Notice: Use of undefined constant CAL_JEWISH_ADD_GERESHAYIM - assumed 'CAL_JEWISH_ADD_GERESHAYIM' in D:\work\php5\ext\calendar\tests\jdtojewish.php on line 10 Notice: Use of undefined constant CAL_JEWISH_ADD_ALAFIM_GERESH - assumed 'CAL_JEWISH_ADD_ALAFIM_GERESH' in D:\work\php5\ext\calendar\tests\jdtojewish.php on line 10 Warning: Wrong parameter count for jdtojewish() in D:\work\php5\ext\calendar\tests\jdtojewish.php on line 10 Notice: Use of undefined constant CAL_JEWISH_ADD_GERESHAYIM - assumed 'CAL_JEWISH_ADD_GERESHAYIM' in D:\work\php5\ext\calendar\tests\jdtojewish.php on line 11 Notice: Use of undefined constant CAL_JEWISH_ADD_ALAFIM - assumed 'CAL_JEWISH_ADD_ALAFIM' in D:\work\php5\ext\calendar\tests\jdtojewish.php on line 11 Warning: Wrong parameter count for jdtojewish() in D:\work\php5\ext\calendar\tests\jdtojewish.php on line 11 Notice: Use of undefined constant CAL_JEWISH_ADD_GERESHAYIM - assumed 'CAL_JEWISH_ADD_GERESHAYIM' in D:\work\php5\ext\calendar\tests\jdtojewish.php on line 12 Notice: Use of undefined constant CAL_JEWISH_ADD_ALAFIM - assumed 'CAL_JEWISH_ADD_ALAFIM' in D:\work\php5\ext\calendar\tests\jdtojewish.php on line 12 Notice: Use of undefined constant CAL_JEWISH_ADD_ALAFIM_GERESH - assumed 'CAL_JEWISH_ADD_ALAFIM_GERESH' in D:\work\php5\ext\calendar\tests\jdtojewish.php on line 12 Warning: Wrong parameter count for jdtojewish() in D:\work\php5\ext\calendar\tests\jdtojewish.php on line 12 string(42) "2/22/5763 ëá çùåï äúùñâ " ---- FAILED ============================================================================ ==== 001- string(184) "2/22/5763 001+ Notice: Use of undefined constant CAL_JEWISH_ADD_ALAFIM_GERESH - assumed 'CAL_JEWISH_ADD_ALAFIM_GERESH' in D:\work\php5\ext\calendar\tests\jdtojewish.php on line 5 002- ëá çùåï äúùñâ 002+ 003- ëá çùåï ä'úùñâ 003+ Warning: Wrong parameter count for jdtojewish() in D:\work\php5\ext\calendar\tests\jdtojewish.php on line 5 004- ëá çùåï ä àìôéí úùñâ 004+ 005- ëá çùåï ä' àìôéí úùñâ 005+ Notice: Use of undefined constant CAL_JEWISH_ADD_ALAFIM - assumed 'CAL_JEWISH_ADD_ALAFIM' in D:\work\php5\ext\calendar\tests\jdtojewish.php on line 6 006- ë"á çùåï äúùñ"â 006+ 007- á' çùåï äúùñ"â 007+ Warning: Wrong parameter count for jdtojewish() in D:\work\php5\ext\calendar\tests\jdtojewish.php on line 6 008- á' çùåï ä'úùñ"â 008+ 009- á' çùåï ä àìôéí úùñ"â 009+ Notice: Use of undefined constant CAL_JEWISH_ADD_ALAFIM_GERESH - assumed 'CAL_JEWISH_ADD_ALAFIM_GERESH' in D:\work\php5\ext\calendar\tests\jdtojewish.php on line 7 010- á' çùåï ä' àìôéí úùñ"â 010+ 011- " 011+ Notice: Use of undefined constant CAL_JEWISH_ADD_ALAFIM - assumed 'CAL_JEWISH_ADD_ALAFIM' in D:\work\php5\ext\calendar\tests\jdtojewish.php on line 7 012+ 013+ Warning: Wrong parameter count for jdtojewish() in D:\work\php5\ext\calendar\tests\jdtojewish.php on line 7 014+ 015+ Notice: Use of undefined constant CAL_JEWISH_ADD_GERESHAYIM - assumed 'CAL_JEWISH_ADD_GERESHAYIM' in D:\work\php5\ext\calendar\tests\jdtojewish.php on line 8 016+ 017+ Warning: Wrong parameter count for jdtojewish() in D:\work\php5\ext\calendar\tests\jdtojewish.php on line 8 018+ 019+ Notice: Use of undefined constant CAL_JEWISH_ADD_GERESHAYIM - assumed 'CAL_JEWISH_ADD_GERESHAYIM' in D:\work\php5\ext\calendar\tests\jdtojewish.php on line 9 020+ 021+ Warning: Wrong parameter count for jdtojewish() in D:\work\php5\ext\calendar\tests\jdtojewish.php on line 9 022+ 023+ Notice: Use of undefined constant CAL_JEWISH_ADD_GERESHAYIM - assumed 'CAL_JEWISH_ADD_GERESHAYIM' in D:\work\php5\ext\calendar\tests\jdtojewish.php on line 10 024+ 025+ Notice: Use of undefined constant CAL_JEWISH_ADD_ALAFIM_GERESH - assumed 'CAL_JEWISH_ADD_ALAFIM_GERESH' in D:\work\php5\ext\calendar\tests\jdtojewish.php on line 10 026+ 027+ Warning: Wrong parameter count for jdtojewish() in D:\work\php5\ext\calendar\tests\jdtojewish.php on line 10 028+ 029+ Notice: Use of undefined constant CAL_JEWISH_ADD_GERESHAYIM - assumed 'CAL_JEWISH_ADD_GERESHAYIM' in D:\work\php5\ext\calendar\tests\jdtojewish.php on line 11 030+ 031+ Notice: Use of undefined constant CAL_JEWISH_ADD_ALAFIM - assumed 'CAL_JEWISH_ADD_ALAFIM' in D:\work\php5\ext\calendar\tests\jdtojewish.php on line 11 032+ 033+ Warning: Wrong parameter count for jdtojewish() in D:\work\php5\ext\calendar\tests\jdtojewish.php on line 11 034+ 035+ Notice: Use of undefined constant CAL_JEWISH_ADD_GERESHAYIM - assumed 'CAL_JEWISH_ADD_GERESHAYIM' in D:\work\php5\ext\calendar\tests\jdtojewish.php on line 12 036+ 037+ Notice: Use of undefined constant CAL_JEWISH_ADD_ALAFIM - assumed 'CAL_JEWISH_ADD_ALAFIM' in D:\work\php5\ext\calendar\tests\jdtojewish.php on line 12 038+ 039+ Notice: Use of undefined constant CAL_JEWISH_ADD_ALAFIM_GERESH - assumed 'CAL_JEWISH_ADD_ALAFIM_GERESH' in D:\work\php5\ext\calendar\tests\jdtojewish.php on line 12 040+ 041+ Warning: Wrong parameter count for jdtojewish() in D:\work\php5\ext\calendar\tests\jdtojewish.php on line 12 042+ string(42) "2/22/5763 043+ ëá çùåï äúùñâ 044+ 045+ 046+ 047+ 048+ 049+ 050+ 051+ 052+ " ============================================================================ ==== ============================================================================ ==== D:\work\php5\ext\standard\tests\array\range.phpt ============================================================================ ==== ---- EXPECTED OUTPUT array(100) { [0]=> int(1) [1]=> int(2) [2]=> int(3) [3]=> int(4) [4]=> int(5) [5]=> int(6) [6]=> int(7) [7]=> int(8) [8]=> int(9) [9]=> int(10) [10]=> int(11) [11]=> int(12) [12]=> int(13) [13]=> int(14) [14]=> int(15) [15]=> int(16) [16]=> int(17) [17]=> int(18) [18]=> int(19) [19]=> int(20) [20]=> int(21) [21]=> int(22) [22]=> int(23) [23]=> int(24) [24]=> int(25) [25]=> int(26) [26]=> int(27) [27]=> int(28) [28]=> int(29) [29]=> int(30) [30]=> int(31) [31]=> int(32) [32]=> int(33) [33]=> int(34) [34]=> int(35) [35]=> int(36) [36]=> int(37) [37]=> int(38) [38]=> int(39) [39]=> int(40) [40]=> int(41) [41]=> int(42) [42]=> int(43) [43]=> int(44) [44]=> int(45) [45]=> int(46) [46]=> int(47) [47]=> int(48) [48]=> int(49) [49]=> int(50) [50]=> int(51) [51]=> int(52) [52]=> int(53) [53]=> int(54) [54]=> int(55) [55]=> int(56) [56]=> int(57) [57]=> int(58) [58]=> int(59) [59]=> int(60) [60]=> int(61) [61]=> int(62) [62]=> int(63) [63]=> int(64) [64]=> int(65) [65]=> int(66) [66]=> int(67) [67]=> int(68) [68]=> int(69) [69]=> int(70) [70]=> int(71) [71]=> int(72) [72]=> int(73) [73]=> int(74) [74]=> int(75) [75]=> int(76) [76]=> int(77) [77]=> int(78) [78]=> int(79) [79]=> int(80) [80]=> int(81) [81]=> int(82) [82]=> int(83) [83]=> int(84) [84]=> int(85) [85]=> int(86) [86]=> int(87) [87]=> int(88) [88]=> int(89) [89]=> int(90) [90]=> int(91) [91]=> int(92) [92]=> int(93) [93]=> int(94) [94]=> int(95) [95]=> int(96) [96]=> int(97) [97]=> int(98) [98]=> int(99) [99]=> int(100) } array(100) { [0]=> int(100) [1]=> int(99) [2]=> int(98) [3]=> int(97) [4]=> int(96) [5]=> int(95) [6]=> int(94) [7]=> int(93) [8]=> int(92) [9]=> int(91) [10]=> int(90) [11]=> int(89) [12]=> int(88) [13]=> int(87) [14]=> int(86) [15]=> int(85) [16]=> int(84) [17]=> int(83) [18]=> int(82) [19]=> int(81) [20]=> int(80) [21]=> int(79) [22]=> int(78) [23]=> int(77) [24]=> int(76) [25]=> int(75) [26]=> int(74) [27]=> int(73) [28]=> int(72) [29]=> int(71) [30]=> int(70) [31]=> int(69) [32]=> int(68) [33]=> int(67) [34]=> int(66) [35]=> int(65) [36]=> int(64) [37]=> int(63) [38]=> int(62) [39]=> int(61) [40]=> int(60) [41]=> int(59) [42]=> int(58) [43]=> int(57) [44]=> int(56) [45]=> int(55) [46]=> int(54) [47]=> int(53) [48]=> int(52) [49]=> int(51) [50]=> int(50) [51]=> int(49) [52]=> int(48) [53]=> int(47) [54]=> int(46) [55]=> int(45) [56]=> int(44) [57]=> int(43) [58]=> int(42) [59]=> int(41) [60]=> int(40) [61]=> int(39) [62]=> int(38) [63]=> int(37) [64]=> int(36) [65]=> int(35) [66]=> int(34) [67]=> int(33) [68]=> int(32) [69]=> int(31) [70]=> int(30) [71]=> int(29) [72]=> int(28) [73]=> int(27) [74]=> int(26) [75]=> int(25) [76]=> int(24) [77]=> int(23) [78]=> int(22) [79]=> int(21) [80]=> int(20) [81]=> int(19) [82]=> int(18) [83]=> int(17) [84]=> int(16) [85]=> int(15) [86]=> int(14) [87]=> int(13) [88]=> int(12) [89]=> int(11) [90]=> int(10) [91]=> int(9) [92]=> int(8) [93]=> int(7) [94]=> int(6) [95]=> int(5) [96]=> int(4) [97]=> int(3) [98]=> int(2) [99]=> int(1) } array(100) { [0]=> int(1) [1]=> int(2) [2]=> int(3) [3]=> int(4) [4]=> int(5) [5]=> int(6) [6]=> int(7) [7]=> int(8) [8]=> int(9) [9]=> int(10) [10]=> int(11) [11]=> int(12) [12]=> int(13) [13]=> int(14) [14]=> int(15) [15]=> int(16) [16]=> int(17) [17]=> int(18) [18]=> int(19) [19]=> int(20) [20]=> int(21) [21]=> int(22) [22]=> int(23) [23]=> int(24) [24]=> int(25) [25]=> int(26) [26]=> int(27) [27]=> int(28) [28]=> int(29) [29]=> int(30) [30]=> int(31) [31]=> int(32) [32]=> int(33) [33]=> int(34) [34]=> int(35) [35]=> int(36) [36]=> int(37) [37]=> int(38) [38]=> int(39) [39]=> int(40) [40]=> int(41) [41]=> int(42) [42]=> int(43) [43]=> int(44) [44]=> int(45) [45]=> int(46) [46]=> int(47) [47]=> int(48) [48]=> int(49) [49]=> int(50) [50]=> int(51) [51]=> int(52) [52]=> int(53) [53]=> int(54) [54]=> int(55) [55]=> int(56) [56]=> int(57) [57]=> int(58) [58]=> int(59) [59]=> int(60) [60]=> int(61) [61]=> int(62) [62]=> int(63) [63]=> int(64) [64]=> int(65) [65]=> int(66) [66]=> int(67) [67]=> int(68) [68]=> int(69) [69]=> int(70) [70]=> int(71) [71]=> int(72) [72]=> int(73) [73]=> int(74) [74]=> int(75) [75]=> int(76) [76]=> int(77) [77]=> int(78) [78]=> int(79) [79]=> int(80) [80]=> int(81) [81]=> int(82) [82]=> int(83) [83]=> int(84) [84]=> int(85) [85]=> int(86) [86]=> int(87) [87]=> int(88) [88]=> int(89) [89]=> int(90) [90]=> int(91) [91]=> int(92) [92]=> int(93) [93]=> int(94) [94]=> int(95) [95]=> int(96) [96]=> int(97) [97]=> int(98) [98]=> int(99) [99]=> int(100) } array(100) { [0]=> int(100) [1]=> int(99) [2]=> int(98) [3]=> int(97) [4]=> int(96) [5]=> int(95) [6]=> int(94) [7]=> int(93) [8]=> int(92) [9]=> int(91) [10]=> int(90) [11]=> int(89) [12]=> int(88) [13]=> int(87) [14]=> int(86) [15]=> int(85) [16]=> int(84) [17]=> int(83) [18]=> int(82) [19]=> int(81) [20]=> int(80) [21]=> int(79) [22]=> int(78) [23]=> int(77) [24]=> int(76) [25]=> int(75) [26]=> int(74) [27]=> int(73) [28]=> int(72) [29]=> int(71) [30]=> int(70) [31]=> int(69) [32]=> int(68) [33]=> int(67) [34]=> int(66) [35]=> int(65) [36]=> int(64) [37]=> int(63) [38]=> int(62) [39]=> int(61) [40]=> int(60) [41]=> int(59) [42]=> int(58) [43]=> int(57) [44]=> int(56) [45]=> int(55) [46]=> int(54) [47]=> int(53) [48]=> int(52) [49]=> int(51) [50]=> int(50) [51]=> int(49) [52]=> int(48) [53]=> int(47) [54]=> int(46) [55]=> int(45) [56]=> int(44) [57]=> int(43) [58]=> int(42) [59]=> int(41) [60]=> int(40) [61]=> int(39) [62]=> int(38) [63]=> int(37) [64]=> int(36) [65]=> int(35) [66]=> int(34) [67]=> int(33) [68]=> int(32) [69]=> int(31) [70]=> int(30) [71]=> int(29) [72]=> int(28) [73]=> int(27) [74]=> int(26) [75]=> int(25) [76]=> int(24) [77]=> int(23) [78]=> int(22) [79]=> int(21) [80]=> int(20) [81]=> int(19) [82]=> int(18) [83]=> int(17) [84]=> int(16) [85]=> int(15) [86]=> int(14) [87]=> int(13) [88]=> int(12) [89]=> int(11) [90]=> int(10) [91]=> int(9) [92]=> int(8) [93]=> int(7) [94]=> int(6) [95]=> int(5) [96]=> int(4) [97]=> int(3) [98]=> int(2) [99]=> int(1) } array(26) { [0]=> string(1) "a" [1]=> string(1) "b" [2]=> string(1) "c" [3]=> string(1) "d" [4]=> string(1) "e" [5]=> string(1) "f" [6]=> string(1) "g" [7]=> string(1) "h" [8]=> string(1) "i" [9]=> string(1) "j" [10]=> string(1) "k" [11]=> string(1) "l" [12]=> string(1) "m" [13]=> string(1) "n" [14]=> string(1) "o" [15]=> string(1) "p" [16]=> string(1) "q" [17]=> string(1) "r" [18]=> string(1) "s" [19]=> string(1) "t" [20]=> string(1) "u" [21]=> string(1) "v" [22]=> string(1) "w" [23]=> string(1) "x" [24]=> string(1) "y" [25]=> string(1) "z" } array(26) { [0]=> string(1) "z" [1]=> string(1) "y" [2]=> string(1) "x" [3]=> string(1) "w" [4]=> string(1) "v" [5]=> string(1) "u" [6]=> string(1) "t" [7]=> string(1) "s" [8]=> string(1) "r" [9]=> string(1) "q" [10]=> string(1) "p" [11]=> string(1) "o" [12]=> string(1) "n" [13]=> string(1) "m" [14]=> string(1) "l" [15]=> string(1) "k" [16]=> string(1) "j" [17]=> string(1) "i" [18]=> string(1) "h" [19]=> string(1) "g" [20]=> string(1) "f" [21]=> string(1) "e" [22]=> string(1) "d" [23]=> string(1) "c" [24]=> string(1) "b" [25]=> string(1) "a" } array(1) { [0]=> string(1) "q" } array(1) { [0]=> int(5) } array(6) { [0]=> float(5.1) [1]=> float(6.1) [2]=> float(7.1) [3]=> float(8.1) [4]=> float(9.1) [5]=> float(10.1) } array(6) { [0]=> float(10.1) [1]=> float(9.1) [2]=> float(8.1) [3]=> float(7.1) [4]=> float(6.1) [5]=> float(5.1) } array(6) { [0]=> float(5.1) [1]=> float(6.1) [2]=> float(7.1) [3]=> float(8.1) [4]=> float(9.1) [5]=> float(10.1) } array(6) { [0]=> float(10.1) [1]=> float(9.1) [2]=> float(8.1) [3]=> float(7.1) [4]=> float(6.1) [5]=> float(5.1) } array(41) { [0]=> float(1) [1]=> float(1.1) [2]=> float(1.2) [3]=> float(1.3) [4]=> float(1.4) [5]=> float(1.5) [6]=> float(1.6) [7]=> float(1.7) [8]=> float(1.8) [9]=> float(1.9) [10]=> float(2) [11]=> float(2.1) [12]=> float(2.2) [13]=> float(2.3) [14]=> float(2.4) [15]=> float(2.5) [16]=> float(2.6) [17]=> float(2.7) [18]=> float(2.8) [19]=> float(2.9) [20]=> float(3) [21]=> float(3.1) [22]=> float(3.2) [23]=> float(3.3) [24]=> float(3.4) [25]=> float(3.5) [26]=> float(3.6) [27]=> float(3.7) [28]=> float(3.8) [29]=> float(3.9) [30]=> float(4) [31]=> float(4.1) [32]=> float(4.2) [33]=> float(4.3) [34]=> float(4.4) [35]=> float(4.5) [36]=> float(4.6) [37]=> float(4.7) [38]=> float(4.8) [39]=> float(4.9) [40]=> float(5) } array(41) { [0]=> float(5) [1]=> float(4.9) [2]=> float(4.8) [3]=> float(4.7) [4]=> float(4.6) [5]=> float(4.5) [6]=> float(4.4) [7]=> float(4.3) [8]=> float(4.2) [9]=> float(4.1) [10]=> float(4) [11]=> float(3.9) [12]=> float(3.8) [13]=> float(3.7) [14]=> float(3.6) [15]=> float(3.5) [16]=> float(3.4) [17]=> float(3.3) [18]=> float(3.2) [19]=> float(3.1) [20]=> float(3) [21]=> float(2.9) [22]=> float(2.8) [23]=> float(2.7) [24]=> float(2.6) [25]=> float(2.5) [26]=> float(2.4) [27]=> float(2.3) [28]=> float(2.2) [29]=> float(2.1) [30]=> float(2) [31]=> float(1.9) [32]=> float(1.8) [33]=> float(1.7) [34]=> float(1.6) [35]=> float(1.5) [36]=> float(1.4) [37]=> float(1.3) [38]=> float(1.2) [39]=> float(1.1) [40]=> float(1) } array(41) { [0]=> float(1) [1]=> float(1.1) [2]=> float(1.2) [3]=> float(1.3) [4]=> float(1.4) [5]=> float(1.5) [6]=> float(1.6) [7]=> float(1.7) [8]=> float(1.8) [9]=> float(1.9) [10]=> float(2) [11]=> float(2.1) [12]=> float(2.2) [13]=> float(2.3) [14]=> float(2.4) [15]=> float(2.5) [16]=> float(2.6) [17]=> float(2.7) [18]=> float(2.8) [19]=> float(2.9) [20]=> float(3) [21]=> float(3.1) [22]=> float(3.2) [23]=> float(3.3) [24]=> float(3.4) [25]=> float(3.5) [26]=> float(3.6) [27]=> float(3.7) [28]=> float(3.8) [29]=> float(3.9) [30]=> float(4) [31]=> float(4.1) [32]=> float(4.2) [33]=> float(4.3) [34]=> float(4.4) [35]=> float(4.5) [36]=> float(4.6) [37]=> float(4.7) [38]=> float(4.8) [39]=> float(4.9) [40]=> float(5) } array(41) { [0]=> float(1) [1]=> float(1.1) [2]=> float(1.2) [3]=> float(1.3) [4]=> float(1.4) [5]=> float(1.5) [6]=> float(1.6) [7]=> float(1.7) [8]=> float(1.8) [9]=> float(1.9) [10]=> float(2) [11]=> float(2.1) [12]=> float(2.2) [13]=> float(2.3) [14]=> float(2.4) [15]=> float(2.5) [16]=> float(2.6) [17]=> float(2.7) [18]=> float(2.8) [19]=> float(2.9) [20]=> float(3) [21]=> float(3.1) [22]=> float(3.2) [23]=> float(3.3) [24]=> float(3.4) [25]=> float(3.5) [26]=> float(3.6) [27]=> float(3.7) [28]=> float(3.8) [29]=> float(3.9) [30]=> float(4) [31]=> float(4.1) [32]=> float(4.2) [33]=> float(4.3) [34]=> float(4.4) [35]=> float(4.5) [36]=> float(4.6) [37]=> float(4.7) [38]=> float(4.8) [39]=> float(4.9) [40]=> float(5) } ---- ACTUAL OUTPUT array(100) { [0]=> int(1) [1]=> int(2) [2]=> int(3) [3]=> int(4) [4]=> int(5) [5]=> int(6) [6]=> int(7) [7]=> int(8) [8]=> int(9) [9]=> int(10) [10]=> int(11) [11]=> int(12) [12]=> int(13) [13]=> int(14) [14]=> int(15) [15]=> int(16) [16]=> int(17) [17]=> int(18) [18]=> int(19) [19]=> int(20) [20]=> int(21) [21]=> int(22) [22]=> int(23) [23]=> int(24) [24]=> int(25) [25]=> int(26) [26]=> int(27) [27]=> int(28) [28]=> int(29) [29]=> int(30) [30]=> int(31) [31]=> int(32) [32]=> int(33) [33]=> int(34) [34]=> int(35) [35]=> int(36) [36]=> int(37) [37]=> int(38) [38]=> int(39) [39]=> int(40) [40]=> int(41) [41]=> int(42) [42]=> int(43) [43]=> int(44) [44]=> int(45) [45]=> int(46) [46]=> int(47) [47]=> int(48) [48]=> int(49) [49]=> int(50) [50]=> int(51) [51]=> int(52) [52]=> int(53) [53]=> int(54) [54]=> int(55) [55]=> int(56) [56]=> int(57) [57]=> int(58) [58]=> int(59) [59]=> int(60) [60]=> int(61) [61]=> int(62) [62]=> int(63) [63]=> int(64) [64]=> int(65) [65]=> int(66) [66]=> int(67) [67]=> int(68) [68]=> int(69) [69]=> int(70) [70]=> int(71) [71]=> int(72) [72]=> int(73) [73]=> int(74) [74]=> int(75) [75]=> int(76) [76]=> int(77) [77]=> int(78) [78]=> int(79) [79]=> int(80) [80]=> int(81) [81]=> int(82) [82]=> int(83) [83]=> int(84) [84]=> int(85) [85]=> int(86) [86]=> int(87) [87]=> int(88) [88]=> int(89) [89]=> int(90) [90]=> int(91) [91]=> int(92) [92]=> int(93) [93]=> int(94) [94]=> int(95) [95]=> int(96) [96]=> int(97) [97]=> int(98) [98]=> int(99) [99]=> int(100) } array(100) { [0]=> int(100) [1]=> int(99) [2]=> int(98) [3]=> int(97) [4]=> int(96) [5]=> int(95) [6]=> int(94) [7]=> int(93) [8]=> int(92) [9]=> int(91) [10]=> int(90) [11]=> int(89) [12]=> int(88) [13]=> int(87) [14]=> int(86) [15]=> int(85) [16]=> int(84) [17]=> int(83) [18]=> int(82) [19]=> int(81) [20]=> int(80) [21]=> int(79) [22]=> int(78) [23]=> int(77) [24]=> int(76) [25]=> int(75) [26]=> int(74) [27]=> int(73) [28]=> int(72) [29]=> int(71) [30]=> int(70) [31]=> int(69) [32]=> int(68) [33]=> int(67) [34]=> int(66) [35]=> int(65) [36]=> int(64) [37]=> int(63) [38]=> int(62) [39]=> int(61) [40]=> int(60) [41]=> int(59) [42]=> int(58) [43]=> int(57) [44]=> int(56) [45]=> int(55) [46]=> int(54) [47]=> int(53) [48]=> int(52) [49]=> int(51) [50]=> int(50) [51]=> int(49) [52]=> int(48) [53]=> int(47) [54]=> int(46) [55]=> int(45) [56]=> int(44) [57]=> int(43) [58]=> int(42) [59]=> int(41) [60]=> int(40) [61]=> int(39) [62]=> int(38) [63]=> int(37) [64]=> int(36) [65]=> int(35) [66]=> int(34) [67]=> int(33) [68]=> int(32) [69]=> int(31) [70]=> int(30) [71]=> int(29) [72]=> int(28) [73]=> int(27) [74]=> int(26) [75]=> int(25) [76]=> int(24) [77]=> int(23) [78]=> int(22) [79]=> int(21) [80]=> int(20) [81]=> int(19) [82]=> int(18) [83]=> int(17) [84]=> int(16) [85]=> int(15) [86]=> int(14) [87]=> int(13) [88]=> int(12) [89]=> int(11) [90]=> int(10) [91]=> int(9) [92]=> int(8) [93]=> int(7) [94]=> int(6) [95]=> int(5) [96]=> int(4) [97]=> int(3) [98]=> int(2) [99]=> int(1) } array(1) { [0]=> string(1) "1" } array(1) { [0]=> string(1) "1" } array(26) { [0]=> string(1) "a" [1]=> string(1) "b" [2]=> string(1) "c" [3]=> string(1) "d" [4]=> string(1) "e" [5]=> string(1) "f" [6]=> string(1) "g" [7]=> string(1) "h" [8]=> string(1) "i" [9]=> string(1) "j" [10]=> string(1) "k" [11]=> string(1) "l" [12]=> string(1) "m" [13]=> string(1) "n" [14]=> string(1) "o" [15]=> string(1) "p" [16]=> string(1) "q" [17]=> string(1) "r" [18]=> string(1) "s" [19]=> string(1) "t" [20]=> string(1) "u" [21]=> string(1) "v" [22]=> string(1) "w" [23]=> string(1) "x" [24]=> string(1) "y" [25]=> string(1) "z" } array(26) { [0]=> string(1) "z" [1]=> string(1) "y" [2]=> string(1) "x" [3]=> string(1) "w" [4]=> string(1) "v" [5]=> string(1) "u" [6]=> string(1) "t" [7]=> string(1) "s" [8]=> string(1) "r" [9]=> string(1) "q" [10]=> string(1) "p" [11]=> string(1) "o" [12]=> string(1) "n" [13]=> string(1) "m" [14]=> string(1) "l" [15]=> string(1) "k" [16]=> string(1) "j" [17]=> string(1) "i" [18]=> string(1) "h" [19]=> string(1) "g" [20]=> string(1) "f" [21]=> string(1) "e" [22]=> string(1) "d" [23]=> string(1) "c" [24]=> string(1) "b" [25]=> string(1) "a" } array(1) { [0]=> string(1) "q" } array(1) { [0]=> int(5) } array(6) { [0]=> int(5) [1]=> int(6) [2]=> int(7) [3]=> int(8) [4]=> int(9) [5]=> int(10) } array(6) { [0]=> int(10) [1]=> int(9) [2]=> int(8) [3]=> int(7) [4]=> int(6) [5]=> int(5) } array(5) { [0]=> string(1) "5" [1]=> string(1) "4" [2]=> string(1) "3" [3]=> string(1) "2" [4]=> string(1) "1" } array(5) { [0]=> string(1) "1" [1]=> string(1) "2" [2]=> string(1) "3" [3]=> string(1) "4" [4]=> string(1) "5" } Warning: Wrong parameter count for range() in D:\work\php5\ext\standard\tests\array\range.php on line 20 NULL Warning: Wrong parameter count for range() in D:\work\php5\ext\standard\tests\array\range.php on line 21 NULL Warning: Wrong parameter count for range() in D:\work\php5\ext\standard\tests\array\range.php on line 23 NULL Warning: Wrong parameter count for range() in D:\work\php5\ext\standard\tests\array\range.php on line 24 NULL ---- FAILED ============================================================================ ==== 1001- float(1.9) 1002- [10]=> 1003- float(2) 1004- [11]=> 1005- float(2.1) 1006- [12]=> 1007- float(2.2) 1008- [13]=> 1009- float(2.3) 1010- [14]=> 1011- float(2.4) 1012- [15]=> 1013- float(2.5) 1014- [16]=> 1015- float(2.6) 1016- [17]=> 1017- float(2.7) 1018- [18]=> 1019- float(2.8) 1020- [19]=> 1021- float(2.9) 1022- [20]=> 1023- float(3) 1024- [21]=> 1025- float(3.1) 1026- [22]=> 1027- float(3.2) 1028- [23]=> 1029- float(3.3) 1030- [24]=> 1031- float(3.4) 1032- [25]=> 1033- float(3.5) 1034- [26]=> 1035- float(3.6) 1036- [27]=> 1037- float(3.7) 1038- [28]=> 1039- float(3.8) 1040- [29]=> 1041- float(3.9) 1042- [30]=> 1043- float(4) 1044- [31]=> 1045- float(4.1) 1046- [32]=> 1047- float(4.2) 1048- [33]=> 1049- float(4.3) 1050- [34]=> 1051- float(4.4) 1052- [35]=> 1053- float(4.5) 1054- [36]=> 1055- float(4.6) 1056- [37]=> 1057- float(4.7) 1058- [38]=> 1059- float(4.8) 1060- [39]=> 1061- float(4.9) 1062- [40]=> 1063- float(5) 1064- } 1065- array(41) { 1066- [0]=> 1067- float(5) 1068- [1]=> 1069- float(4.9) 1070- [2]=> 1071- float(4.8) 1072- [3]=> 1073- float(4.7) 1074- [4]=> 1075- float(4.6) 1076- [5]=> 1077- float(4.5) 1078- [6]=> 1079- float(4.4) 1080- [7]=> 1081- float(4.3) 1082- [8]=> 1083- float(4.2) 1084- [9]=> 1085- float(4.1) 1086- [10]=> 1087- float(4) 1088- [11]=> 1089- float(3.9) 1090- [12]=> 1091- float(3.8) 1092- [13]=> 1093- float(3.7) 1094- [14]=> 1095- float(3.6) 1096- [15]=> 1097- float(3.5) 1098- [16]=> 1099- float(3.4) 1100- [17]=> 1101- float(3.3) 1102- [18]=> 1103- float(3.2) 1104- [19]=> 1105- float(3.1) 1106- [20]=> 1107- float(3) 1108- [21]=> 1109- float(2.9) 1110- [22]=> 1111- float(2.8) 1112- [23]=> 1113- float(2.7) 1114- [24]=> 1115- float(2.6) 1116- [25]=> 1117- float(2.5) 1118- [26]=> 1119- float(2.4) 1120- [27]=> 1121- float(2.3) 1122- [28]=> 1123- float(2.2) 1124- [29]=> 1125- float(2.1) 1126- [30]=> 1127- float(2) 1128- [31]=> 1129- float(1.9) 1130- [32]=> 1131- float(1.8) 1132- [33]=> 1133- float(1.7) 1134- [34]=> 1135- float(1.6) 1136- [35]=> 1137- float(1.5) 1138- [36]=> 1139- float(1.4) 1140- [37]=> 1141- float(1.3) 1142- [38]=> 1143- float(1.2) 1144- [39]=> 1145- float(1.1) 1146- [40]=> 1147- float(1) 1148- } 1149- array(41) { 1150- [0]=> 1151- float(1) 1152- [1]=> 1153- float(1.1) 1154- [2]=> 1155- float(1.2) 1156- [3]=> 1157- float(1.3) 1158- [4]=> 1159- float(1.4) 1160- [5]=> 1161- float(1.5) 1162- [6]=> 1163- float(1.6) 1164- [7]=> 1165- float(1.7) 1166- [8]=> 1167- float(1.8) 1168- [9]=> 1169- float(1.9) 1170- [10]=> 1171- float(2) 1172- [11]=> 1173- float(2.1) 1174- [12]=> 1175- float(2.2) 1176- [13]=> 1177- float(2.3) 1178- [14]=> 1179- float(2.4) 1180- [15]=> 1181- float(2.5) 1182- [16]=> 1183- float(2.6) 1184- [17]=> 1185- float(2.7) 1186- [18]=> 1187- float(2.8) 1188- [19]=> 1189- float(2.9) 1190- [20]=> 1191- float(3) 1192- [21]=> 1193- float(3.1) 1194- [22]=> 1195- float(3.2) 1196- [23]=> 1197- float(3.3) 1198- [24]=> 1199- float(3.4) 1200- [25]=> 1201- float(3.5) 1202- [26]=> 1203- float(3.6) 1204- [27]=> 1205- float(3.7) 1206- [28]=> 1207- float(3.8) 1208- [29]=> 1209- float(3.9) 1210- [30]=> 1211- float(4) 1212- [31]=> 1213- float(4.1) 1214- [32]=> 1215- float(4.2) 1216- [33]=> 1217- float(4.3) 1218- [34]=> 1219- float(4.4) 1220- [35]=> 1221- float(4.5) 1222- [36]=> 1223- float(4.6) 1224- [37]=> 1225- float(4.7) 1226- [38]=> 1227- float(4.8) 1228- [39]=> 1229- float(4.9) 1230- [40]=> 1231- float(5) 1232- } 1233- array(41) { 1234- [0]=> 1235- float(1) 1236- [1]=> 1237- float(1.1) 1238- [2]=> 1239- float(1.2) 1240- [3]=> 1241- float(1.3) 1242- [4]=> 1243- float(1.4) 1244- [5]=> 1245- float(1.5) 1246- [6]=> 1247- float(1.6) 1248- [7]=> 1249- float(1.7) 1250- [8]=> 1251- float(1.8) 1252- [9]=> 1253- float(1.9) 1254- [10]=> 1255- float(2) 1256- [11]=> 1257- float(2.1) 1258- [12]=> 1259- float(2.2) 1260- [13]=> 1261- float(2.3) 1262- [14]=> 1263- float(2.4) 1264- [15]=> 1265- float(2.5) 1266- [16]=> 1267- float(2.6) 1268- [17]=> 1269- float(2.7) 1270- [18]=> 1271- float(2.8) 1272- [19]=> 1273- float(2.9) 1274- [20]=> 1275- float(3) 1276- [21]=> 1277- float(3.1) 1278- [22]=> 1279- float(3.2) 1280- [23]=> 1281- float(3.3) 1282- [24]=> 1283- float(3.4) 1284- [25]=> 1285- float(3.5) 1286- [26]=> 1287- float(3.6) 1288- [27]=> 1289- float(3.7) 1290- [28]=> 1291- float(3.8) 1292- [29]=> 1293- float(3.9) 1294- [30]=> 1295- float(4) 1296- [31]=> 1297- float(4.1) 1298- [32]=> 1299- float(4.2) 1300- [33]=> 1301- float(4.3) 1302- [34]=> 1303- float(4.4) 1304- [35]=> 1305- float(4.5) 1306- [36]=> 1307- float(4.6) 1308- [37]=> 1309- float(4.7) 1310- [38]=> 1311- float(4.8) 1312- [39]=> 1313- float(4.9) 1314- [40]=> 1315- float(5) 1316- } 405- array(100) { 405+ array(1) { 407- int(1) 407+ string(1) "1" 408- [1]=> 408+ } 409- int(2) 409+ array(1) { 410- [2]=> 410+ [0]=> 411- int(3) 411+ string(1) "1" 412- [3]=> 412+ } 413- int(4) 413+ array(26) { 414- [4]=> 414+ [0]=> 415- int(5) 415+ string(1) "a" 416- [5]=> 416+ [1]=> 417- int(6) 417+ string(1) "b" 418- [6]=> 418+ [2]=> 419- int(7) 419+ string(1) "c" 420- [7]=> 420+ [3]=> 421- int(8) 421+ string(1) "d" 422- [8]=> 422+ [4]=> 423- int(9) 423+ string(1) "e" 424- [9]=> 424+ [5]=> 425- int(10) 425+ string(1) "f" 426- [10]=> 426+ [6]=> 427- int(11) 427+ string(1) "g" 428- [11]=> 428+ [7]=> 429- int(12) 429+ string(1) "h" 430- [12]=> 430+ [8]=> 431- int(13) 431+ string(1) "i" 432- [13]=> 432+ [9]=> 433- int(14) 433+ string(1) "j" 434- [14]=> 434+ [10]=> 435- int(15) 435+ string(1) "k" 436- [15]=> 436+ [11]=> 437- int(16) 437+ string(1) "l" 438- [16]=> 438+ [12]=> 439- int(17) 439+ string(1) "m" 440- [17]=> 440+ [13]=> 441- int(18) 441+ string(1) "n" 442- [18]=> 442+ [14]=> 443- int(19) 443+ string(1) "o" 444- [19]=> 444+ [15]=> 445- int(20) 445+ string(1) "p" 446- [20]=> 446+ [16]=> 447- int(21) 447+ string(1) "q" 448- [21]=> 448+ [17]=> 449- int(22) 449+ string(1) "r" 450- [22]=> 450+ [18]=> 451- int(23) 451+ string(1) "s" 452- [23]=> 452+ [19]=> 453- int(24) 453+ string(1) "t" 454- [24]=> 454+ [20]=> 455- int(25) 455+ string(1) "u" 456- [25]=> 456+ [21]=> 457- int(26) 457+ string(1) "v" 458- [26]=> 458+ [22]=> 459- int(27) 459+ string(1) "w" 460- [27]=> 460+ [23]=> 461- int(28) 461+ string(1) "x" 462- [28]=> 462+ [24]=> 463- int(29) 463+ string(1) "y" 464- [29]=> 464+ [25]=> 465- int(30) 465+ string(1) "z" 466- [30]=> 466+ } 467- int(31) 467+ array(26) { 468- [31]=> 468+ [0]=> 469- int(32) 469+ string(1) "z" 470- [32]=> 470+ [1]=> 471- int(33) 471+ string(1) "y" 472- [33]=> 472+ [2]=> 473- int(34) 473+ string(1) "x" 474- [34]=> 474+ [3]=> 475- int(35) 475+ string(1) "w" 476- [35]=> 476+ [4]=> 477- int(36) 477+ string(1) "v" 478- [36]=> 478+ [5]=> 479- int(37) 479+ string(1) "u" 480- [37]=> 480+ [6]=> 481- int(38) 481+ string(1) "t" 482- [38]=> 482+ [7]=> 483- int(39) 483+ string(1) "s" 484- [39]=> 484+ [8]=> 485- int(40) 485+ string(1) "r" 486- [40]=> 486+ [9]=> 487- int(41) 487+ string(1) "q" 488- [41]=> 488+ [10]=> 489- int(42) 489+ string(1) "p" 490- [42]=> 490+ [11]=> 491- int(43) 491+ string(1) "o" 492- [43]=> 492+ [12]=> 493- int(44) 493+ string(1) "n" 494- [44]=> 494+ [13]=> 495- int(45) 495+ string(1) "m" 496- [45]=> 496+ [14]=> 497- int(46) 497+ string(1) "l" 498- [46]=> 498+ [15]=> 499- int(47) 499+ string(1) "k" 500- [47]=> 500+ [16]=> 501- int(48) 501+ string(1) "j" 502- [48]=> 502+ [17]=> 503- int(49) 503+ string(1) "i" 504- [49]=> 504+ [18]=> 505- int(50) 505+ string(1) "h" 506- [50]=> 506+ [19]=> 507- int(51) 507+ string(1) "g" 508- [51]=> 508+ [20]=> 509- int(52) 509+ string(1) "f" 510- [52]=> 510+ [21]=> 511- int(53) 511+ string(1) "e" 512- [53]=> 512+ [22]=> 513- int(54) 513+ string(1) "d" 514- [54]=> 514+ [23]=> 515- int(55) 515+ string(1) "c" 516- [55]=> 516+ [24]=> 517- int(56) 517+ string(1) "b" 518- [56]=> 518+ [25]=> 519- int(57) 519+ string(1) "a" 520- [57]=> 520+ } 521- int(58) 521+ array(1) { 522- [58]=> 522+ [0]=> 523- int(59) 523+ string(1) "q" 524- [59]=> 524+ } 525- int(60) 525+ array(1) { 526- [60]=> 526+ [0]=> 527- int(61) 527+ int(5) 528- [61]=> 528+ } 529- int(62) 529+ array(6) { 530- [62]=> 530+ [0]=> 531- int(63) 531+ int(5) 532- [63]=> 532+ [1]=> 533- int(64) 533+ int(6) 534- [64]=> 534+ [2]=> 535- int(65) 535+ int(7) 536- [65]=> 536+ [3]=> 537- int(66) 537+ int(8) 538- [66]=> 538+ [4]=> 539- int(67) 539+ int(9) 540- [67]=> 540+ [5]=> 541- int(68) 541+ int(10) 542- [68]=> 542+ } 543- int(69) 543+ array(6) { 544- [69]=> 544+ [0]=> 545- int(70) 545+ int(10) 546- [70]=> 546+ [1]=> 547- int(71) 547+ int(9) 548- [71]=> 548+ [2]=> 549- int(72) 549+ int(8) 550- [72]=> 550+ [3]=> 551- int(73) 551+ int(7) 552- [73]=> 552+ [4]=> 553- int(74) 553+ int(6) 554- [74]=> 554+ [5]=> 555- int(75) 555+ int(5) 556- [75]=> 556+ } 557- int(76) 557+ array(5) { 558- [76]=> 558+ [0]=> 559- int(77) 559+ string(1) "5" 560- [77]=> 560+ [1]=> 561- int(78) 561+ string(1) "4" 562- [78]=> 562+ [2]=> 563- int(79) 563+ string(1) "3" 564- [79]=> 564+ [3]=> 565- int(80) 565+ string(1) "2" 566- [80]=> 566+ [4]=> 567- int(81) 567+ string(1) "1" 568- [81]=> 568+ } 569- int(82) 569+ array(5) { 570- [82]=> 570+ [0]=> 571- int(83) 571+ string(1) "1" 572- [83]=> 572+ [1]=> 573- int(84) 573+ string(1) "2" 574- [84]=> 574+ [2]=> 575- int(85) 575+ string(1) "3" 576- [85]=> 576+ [3]=> 577- int(86) 577+ string(1) "4" 578- [86]=> 578+ [4]=> 579- int(87) 579+ string(1) "5" 580- [87]=> 580+ } 581- int(88) 581+ 582- [88]=> 582+ Warning: Wrong parameter count for range() in D:\work\php5\ext\standard\tests\array\range.php on line 20 583- int(89) 583+ NULL 584- [89]=> 584+ 585- int(90) 585+ Warning: Wrong parameter count for range() in D:\work\php5\ext\standard\tests\array\range.php on line 21 586- [90]=> 586+ NULL 587- int(91) 587+ 588- [91]=> 588+ Warning: Wrong parameter count for range() in D:\work\php5\ext\standard\tests\array\range.php on line 23 589- int(92) 589+ NULL 590- [92]=> 590+ 591- int(93) 591+ Warning: Wrong parameter count for range() in D:\work\php5\ext\standard\tests\array\range.php on line 24 592- [93]=> 592+ NULL 593- int(94) 594- [94]=> 595- int(95) 596- [95]=> 597- int(96) 598- [96]=> 599- int(97) 600- [97]=> 601- int(98) 602- [98]=> 603- int(99) 604- [99]=> 605- int(100) 606- } 607- array(100) { 608- [0]=> 609- int(100) 610- [1]=> 611- int(99) 612- [2]=> 613- int(98) 614- [3]=> 615- int(97) 616- [4]=> 617- int(96) 618- [5]=> 619- int(95) 620- [6]=> 621- int(94) 622- [7]=> 623- int(93) 624- [8]=> 625- int(92) 626- [9]=> 627- int(91) 628- [10]=> 629- int(90) 630- [11]=> 631- int(89) 632- [12]=> 633- int(88) 634- [13]=> 635- int(87) 636- [14]=> 637- int(86) 638- [15]=> 639- int(85) 640- [16]=> 641- int(84) 642- [17]=> 643- int(83) 644- [18]=> 645- int(82) 646- [19]=> 647- int(81) 648- [20]=> 649- int(80) 650- [21]=> 651- int(79) 652- [22]=> 653- int(78) 654- [23]=> 655- int(77) 656- [24]=> 657- int(76) 658- [25]=> 659- int(75) 660- [26]=> 661- int(74) 662- [27]=> 663- int(73) 664- [28]=> 665- int(72) 666- [29]=> 667- int(71) 668- [30]=> 669- int(70) 670- [31]=> 671- int(69) 672- [32]=> 673- int(68) 674- [33]=> 675- int(67) 676- [34]=> 677- int(66) 678- [35]=> 679- int(65) 680- [36]=> 681- int(64) 682- [37]=> 683- int(63) 684- [38]=> 685- int(62) 686- [39]=> 687- int(61) 688- [40]=> 689- int(60) 690- [41]=> 691- int(59) 692- [42]=> 693- int(58) 694- [43]=> 695- int(57) 696- [44]=> 697- int(56) 698- [45]=> 699- int(55) 700- [46]=> 701- int(54) 702- [47]=> 703- int(53) 704- [48]=> 705- int(52) 706- [49]=> 707- int(51) 708- [50]=> 709- int(50) 710- [51]=> 711- int(49) 712- [52]=> 713- int(48) 714- [53]=> 715- int(47) 716- [54]=> 717- int(46) 718- [55]=> 719- int(45) 720- [56]=> 721- int(44) 722- [57]=> 723- int(43) 724- [58]=> 725- int(42) 726- [59]=> 727- int(41) 728- [60]=> 729- int(40) 730- [61]=> 731- int(39) 732- [62]=> 733- int(38) 734- [63]=> 735- int(37) 736- [64]=> 737- int(36) 738- [65]=> 739- int(35) 740- [66]=> 741- int(34) 742- [67]=> 743- int(33) 744- [68]=> 745- int(32) 746- [69]=> 747- int(31) 748- [70]=> 749- int(30) 750- [71]=> 751- int(29) 752- [72]=> 753- int(28) 754- [73]=> 755- int(27) 756- [74]=> 757- int(26) 758- [75]=> 759- int(25) 760- [76]=> 761- int(24) 762- [77]=> 763- int(23) 764- [78]=> 765- int(22) 766- [79]=> 767- int(21) 768- [80]=> 769- int(20) 770- [81]=> 771- int(19) 772- [82]=> 773- int(18) 774- [83]=> 775- int(17) 776- [84]=> 777- int(16) 778- [85]=> 779- int(15) 780- [86]=> 781- int(14) 782- [87]=> 783- int(13) 784- [88]=> 785- int(12) 786- [89]=> 787- int(11) 788- [90]=> 789- int(10) 790- [91]=> 791- int(9) 792- [92]=> 793- int(8) 794- [93]=> 795- int(7) 796- [94]=> 797- int(6) 798- [95]=> 799- int(5) 800- [96]=> 801- int(4) 802- [97]=> 803- int(3) 804- [98]=> 805- int(2) 806- [99]=> 807- int(1) 808- } 809- array(26) { 810- [0]=> 811- string(1) "a" 812- [1]=> 813- string(1) "b" 814- [2]=> 815- string(1) "c" 816- [3]=> 817- string(1) "d" 818- [4]=> 819- string(1) "e" 820- [5]=> 821- string(1) "f" 822- [6]=> 823- string(1) "g" 824- [7]=> 825- string(1) "h" 826- [8]=> 827- string(1) "i" 828- [9]=> 829- string(1) "j" 830- [10]=> 831- string(1) "k" 832- [11]=> 833- string(1) "l" 834- [12]=> 835- string(1) "m" 836- [13]=> 837- string(1) "n" 838- [14]=> 839- string(1) "o" 840- [15]=> 841- string(1) "p" 842- [16]=> 843- string(1) "q" 844- [17]=> 845- string(1) "r" 846- [18]=> 847- string(1) "s" 848- [19]=> 849- string(1) "t" 850- [20]=> 851- string(1) "u" 852- [21]=> 853- string(1) "v" 854- [22]=> 855- string(1) "w" 856- [23]=> 857- string(1) "x" 858- [24]=> 859- string(1) "y" 860- [25]=> 861- string(1) "z" 862- } 863- array(26) { 864- [0]=> 865- string(1) "z" 866- [1]=> 867- string(1) "y" 868- [2]=> 869- string(1) "x" 870- [3]=> 871- string(1) "w" 872- [4]=> 873- string(1) "v" 874- [5]=> 875- string(1) "u" 876- [6]=> 877- string(1) "t" 878- [7]=> 879- string(1) "s" 880- [8]=> 881- string(1) "r" 882- [9]=> 883- string(1) "q" 884- [10]=> 885- string(1) "p" 886- [11]=> 887- string(1) "o" 888- [12]=> 889- string(1) "n" 890- [13]=> 891- string(1) "m" 892- [14]=> 893- string(1) "l" 894- [15]=> 895- string(1) "k" 896- [16]=> 897- string(1) "j" 898- [17]=> 899- string(1) "i" 900- [18]=> 901- string(1) "h" 902- [19]=> 903- string(1) "g" 904- [20]=> 905- string(1) "f" 906- [21]=> 907- string(1) "e" 908- [22]=> 909- string(1) "d" 910- [23]=> 911- string(1) "c" 912- [24]=> 913- string(1) "b" 914- [25]=> 915- string(1) "a" 916- } 917- array(1) { 918- [0]=> 919- string(1) "q" 920- } 921- array(1) { 922- [0]=> 923- int(5) 924- } 925- array(6) { 926- [0]=> 927- float(5.1) 928- [1]=> 929- float(6.1) 930- [2]=> 931- float(7.1) 932- [3]=> 933- float(8.1) 934- [4]=> 935- float(9.1) 936- [5]=> 937- float(10.1) 938- } 939- array(6) { 940- [0]=> 941- float(10.1) 942- [1]=> 943- float(9.1) 944- [2]=> 945- float(8.1) 946- [3]=> 947- float(7.1) 948- [4]=> 949- float(6.1) 950- [5]=> 951- float(5.1) 952- } 953- array(6) { 954- [0]=> 955- float(5.1) 956- [1]=> 957- float(6.1) 958- [2]=> 959- float(7.1) 960- [3]=> 961- float(8.1) 962- [4]=> 963- float(9.1) 964- [5]=> 965- float(10.1) 966- } 967- array(6) { 968- [0]=> 969- float(10.1) 970- [1]=> 971- float(9.1) 972- [2]=> 973- float(8.1) 974- [3]=> 975- float(7.1) 976- [4]=> 977- float(6.1) 978- [5]=> 979- float(5.1) 980- } 981- array(41) { 982- [0]=> 983- float(1) 984- [1]=> 985- float(1.1) 986- [2]=> 987- float(1.2) 988- [3]=> 989- float(1.3) 990- [4]=> 991- float(1.4) 992- [5]=> 993- float(1.5) 994- [6]=> 995- float(1.6) 996- [7]=> 997- float(1.7) 998- [8]=> 999- float(1.8) 1000- [9]=> ============================================================================ ==== ============================================================================ ==== D:\work\php5\ext\standard\tests\file\001.phpt ============================================================================ ==== ---- EXPECTED OUTPUT test.file does not exist test.file exists test.link exists test.file is not a symlink test.link is a symlink test.file exists test.link lstat and stat differ at element 1 test.link lstat and stat differ at element 2 test.link lstat and stat differ at element 7 test.link lstat and stat differ at element 8 test.link lstat and stat differ at element 9 test.link lstat and stat differ at element 10 test.file is file test.link is link test.file permissions are 0744 test.file size is 0 test.file is writeable test.file is readable test.file is executable test.file is a regular file test.link is a regular file test.link is not a directory ../file is a directory test.file is not a directory test.file does not exist test.file does not exist ---- ACTUAL OUTPUT test.file does not exist test.file exists Fatal error: Call to undefined function: symlink() in D:\work\php5\ext\standard\tests\file\001.php on line 18 ---- FAILED ============================================================================ ==== 003- test.link exists 003+ 004- test.file is not a symlink 004+ Fatal error: Call to undefined function: symlink() in D:\work\php5\ext\standard\tests\file\001.php on line 18 005- test.link is a symlink 006- test.file exists 007- test.link lstat and stat differ at element 1 008- test.link lstat and stat differ at element 2 009- test.link lstat and stat differ at element 7 010- test.link lstat and stat differ at element 8 011- test.link lstat and stat differ at element 9 012- test.link lstat and stat differ at element 10 013- test.file is file 014- test.link is link 015- test.file permissions are 0744 016- test.file size is 0 017- test.file is writeable 018- test.file is readable 019- test.file is executable 020- test.file is a regular file 021- test.link is a regular file 022- test.link is not a directory 023- ../file is a directory 024- test.file is not a directory 025- test.file does not exist 026- test.file does not exist ============================================================================ ==== ============================================================================ ==== D:\work\php5\ext\standard\tests\file\003.phpt ============================================================================ ==== ---- EXPECTED OUTPUT boolean boolean boolean boolean boolean boolean boolean boolean boolean boolean ---- ACTUAL OUTPUT boolean boolean Fatal error: Call to undefined function: is_executable() in D:\work\php5\ext\standard\tests\file\003.php on line 14 ---- FAILED ============================================================================ ==== 003- boolean 003+ 004- boolean 004+ Fatal error: Call to undefined function: is_executable() in D:\work\php5\ext\standard\tests\file\003.php on line 14 005- boolean 006- boolean 007- boolean 008- boolean 009- boolean 010- boolean ============================================================================ ==== ============================================================================ ==== D:\work\php5\ext\standard\tests\file\bug21131.phpt ============================================================================ ==== ---- EXPECTED OUTPUT int(6) int(0) foobar ---- ACTUAL OUTPUT int(0) int(0) foobar ---- FAILED ============================================================================ ==== 001- int(6) 001+ int(0) ============================================================================ ==== ============================================================================ ==== D:\work\php5\ext\standard\tests\file\userfilters.phpt ============================================================================ ==== ---- EXPECTED OUTPUT bool(true) oncreate: string(16) "string.uppercase" NULL bool(true) read: read: string(11) "HELLO THERE" flush: onclose: ---- ACTUAL OUTPUT Fatal error: Class uppercasefilter: Cannot inherit from undefined class php_user_filter in D:\work\php5\ext\standard\tests\file\userfilters.php on line 4 ---- FAILED ============================================================================ ==== 001- bool(true) 001+ Fatal error: Class uppercasefilter: Cannot inherit from undefined class php_user_filter in D:\work\php5\ext\standard\tests\file\userfilters.php on line 4 002- oncreate: 003- string(16) "string.uppercase" 004- NULL 005- bool(true) 006- read: 007- read: 008- string(11) "HELLO THERE" 009- flush: 010- onclose: ============================================================================ ==== ============================================================================ ==== D:\work\php5\ext\standard\tests\general_functions\006.phpt ============================================================================ ==== ---- EXPECTED OUTPUT úwow-factorÁÐÕÝÅÎÎÙÅ ÔÏÒÇÏ×ÙÅ ÐÒÏÅËÔÙ ---- ACTUAL OUTPUT úwow-factorÁÐÕÝÅÎÎÙÅ ÔÏÒÇÏ×ÙÅ Ð ÒÏÅËÔÙ ---- FAILED ============================================================================ ==== 001- úwow-factorÁÐÕÝÅÎÎÙÅ 001+ úwow-factorÁÐÕÝÅÎÎÙÅ 002- ÔÏÒÇÏ×ÙÅ ÐÒÏÅËÔÙ 002+ 003+ ÔÏÒÇÏ×ÙÅ 004+ 005+ Ð 006+ ÒÏÅËÔÙ ============================================================================ ==== ============================================================================ ==== D:\work\php5\ext\standard\tests\general_functions\007.phpt ============================================================================ ==== ---- EXPECTED OUTPUT d41d8cd98f00b204e9800998ecf8427e 0cc175b9c0f1b6a831c399e269772661 900150983cd24fb0d6963f7d28e17f72 f96b697d7cb7938d525a2f31aaf161d0 c3fcd3d76192e4007dfb496cca67e13b d174ab98d277d9f5a5611c2c9f419d9f 57edf4a22be3c955ac49da2e2107b67a ---- ACTUAL OUTPUT d41d8cd98f00b204e9800998ecf8427e 0cc175b9c0f1b6a831c399e269772661 900150983cd24fb0d6963f7d28e17f72 f96b697d7cb7938d525a2f31aaf161d0 c3fcd3d76192e4007dfb496cca67e13b d174ab98d277d9f5a5611c2c9f419d9f 57edf4a22be3c955ac49da2e2107b67a ---- FAILED ============================================================================ ==== 001- d41d8cd98f00b204e9800998ecf8427e 001+ d41d8cd98f00b204e9800998ecf8427e 002- 0cc175b9c0f1b6a831c399e269772661 002+ 0cc175b9c0f1b6a831c399e269772661 003- 900150983cd24fb0d6963f7d28e17f72 003+ 900150983cd24fb0d6963f7d28e17f72 004- f96b697d7cb7938d525a2f31aaf161d0 004+ f96b697d7cb7938d525a2f31aaf161d0 005- c3fcd3d76192e4007dfb496cca67e13b 005+ c3fcd3d76192e4007dfb496cca67e13b 006- d174ab98d277d9f5a5611c2c9f419d9f 006+ d174ab98d277d9f5a5611c2c9f419d9f ============================================================================ ==== ============================================================================ ==== D:\work\php5\ext\standard\tests\general_functions\getopt.phpt ============================================================================ ==== ---- EXPECTED OUTPUT array(5) { ["v"]=> bool(false) ["h"]=> bool(false) ["d"]=> string(4) "test" ["m"]=> string(4) "1234" ["t"]=> bool(false) } ---- ACTUAL OUTPUT Fatal error: Call to undefined function: getopt() in D:\work\php5\ext\standard\tests\general_functions\getopt.php on line 2 ---- FAILED ============================================================================ ==== 001- array(5) { 001+ Fatal error: Call to undefined function: getopt() in D:\work\php5\ext\standard\tests\general_functions\getopt.php on line 2 002- ["v"]=> 003- bool(false) 004- ["h"]=> 005- bool(false) 006- ["d"]=> 007- string(4) "test" 008- ["m"]=> 009- string(4) "1234" 010- ["t"]=> 011- bool(false) 012- } ============================================================================ ==== ============================================================================ ==== D:\work\php5\ext\standard\tests\image\getimagesize.phpt ============================================================================ ==== ---- EXPECTED OUTPUT array(11) { ["test1pix.bmp"]=> array(6) { [0]=> int(1) [1]=> int(1) [2]=> int(6) [3]=> string(20) "width="1" height="1"" ["bits"]=> int(24) ["mime"]=> string(9) "image/bmp" } ["test1pix.jp2"]=> array(7) { [0]=> int(1) [1]=> int(1) [2]=> int(10) [3]=> string(20) "width="1" height="1"" ["bits"]=> int(8) ["channels"]=> int(3) ["mime"]=> string(9) "image/jp2" } ["test1pix.jpc"]=> array(7) { [0]=> int(1) [1]=> int(1) [2]=> int(9) [3]=> string(20) "width="1" height="1"" ["bits"]=> int(8) ["channels"]=> int(3) ["mime"]=> string(24) "application/octet-stream" } ["test1pix.jpg"]=> array(7) { [0]=> int(1) [1]=> int(1) [2]=> int(2) [3]=> string(20) "width="1" height="1"" ["bits"]=> int(8) ["channels"]=> int(3) ["mime"]=> string(10) "image/jpeg" } ["test2pix.gif"]=> array(7) { [0]=> int(2) [1]=> int(1) [2]=> int(1) [3]=> string(20) "width="2" height="1"" ["bits"]=> int(1) ["channels"]=> int(3) ["mime"]=> string(9) "image/gif" } ["test4pix.gif"]=> array(7) { [0]=> int(4) [1]=> int(1) [2]=> int(1) [3]=> string(20) "width="4" height="1"" ["bits"]=> int(2) ["channels"]=> int(3) ["mime"]=> string(9) "image/gif" } ["test4pix.iff"]=> array(6) { [0]=> int(4) [1]=> int(1) [2]=> int(14) [3]=> string(20) "width="4" height="1"" ["bits"]=> int(4) ["mime"]=> string(9) "image/iff" } ["test4pix.png"]=> array(6) { [0]=> int(4) [1]=> int(1) [2]=> int(3) [3]=> string(20) "width="4" height="1"" ["bits"]=> int(4) ["mime"]=> string(9) "image/png" } ["test4pix.psd"]=> array(5) { [0]=> int(4) [1]=> int(1) [2]=> int(5) [3]=> string(20) "width="4" height="1"" ["mime"]=> string(9) "image/psd" } ["test4pix.swf"]=> array(5) { [0]=> int(550) [1]=> int(400) [2]=> int(4) [3]=> string(24) "width="550" height="400"" ["mime"]=> string(29) "application/x-shockwave-flash" } ["test4pix.tif"]=> array(5) { [0]=> int(4) [1]=> int(1) [2]=> int(7) [3]=> string(20) "width="4" height="1"" ["mime"]=> string(10) "image/tiff" } } ---- ACTUAL OUTPUT array(11) { ["test1pix.bmp"]=> array(6) { [0]=> int(1) [1]=> int(1) [2]=> int(6) [3]=> string(20) "width="1" height="1"" ["bits"]=> int(24) ["mime"]=> string(9) "image/bmp" } ["test1pix.jp2"]=> bool(false) ["test1pix.jpc"]=> array(6) { [0]=> int(1) [1]=> int(1) [2]=> int(9) [3]=> string(20) "width="1" height="1"" ["bits"]=> int(3) ["mime"]=> string(10) "image/jpeg" } ["test1pix.jpg"]=> array(7) { [0]=> int(1) [1]=> int(1) [2]=> int(2) [3]=> string(20) "width="1" height="1"" ["bits"]=> int(8) ["channels"]=> int(3) ["mime"]=> string(10) "image/jpeg" } ["test2pix.gif"]=> array(7) { [0]=> int(2) [1]=> int(1) [2]=> int(1) [3]=> string(20) "width="2" height="1"" ["bits"]=> int(1) ["channels"]=> int(3) ["mime"]=> string(9) "image/gif" } ["test4pix.gif"]=> array(7) { [0]=> int(4) [1]=> int(1) [2]=> int(1) [3]=> string(20) "width="4" height="1"" ["bits"]=> int(2) ["channels"]=> int(3) ["mime"]=> string(9) "image/gif" } ["test4pix.iff"]=> array(6) { [0]=> int(4) [1]=> int(1) [2]=> int(14) [3]=> string(20) "width="4" height="1"" ["bits"]=> int(4) ["mime"]=> string(9) "image/iff" } ["test4pix.png"]=> array(6) { [0]=> int(4) [1]=> int(1) [2]=> int(3) [3]=> string(20) "width="4" height="1"" ["bits"]=> int(4) ["mime"]=> string(9) "image/png" } ["test4pix.psd"]=> array(5) { [0]=> int(4) [1]=> int(1) [2]=> int(5) [3]=> string(20) "width="4" height="1"" ["mime"]=> string(9) "image/psd" } ["test4pix.swf"]=> array(5) { [0]=> int(550) [1]=> int(400) [2]=> int(4) [3]=> string(24) "width="550" height="400"" ["mime"]=> string(29) "application/x-shockwave-flash" } ["test4pix.tif"]=> array(5) { [0]=> int(4) [1]=> int(1) [2]=> int(7) [3]=> string(20) "width="4" height="1"" ["mime"]=> string(10) "image/tiff" } } ---- FAILED ============================================================================ ==== 018- array(7) { 018+ bool(false) 019- [0]=> 019+ ["test1pix.jpc"]=> 020- int(1) 020+ array(6) { 021- [1]=> 021+ [0]=> 023- [2]=> 023+ [1]=> 024- int(10) 024+ int(1) 025- [3]=> 025+ [2]=> 026- string(20) "width="1" height="1"" 026+ int(9) 027- ["bits"]=> 027+ [3]=> 028- int(8) 028+ string(20) "width="1" height="1"" 029- ["channels"]=> 029+ ["bits"]=> 032- string(9) "image/jp2" 032+ string(10) "image/jpeg" 034- ["test1pix.jpc"]=> 034+ ["test1pix.jpg"]=> 041- int(9) 041+ int(2) 049- string(24) "application/octet-stream" 049+ string(10) "image/jpeg" 051- ["test1pix.jpg"]=> 051+ ["test2pix.gif"]=> 054- int(1) 054+ int(2) 058- int(2) 058+ int(1) 060- string(20) "width="1" height="1"" 060+ string(20) "width="2" height="1"" 062- int(8) 062+ int(1) 066- string(10) "image/jpeg" 066+ string(9) "image/gif" 068- ["test2pix.gif"]=> 068+ ["test4pix.gif"]=> 071- int(2) 071+ int(4) 077- string(20) "width="2" height="1"" 077+ string(20) "width="4" height="1"" 079- int(1) 079+ int(2) 085- ["test4pix.gif"]=> 085+ ["test4pix.iff"]=> 086- array(7) { 086+ array(6) { 092- int(1) 092+ int(14) 096- int(2) 096+ int(4) 097- ["channels"]=> 097+ ["mime"]=> 098- int(3) 098+ string(9) "image/iff" 099- ["mime"]=> 099+ } 100- string(9) "image/gif" 100+ ["test4pix.png"]=> 101- } 101+ array(6) { 102- ["test4pix.iff"]=> 102+ [0]=> 103- array(6) { 103+ int(4) 104- [0]=> 104+ [1]=> 105- int(4) 105+ int(1) 106- [1]=> 106+ [2]=> 107- int(1) 107+ int(3) 108- [2]=> 108+ [3]=> 109- int(14) 109+ string(20) "width="4" height="1"" 110- [3]=> 110+ ["bits"]=> 111- string(20) "width="4" height="1"" 111+ int(4) 112- ["bits"]=> 112+ ["mime"]=> 113- int(4) 113+ string(9) "image/png" 114- ["mime"]=> 114+ } 115- string(9) "image/iff" 115+ ["test4pix.psd"]=> 116- } 116+ array(5) { 117- ["test4pix.png"]=> 117+ [0]=> 118- array(6) { 118+ int(4) 119- [0]=> 119+ [1]=> 120- int(4) 120+ int(1) 121- [1]=> 121+ [2]=> 122- int(1) 122+ int(5) 123- [2]=> 123+ [3]=> 124- int(3) 124+ string(20) "width="4" height="1"" 125- [3]=> 125+ ["mime"]=> 126- string(20) "width="4" height="1"" 126+ string(9) "image/psd" 127- ["bits"]=> 127+ } 128- int(4) 128+ ["test4pix.swf"]=> 129- ["mime"]=> 129+ array(5) { 130- string(9) "image/png" 130+ [0]=> 131- } 131+ int(550) 132- ["test4pix.psd"]=> 132+ [1]=> 133- array(5) { 133+ int(400) 134- [0]=> 134+ [2]=> 136- [1]=> 136+ [3]=> 137- int(1) 137+ string(24) "width="550" height="400"" 138- [2]=> 138+ ["mime"]=> 139- int(5) 139+ string(29) "application/x-shockwave-flash" 140- [3]=> 140+ } 141- string(20) "width="4" height="1"" 141+ ["test4pix.tif"]=> 142- ["mime"]=> 142+ array(5) { 143- string(9) "image/psd" 143+ [0]=> 144- } 144+ int(4) 145- ["test4pix.swf"]=> 145+ [1]=> 146- array(5) { 146+ int(1) 147- [0]=> 147+ [2]=> 148- int(550) 148+ int(7) 149- [1]=> 149+ [3]=> 150- int(400) 150+ string(20) "width="4" height="1"" 151- [2]=> 151+ ["mime"]=> 152- int(4) 152+ string(10) "image/tiff" 153- [3]=> 153+ } 154- string(24) "width="550" height="400"" 154+ } 155- ["mime"]=> 156- string(29) "application/x-shockwave-flash" 157- } 158- ["test4pix.tif"]=> 159- array(5) { 160- [0]=> 161- int(4) 162- [1]=> 163- int(1) 164- [2]=> 165- int(7) 166- [3]=> 167- string(20) "width="4" height="1"" 168- ["mime"]=> 169- string(10) "image/tiff" 170- } 171- } ============================================================================ ==== ============================================================================ ==== D:\work\php5\ext\standard\tests\image\image_type_to_mime_type.phpt ============================================================================ ==== ---- EXPECTED OUTPUT array(11) { ["test1pix.bmp"]=> string(9) "image/bmp" ["test1pix.jp2"]=> string(9) "image/jp2" ["test1pix.jpc"]=> string(24) "application/octet-stream" ["test1pix.jpg"]=> string(10) "image/jpeg" ["test2pix.gif"]=> string(9) "image/gif" ["test4pix.gif"]=> string(9) "image/gif" ["test4pix.iff"]=> string(9) "image/iff" ["test4pix.png"]=> string(9) "image/png" ["test4pix.psd"]=> string(9) "image/psd" ["test4pix.swf"]=> string(29) "application/x-shockwave-flash" ["test4pix.tif"]=> string(10) "image/tiff" } ---- ACTUAL OUTPUT array(11) { ["test1pix.bmp"]=> string(9) "image/bmp" ["test1pix.jp2"]=> string(24) "application/octet-stream" ["test1pix.jpc"]=> string(10) "image/jpeg" ["test1pix.jpg"]=> string(10) "image/jpeg" ["test2pix.gif"]=> string(9) "image/gif" ["test4pix.gif"]=> string(9) "image/gif" ["test4pix.iff"]=> string(9) "image/iff" ["test4pix.png"]=> string(9) "image/png" ["test4pix.psd"]=> string(9) "image/psd" ["test4pix.swf"]=> string(29) "application/x-shockwave-flash" ["test4pix.tif"]=> string(10) "image/tiff" } ---- FAILED ============================================================================ ==== 005- string(9) "image/jp2" 005+ string(24) "application/octet-stream" 007- string(24) "application/octet-stream" 007+ string(10) "image/jpeg" ============================================================================ ==== ============================================================================ ==== D:\work\php5\ext\standard\tests\math\pow.phpt ============================================================================ ==== ---- EXPECTED OUTPUT 1,1,0,0 On failure, please mail result to php-dev@lists.php.net OK ---- ACTUAL OUTPUT 1,1,0,0 On failure, please mail result to php-dev@lists.php.net Assert failed: TRUE === is_infinite(pow(0,-2)) Left: bool(true) Right: bool(false) Assert failed: TRUE === is_infinite(pow(0,-1)) Left: bool(true) Right: bool(false) Assert failed: TRUE === is_infinite(pow(0,-2.0)) Left: bool(true) Right: bool(false) Assert failed: TRUE === is_infinite(pow(0,-1.0)) Left: bool(true) Right: bool(false) Assert failed: TRUE === is_infinite(pow(0.0,-2.0)) Left: bool(true) Right: bool(false) Assert failed: TRUE === is_infinite(pow(0.0,-1.0)) Left: bool(true) Right: bool(false) Assert failed: TRUE === is_infinite(pow( 0.0,-2)) Left: bool(true) Right: bool(false) Assert failed: TRUE === is_infinite(pow( 0.0,-1)) Left: bool(true) Right: bool(false) ---- FAILED ============================================================================ ==== 003- OK 003+ 004+ Assert failed: 005+ TRUE === is_infinite(pow(0,-2)) 006+ Left: bool(true) 007+ Right: bool(false) 008+ 009+ Assert failed: 010+ TRUE === is_infinite(pow(0,-1)) 011+ Left: bool(true) 012+ Right: bool(false) 013+ 014+ Assert failed: 015+ TRUE === is_infinite(pow(0,-2.0)) 016+ Left: bool(true) 017+ Right: bool(false) 018+ 019+ Assert failed: 020+ TRUE === is_infinite(pow(0,-1.0)) 021+ Left: bool(true) 022+ Right: bool(false) 023+ 024+ Assert failed: 025+ TRUE === is_infinite(pow(0.0,-2.0)) 026+ Left: bool(true) 027+ Right: bool(false) 028+ 029+ Assert failed: 030+ TRUE === is_infinite(pow(0.0,-1.0)) 031+ Left: bool(true) 032+ Right: bool(false) 033+ 034+ Assert failed: 035+ TRUE === is_infinite(pow( 0.0,-2)) 036+ Left: bool(true) 037+ Right: bool(false) 038+ 039+ Assert failed: 040+ TRUE === is_infinite(pow( 0.0,-1)) 041+ Left: bool(true) 042+ Right: bool(false) ============================================================================ ==== ============================================================================ ==== D:\work\php5\ext\standard\tests\reg\009.phpt ============================================================================ ==== ---- EXPECTED OUTPUT 4 this is a test ---- ACTUAL OUTPUT 5 this is a test ---- FAILED ============================================================================ ==== 001- 4 001+ 5 005- test 005+ 006+ test ============================================================================ ==== ============================================================================ ==== D:\work\php5\ext\standard\tests\serialize\003.phpt ============================================================================ ==== ---- EXPECTED OUTPUT d:100; float(100) d:5.2E+25; float(5.2E+25) d:8.529E-22; float(8.529E-22) d:9E-09; float(9.E-9) ---- ACTUAL OUTPUT d:100; float(100) d:5.2E+025; float(5.2E+25) d:8.529E-022; float(8.529E-22) d:9E-009; float(9.E-9) ---- FAILED ============================================================================ ==== 004- d:5.2E+25; 004+ d:5.2E+025; 007- d:8.529E-22; 007+ d:8.529E-022; 010- d:9E-09; 010+ d:9E-009; ============================================================================ ==== ============================================================================ ==== D:\work\php5\ext\standard\tests\strings\bug21453.phpt ============================================================================ ==== ---- EXPECTED OUTPUT string(80) " first cell before < first cell after second cell before < second cell after " ---- ACTUAL OUTPUT string(84) " first cell before < first cell after second cell before < second cell after " ---- FAILED ============================================================================ ==== 001- string(80) " 001+ string(84) " ============================================================================ ==== ============================================================================ ==== D:\work\php5\ext\standard\tests\strings\nl2br.phpt ============================================================================ ==== ---- EXPECTED OUTPUT string(4) "test" string(0) "" string(0) "" string(8) "<br /> " string(7) "<br /> " string(7) "<br /> " string(8) "<br /> " string(44) "<br /> <br /> <br /> <br /> <br /> <br /> " string(47) "<br /> <br /> <br /> <br /> <br /> <br /> " string(66) "<br /> <br /> <br /> <br /> <br /> <br /> <br /> <br /> <br /> " ---- ACTUAL OUTPUT string(4) "test" string(0) "" string(0) "" string(8) "<br /> " string(7) "<br /> " string(7) "<br /> " string(8) "<br /> " string(44) "<br /> <br /> <br /> <br /> <br /> <br /> " string(47) "<br /> <br /> <br /> <br /> <br /> <br /> " string(66) "<br /> <br /> <br /> <br /> <br /> <br /> <br /> <br /> <br /> " ---- FAILED ============================================================================ ==== 004- string(8) "<br /> 004+ string(8) "<br /> 012- <br /> 012+ <br /> 018- <br /> 018+ <br /> 019- <br /> 019+ <br /> 026- <br /> <br /> <br /> 026+ <br /> <br /> <br /> ============================================================================ ==== ============================================================================ ==== D:\work\php5\ext\standard\tests\strings\wordwrap.phpt ============================================================================ ==== ---- EXPECTED OUTPUT OK ---- ACTUAL OUTPUT WARNING: unknown operator in ' ' (1) ---- FAILED ============================================================================ ==== 001- OK 001+ WARNING: unknown operator in ' ' (1) ============================================================================ ==== ============================================================================ ==== D:\work\php5\ext\standard\tests\time\002.phpt ============================================================================ ==== ---- EXPECTED OUTPUT 1999-10-13 00:00:00 1999-10-13 00:00:00 2000-01-19 00:00:00 2000-01-19 00:00:00 2001-12-21 00:00:00 2001-12-21 00:00:00 2001-12-21 12:16:00 2001-12-21 12:16:00 1969-12-31 23:59:59 2001-10-22 21:19:58 2001-10-22 23:19:58 2001-10-22 23:32:58 2001-10-22 19:19:58 2001-10-22 19:06:58 1999-10-13 00:00:00 1999-10-13 00:00:00 2000-01-19 00:00:00 2000-01-19 00:00:00 2001-12-21 00:00:00 2001-12-21 00:00:00 2001-12-21 12:16:00 2001-12-21 12:16:00 1970-01-01 00:59:59 2001-10-22 21:19:58 2001-10-23 01:19:58 2001-10-23 01:32:58 2001-10-22 21:19:58 2001-10-22 21:06:58 ---- ACTUAL OUTPUT 1999-10-13 00:00:00 1999-10-13 00:00:00 2000-01-19 00:00:00 2000-01-19 00:00:00 2001-12-21 00:00:00 2001-12-21 00:00:00 2001-12-21 12:16:00 2001-12-21 12:16:00 Warning: date() [/phpmanual/function.date.html]: Unexpected error in D:\work\php5\ext\standard\tests\time\002.php on line 21 2001-10-22 21:19:58 2001-10-22 23:19:58 2001-10-22 23:32:58 2001-10-22 19:19:58 2001-10-22 19:06:58 1999-10-13 00:00:00 1999-10-13 00:00:00 2000-01-19 00:00:00 2000-01-19 00:00:00 2001-12-21 00:00:00 2001-12-21 00:00:00 2001-12-21 12:16:00 2001-12-21 12:16:00 Warning: date() [/phpmanual/function.date.html]: Unexpected error in D:\work\php5\ext\standard\tests\time\002.php on line 26 2001-10-22 21:19:58 2001-10-23 00:19:58 2001-10-23 00:32:58 2001-10-22 20:19:58 2001-10-22 20:06:58 ---- FAILED ============================================================================ ==== 009- 1969-12-31 23:59:59 009+ 010- 2001-10-22 21:19:58 010+ Warning: date() [/phpmanual/function.date.html]: Unexpected error in D:\work\php5\ext\standard\tests\time\002.php on line 21 011- 2001-10-22 23:19:58 011+ 2001-10-22 21:19:58 012- 2001-10-22 23:32:58 012+ 2001-10-22 23:19:58 013- 2001-10-22 19:19:58 013+ 2001-10-22 23:32:58 014- 2001-10-22 19:06:58 014+ 2001-10-22 19:19:58 015- 1999-10-13 00:00:00 015+ 2001-10-22 19:06:58 017- 2000-01-19 00:00:00 017+ 1999-10-13 00:00:00 019- 2001-12-21 00:00:00 019+ 2000-01-19 00:00:00 021- 2001-12-21 12:16:00 021+ 2001-12-21 00:00:00 023- 1970-01-01 00:59:59 023+ 2001-12-21 12:16:00 024- 2001-10-22 21:19:58 024+ 025- 2001-10-23 01:19:58 025+ Warning: date() [/phpmanual/function.date.html]: Unexpected error in D:\work\php5\ext\standard\tests\time\002.php on line 26 026- 2001-10-23 01:32:58 026+ 2001-10-22 21:19:58 027- 2001-10-22 21:19:58 027+ 2001-10-23 00:19:58 028- 2001-10-22 21:06:58 028+ 2001-10-23 00:32:58 029+ 2001-10-22 20:19:58 030+ 2001-10-22 20:06:58 ============================================================================ ==== ============================================================================ ==== D:\work\php5\ext\standard\tests\time\003.phpt ============================================================================ ==== ---- EXPECTED OUTPUT 2000-02-29 2000-02-28 2000-02-29 2001-02-28 2001-03-01 1999-11-30 2000-05-29 12:00:00 2000-05-29 13:00:00 2000-05-29 12:00:00 2000-01-31 12:00:00 2000-01-31 12:00:00 2000-01-31 11:00:00 2000-04-29 12:00:00 2000-04-29 13:00:00 2000-04-29 12:00:00 ---- ACTUAL OUTPUT 2000-02-29 2000-02-28 2000-02-29 2001-02-28 2001-03-01 1999-11-30 2000-05-29 12:00:00 2000-05-29 12:00:00 2000-05-29 11:00:00 2000-01-31 12:00:00 2000-01-31 12:00:00 2000-01-31 11:00:00 2000-04-29 12:00:00 2000-04-29 12:00:00 2000-04-29 11:00:00 ---- FAILED ============================================================================ ==== 008- 2000-05-29 13:00:00 008+ 2000-05-29 12:00:00 009- 2000-05-29 12:00:00 009+ 2000-05-29 11:00:00 014- 2000-04-29 13:00:00 014+ 2000-04-29 12:00:00 015- 2000-04-29 12:00:00 015+ 2000-04-29 11:00:00 ============================================================================ ==== ============================================================================ ==== D:\work\php5\tests\func\005a.phpt ============================================================================ ==== ---- EXPECTED OUTPUT Start Shutdown ---- ACTUAL OUTPUT Start ---- FAILED ============================================================================ ==== 002- Shutdown ============================================================================ ==== ============================================================================ ==== D:\work\php5\tests\lang\bug21094.phpt ============================================================================ ==== ---- EXPECTED OUTPUT [1024] errstr: test, errfile: %s, errline: %d ---- ACTUAL OUTPUT Notice: test in D:\work\php5\tests\lang\bug21094.php on line 10 ---- FAILED ============================================================================ ==== 001- [1024] errstr: test, errfile: %s, errline: %d 001+ Notice: test in D:\work\php5\tests\lang\bug21094.php on line 10 ============================================================================ ==== ============================================================================ ==== D:\work\php5\tests\lang\bug21600.phpt ============================================================================ ==== ---- EXPECTED OUTPUT array(1) { ["foo"]=> string(4) "test" } array(1) { ["foo"]=> string(4) "test" } ---- ACTUAL OUTPUT array(1) { ["foo"]=> &string(4) "test" } array(1) { ["foo"]=> string(4) "test" } ---- FAILED ============================================================================ ==== 003- string(4) "test" 003+ &string(4) "test" ============================================================================ ==== ============================================================================ ==== D:\work\php5\tests\lang\bug21849.phpt ============================================================================ ==== ---- EXPECTED OUTPUT fubar ---- ACTUAL OUTPUT Parse error: parse error, unexpected T_CONST, expecting T_OLD_FUNCTION or T_FUNCTION or T_VAR or '}' in D:\work\php5\tests\lang\bug21849.php on line 3 ---- FAILED ============================================================================ ==== 001- fubar 001+ Parse error: parse error, unexpected T_CONST, expecting T_OLD_FUNCTION or T_FUNCTION or T_VAR or '}' in D:\work\php5\tests\lang\bug21849.php on line 3 ============================================================================ ==== ============================================================================ ==== D:\work\php5\tests\strings\002.phpt ============================================================================ ==== ---- EXPECTED OUTPUT printf test 1:simple string printf test 2:42 printf test 3:3.333333 printf test 4:3.3333333333 printf test 5:2.50 printf test 6:2.50000000000 printf test 7:0000000002.50 printf test 8:< foo> printf test 9:<bar > printf test 10: 123456789012345 printf test 10:<høyesterettsjustitiarius> printf test 11: 123456789012345678901234567890 printf test 11:< høyesterettsjustitiarius> printf test 12: -12.34 printf test 13: -12 printf test 14:@ printf test 15:10101010 printf test 16:aa printf test 17:AA printf test 18: 10101010 printf test 19: aa printf test 20: AA printf test 21:0000000010101010 printf test 22:00000000000000aa printf test 23:00000000000000AA printf test 24:abcde printf test 25:gazonk printf test 26:2 1 printf test 27:3 1 2 printf test 28:02 1 printf test 29:2 1 printf test 30:x vprintf test 1:2 1 fprintf test 1:abcde int(20) ---- ACTUAL OUTPUT printf test 1:simple string printf test 2:42 printf test 3:3.333333 printf test 4:3.3333333333 printf test 5:2.50 printf test 6:2.50000000000 printf test 7:0000000002.50 printf test 8:< foo> printf test 9:<bar > printf test 10: 123456789012345 printf test 10:<høyesterettsjustitiarius> printf test 11: 123456789012345678901234567890 printf test 11:< høyesterettsjustitiarius> printf test 12: -12.34 printf test 13: -12 printf test 14:@ printf test 15:10101010 printf test 16:aa printf test 17:AA printf test 18: 10101010 printf test 19: aa printf test 20: AA printf test 21:0000000010101010 printf test 22:00000000000000aa printf test 23:00000000000000AA printf test 24:abcde printf test 25:gazonk printf test 26:2 1 printf test 27:3 1 2 printf test 28:02 1 printf test 29:2 1 printf test 30:x vprintf test 1:2 1 ---- FAILED ============================================================================ ==== 034- fprintf test 1:abcde 035- int(20) ============================================================================ ==== ============================================================================ ==== BUILD ENVIRONMENT ============================================================================ ==== OS: WINNT Automake: N/A Autoconf: N/A Libtool: N/A Compiler: N/A Bison: ============================================================================ ==== PHPINFO ============================================================================ ==== phpinfo() PHP Version => 4.3.1-dev System => Windows NT TANIS 5.0 build 2195 Build Date => Feb 2 2003 10:14:30 Server API => Command Line Interface Virtual Directory Support => enabled Configuration File (php.ini) Path => C:\WINNT\php.ini PHP API => 20020918 PHP Extension => 20020429 Zend Extension => 20021010 Debug Build => no Thread Safety => enabled Registered PHP Streams => php, http, ftp, compress.zlib This program makes use of the Zend Scripting Language Engine: Zend Engine v1.3.0, Copyright (c) 1998-2003 Zend Technologies _______________________________________________________________________ Configuration PHP Core Directive => Local Value => Master Value allow_call_time_pass_reference => On => On allow_url_fopen => On => On always_populate_raw_post_data => Off => Off arg_separator.input => &amp; => &amp; arg_separator.output => &amp; => &amp; asp_tags => Off => Off auto_append_file => no value => no value auto_prepend_file => no value => no value browscap => no value => no value default_charset => no value => no value default_mimetype => text/html => text/html define_syslog_variables => Off => Off disable_functions => no value => no value display_errors => On => On display_startup_errors => Off => Off doc_root => no value => no value docref_ext => no value => no value docref_root => http://www.php.net/ => http://www.php.net/ enable_dl => On => On error_append_string => no value => no value error_log => no value => no value error_prepend_string => no value => no value error_reporting => 2039 => 2039 expose_php => On => On extension_dir => ./ => ./ file_uploads => On => On gpc_order => GPC => GPC highlight.bg => #FFFFFF => #FFFFFF highlight.comment => #FF8000 => #FF8000 highlight.default => #0000BB => #0000BB highlight.html => #000000 => #000000 highlight.keyword => #007700 => #007700 highlight.string => #DD0000 => #DD0000 html_errors => Off => On ignore_repeated_errors => Off => Off ignore_repeated_source => Off => Off ignore_user_abort => Off => Off implicit_flush => On => Off include_path => .;c:\php4\pear => .;c:\php4\pear log_errors => Off => Off log_errors_max_len => 1024 => 1024 magic_quotes_gpc => On => On magic_quotes_runtime => Off => Off magic_quotes_sybase => Off => Off max_execution_time => 0 => 30 max_input_time => 60 => 60 open_basedir => no value => no value output_buffering => no value => no value output_handler => no value => no value post_max_size => 8M => 8M precision => 12 => 12 register_argc_argv => On => On register_globals => Off => Off report_memleaks => On => On safe_mode => Off => Off safe_mode_exec_dir => no value => no value safe_mode_gid => Off => Off safe_mode_include_dir => no value => no value sendmail_from => me@localhost.com => me@localhost.com sendmail_path => no value => no value short_open_tag => On => On SMTP => localhost => localhost smtp_port => 25 => 25 sql.safe_mode => Off => Off track_errors => Off => Off unserialize_callback_func => no value => no value upload_max_filesize => 2M => 2M upload_tmp_dir => no value => no value user_dir => no value => no value variables_order => EGPCS => EGPCS xmlrpc_error_number => 0 => 0 xmlrpc_errors => Off => Off y2k_compliance => On => On bcmath BCMath support => enabled calendar Calendar support => enabled com Directive => Local Value => Master Value com.allow_dcom => Off => Off com.autoregister_casesensitive => On => On com.autoregister_typelib => Off => Off com.autoregister_verbose => Off => Off com.typelib_file => no value => no value ctype ctype functions => enabled ftp FTP support => enabled mysql MySQL Support => enabled Active Persistent Links => 0 Active Links => 0 Client API version => 3.23.49 Directive => Local Value => Master Value mysql.allow_persistent => On => On mysql.connect_timeout => -1 => -1 mysql.default_host => no value => no value mysql.default_password => no value => no value mysql.default_port => no value => no value mysql.default_socket => no value => no value mysql.default_user => no value => no value mysql.max_links => Unlimited => Unlimited mysql.max_persistent => Unlimited => Unlimited mysql.trace_mode => Off => Off odbc ODBC Support => enabled Active Persistent Links => 0 Active Links => 0 ODBC library => Win32 Directive => Local Value => Master Value odbc.allow_persistent => On => On odbc.check_persistent => On => On odbc.default_db => no value => no value odbc.default_pw => <i>no value</i> => <i>no value</i> odbc.default_user => no value => no value odbc.defaultbinmode => return as is => return as is odbc.defaultlrl => return up to 4096 bytes => return up to 4096 bytes odbc.max_links => Unlimited => Unlimited odbc.max_persistent => Unlimited => Unlimited overload User-Space Object Overloading Support => enabled pcre PCRE (Perl Compatible Regular Expressions) Support => enabled PCRE Library Version => 3.92 11-Sep-2002 session Session Support => enabled Registered save handlers => files user Directive => Local Value => Master Value session.auto_start => Off => Off session.bug_compat_42 => On => On session.bug_compat_warn => On => On session.cache_expire => 180 => 180 session.cache_limiter => nocache => nocache session.cookie_domain => no value => no value session.cookie_lifetime => 0 => 0 session.cookie_path => / => / session.cookie_secure => Off => Off session.entropy_file => no value => no value session.entropy_length => 0 => 0 session.gc_dividend => 100 => 100 session.gc_maxlifetime => 1440 => 1440 session.gc_probability => 1 => 1 session.name => PHPSESSID => PHPSESSID session.referer_check => no value => no value session.save_handler => files => files session.save_path => D:\work => D:\work session.serialize_handler => php => php session.use_cookies => On => On session.use_only_cookies => Off => Off session.use_trans_sid => Off => Off standard Regex Library => Bundled library enabled Dynamic Library Support => enabled Internal Sendmail Support for Windows => enabled Directive => Local Value => Master Value assert.active => 1 => 1 assert.bail => 0 => 0 assert.callback => no value => no value assert.quiet_eval => 0 => 0 assert.warning => 1 => 1 auto_detect_line_endings => 0 => 0 default_socket_timeout => 60 => 60 safe_mode_allowed_env_vars => PHP_ => PHP_ safe_mode_protected_env_vars => LD_LIBRARY_PATH => LD_LIBRARY_PATH url_rewriter.tags => a=href,area=href,frame=src,input=src,form=,fieldset= => a=href,area=href,frame=src,input=src,form=,fieldset= user_agent => no value => no value tokenizer Tokenizer Support => enabled wddx WDDX Support => enabled xml XML Support => active XML Namespace Support => active EXPAT Version => 1.95.2 zlib ZLib Support => enabled Compiled Version => 1.1.4 Linked Version => 1.1.4 Directive => Local Value => Master Value zlib.output_compression => Off => Off zlib.output_compression_level => -1 => -1 zlib.output_handler => no value => no value Additional Modules Module Name Environment Variable => Value ALLUSERSPROFILE => C:\Dokumente und Einstellungen\All Users APPDATA => C:\Dokumente und Einstellungen\Administrator\Anwendungsdaten CommonProgramFiles => C:\Programme\Gemeinsame Dateien COMPUTERNAME => TANIS ComSpec => C:\WINNT\system32\cmd.exe HOMEDRIVE => C: HOMEPATH => \ include => D:\Programme\Microsoft Visual Studio\VC98\atl\include;D:\Programme\Microsoft Visual Studio\VC98\mfc\include;D:\Programme\Microsoft Visual Studio\VC98\include lib => D:\Programme\Microsoft Visual Studio\VC98\mfc\lib;D:\Programme\Microsoft Visual Studio\VC98\lib LOGONSERVER => \\TANIS MSDevDir => D:\Programme\Microsoft Visual Studio\Common\MSDev98 NUMBER_OF_PROCESSORS => 2 OS => Windows_NT Os2LibPath => C:\WINNT\system32\os2\dll; Path => C:\WINNT\system32;C:\WINNT;C:\WINNT\System32\Wbem;D:\Programme\Microsoft Visual Studio\Common\Tools\WinNT;D:\Programme\Microsoft Visual Studio\Common\MSDev98\Bin;D:\Programme\Microsoft Visual Studio\Common\Tools;D:\Programme\Microsoft Visual Studio\VC98\bin;D:\Programme\CVS for NT;D:\work\php4-snap;D:\work\php4-snap\dlls PATHEXT => .COM;.EXE;.BAT;.CMD;.VBS;.VBE;.JS;.JSE;.WSF;.WSH PATH_TRANSLATED => D:\work\php5\tests\strings\004.php PROCESSOR_ARCHITECTURE => x86 PROCESSOR_IDENTIFIER => x86 Family 6 Model 8 Stepping 3, GenuineIntel PROCESSOR_LEVEL => 6 PROCESSOR_REVISION => 0803 ProgramFiles => C:\Programme PROMPT => $P$G REDIRECT_STATUS => 1 REQUEST_METHOD => GET SCRIPT_FILENAME => D:\work\php5\tests\strings\004.php SNAPDIR => php4-snap SNAPFILE => php4-win32-STABLE-latest.zip SNAPURL => http://snaps.php.net/win32 SSH_AUTH_SOCK => deleted SSH_CLIENT => deleted SSH_TTY => deleted SystemDrive => C: SystemRoot => C:\WINNT TEMP => C:\DOKUME~1\ADMINI~1\LOKALE~1\Temp TESTDIR => D:\work\php5 TEST_PHP_EXECUTABLE => D:\work\php4-snap\cli\php.exe TMP => C:\DOKUME~1\ADMINI~1\LOKALE~1\Temp UNZIP => D:\work\7-zip\7za x -y USERDNSDOMAIN => KASIS.kai-schroeder.net USERDOMAIN => KASIS USERNAME => Administrator USERPROFILE => C:\Dokumente und Einstellungen\Administrator WGET => D:\work\wget\wget windir => C:\WINNT WORKDIR => D:\work PHP Variables Variable => Value _SERVER["ALLUSERSPROFILE"] => C:\\Dokumente und Einstellungen\\All Users _SERVER["APPDATA"] => C:\\Dokumente und Einstellungen\\Administrator\\Anwendungsdaten _SERVER["CommonProgramFiles"] => C:\\Programme\\Gemeinsame Dateien _SERVER["COMPUTERNAME"] => TANIS _SERVER["ComSpec"] => C:\\WINNT\\system32\\cmd.exe _SERVER["HOMEDRIVE"] => C: _SERVER["HOMEPATH"] => \\ _SERVER["include"] => D:\\Programme\\Microsoft Visual Studio\\VC98\\atl\\include;D:\\Programme\\Microsoft Visual Studio\\VC98\\mfc\\include;D:\\Programme\\Microsoft Visual Studio\\VC98\\include _SERVER["lib"] => D:\\Programme\\Microsoft Visual Studio\\VC98\\mfc\\lib;D:\\Programme\\Microsoft Visual Studio\\VC98\\lib _SERVER["LOGONSERVER"] => \\\\TANIS _SERVER["MSDevDir"] => D:\\Programme\\Microsoft Visual Studio\\Common\\MSDev98 _SERVER["NUMBER_OF_PROCESSORS"] => 2 _SERVER["OS"] => Windows_NT _SERVER["Os2LibPath"] => C:\\WINNT\\system32\\os2\\dll; _SERVER["Path"] => C:\\WINNT\\system32;C:\\WINNT;C:\\WINNT\\System32\\Wbem;D:\\Programme\\Micro soft Visual Studio\\Common\\Tools\\WinNT;D:\\Programme\\Microsoft Visual Studio\\Common\\MSDev98\\Bin;D:\\Programme\\Microsoft Visual Studio\\Common\\Tools;D:\\Programme\\Microsoft Visual Studio\\VC98\\bin;D:\\Programme\\CVS for NT;D:\\work\\php4-snap;D:\\work\\php4-snap\\dlls _SERVER["PATHEXT"] => .COM;.EXE;.BAT;.CMD;.VBS;.VBE;.JS;.JSE;.WSF;.WSH _SERVER["PATH_TRANSLATED"] => _SERVER["PROCESSOR_ARCHITECTURE"] => x86 _SERVER["PROCESSOR_IDENTIFIER"] => x86 Family 6 Model 8 Stepping 3, GenuineIntel _SERVER["PROCESSOR_LEVEL"] => 6 _SERVER["PROCESSOR_REVISION"] => 0803 _SERVER["ProgramFiles"] => C:\\Programme _SERVER["PROMPT"] => $P$G _SERVER["REDIRECT_STATUS"] => 1 _SERVER["REQUEST_METHOD"] => GET _SERVER["SCRIPT_FILENAME"] => _SERVER["SNAPDIR"] => php4-snap _SERVER["SNAPFILE"] => php4-win32-STABLE-latest.zip _SERVER["SNAPURL"] => http://snaps.php.net/win32 _SERVER["SSH_AUTH_SOCK"] => deleted _SERVER["SSH_CLIENT"] => deleted _SERVER["SSH_TTY"] => deleted _SERVER["SystemDrive"] => C: _SERVER["SystemRoot"] => C:\\WINNT _SERVER["TEMP"] => C:\\DOKUME~1\\ADMINI~1\\LOKALE~1\\Temp _SERVER["TESTDIR"] => D:\\work\\php5 _SERVER["TEST_PHP_EXECUTABLE"] => D:\\work\\php4-snap\\cli\\php.exe _SERVER["TMP"] => C:\\DOKUME~1\\ADMINI~1\\LOKALE~1\\Temp _SERVER["UNZIP"] => D:\\work\\7-zip\\7za x -y _SERVER["USERDNSDOMAIN"] => KASIS.kai-schroeder.net _SERVER["USERDOMAIN"] => KASIS _SERVER["USERNAME"] => Administrator _SERVER["USERPROFILE"] => C:\\Dokumente und Einstellungen\\Administrator _SERVER["WGET"] => D:\\work\\wget\\wget _SERVER["windir"] => C:\\WINNT _SERVER["WORKDIR"] => D:\\work _SERVER["PHP_SELF"] => _SERVER["SCRIPT_NAME"] => _SERVER["DOCUMENT_ROOT"] => _SERVER["argv"] => Array ( ) _SERVER["argc"] => 0 _ENV["ALLUSERSPROFILE"] => C:\\Dokumente und Einstellungen\\All Users _ENV["APPDATA"] => C:\\Dokumente und Einstellungen\\Administrator\\Anwendungsdaten _ENV["CommonProgramFiles"] => C:\\Programme\\Gemeinsame Dateien _ENV["COMPUTERNAME"] => TANIS _ENV["ComSpec"] => C:\\WINNT\\system32\\cmd.exe _ENV["HOMEDRIVE"] => C: _ENV["HOMEPATH"] => \\ _ENV["include"] => D:\\Programme\\Microsoft Visual Studio\\VC98\\atl\\include;D:\\Programme\\Microsoft Visual Studio\\VC98\\mfc\\include;D:\\Programme\\Microsoft Visual Studio\\VC98\\include _ENV["lib"] => D:\\Programme\\Microsoft Visual Studio\\VC98\\mfc\\lib;D:\\Programme\\Microsoft Visual Studio\\VC98\\lib _ENV["LOGONSERVER"] => \\\\TANIS _ENV["MSDevDir"] => D:\\Programme\\Microsoft Visual Studio\\Common\\MSDev98 _ENV["NUMBER_OF_PROCESSORS"] => 2 _ENV["OS"] => Windows_NT _ENV["Os2LibPath"] => C:\\WINNT\\system32\\os2\\dll; _ENV["Path"] => C:\\WINNT\\system32;C:\\WINNT;C:\\WINNT\\System32\\Wbem;D:\\Programme\\Micro soft Visual Studio\\Common\\Tools\\WinNT;D:\\Programme\\Microsoft Visual Studio\\Common\\MSDev98\\Bin;D:\\Programme\\Microsoft Visual Studio\\Common\\Tools;D:\\Programme\\Microsoft Visual Studio\\VC98\\bin;D:\\Programme\\CVS for NT;D:\\work\\php4-snap;D:\\work\\php4-snap\\dlls _ENV["PATHEXT"] => .COM;.EXE;.BAT;.CMD;.VBS;.VBE;.JS;.JSE;.WSF;.WSH _ENV["PATH_TRANSLATED"] => D:\\work\\php5\\tests\\strings\\004.php _ENV["PROCESSOR_ARCHITECTURE"] => x86 _ENV["PROCESSOR_IDENTIFIER"] => x86 Family 6 Model 8 Stepping 3, GenuineIntel _ENV["PROCESSOR_LEVEL"] => 6 _ENV["PROCESSOR_REVISION"] => 0803 _ENV["ProgramFiles"] => C:\\Programme _ENV["PROMPT"] => $P$G _ENV["REDIRECT_STATUS"] => 1 _ENV["REQUEST_METHOD"] => GET _ENV["SCRIPT_FILENAME"] => D:\\work\\php5\\tests\\strings\\004.php _ENV["SNAPDIR"] => php4-snap _ENV["SNAPFILE"] => php4-win32-STABLE-latest.zip _ENV["SNAPURL"] => http://snaps.php.net/win32 _ENV["SSH_AUTH_SOCK"] => deleted _ENV["SSH_CLIENT"] => deleted _ENV["SSH_TTY"] => deleted _ENV["SystemDrive"] => C: _ENV["SystemRoot"] => C:\\WINNT _ENV["TEMP"] => C:\\DOKUME~1\\ADMINI~1\\LOKALE~1\\Temp _ENV["TESTDIR"] => D:\\work\\php5 _ENV["TEST_PHP_EXECUTABLE"] => D:\\work\\php4-snap\\cli\\php.exe _ENV["TMP"] => C:\\DOKUME~1\\ADMINI~1\\LOKALE~1\\Temp _ENV["UNZIP"] => D:\\work\\7-zip\\7za x -y _ENV["USERDNSDOMAIN"] => KASIS.kai-schroeder.net _ENV["USERDOMAIN"] => KASIS _ENV["USERNAME"] => Administrator _ENV["USERPROFILE"] => C:\\Dokumente und Einstellungen\\Administrator _ENV["WGET"] => D:\\work\\wget\\wget _ENV["windir"] => C:\\WINNT _ENV["WORKDIR"] => D:\\work PHP License This program is free software; you can redistribute it and/or modify it under the terms of the PHP License as published by the PHP Group and included in the distribution in the file: LICENSE This program is distributed in the hope that it will be useful, but WITHOUT ANY WARRANTY; without even the implied warranty of MERCHANTABILITY or FITNESS FOR A PARTICULAR PURPOSE. If you did not receive a copy of the PHP license, or have any questions about PHP licensing, please contact license@php.net.

« previous php.qa (#8690) next »