Test results [failed]

From: Date: Sat, 08 Feb 2003 20:42:08 +0000
Subject: Test results [failed]
Groups: php.qa 
Request: Send a blank email to php-qa+get-8884@lists.php.net to get a copy of this message
===================================================================== FAILED TEST SUMMARY --------------------------------------------------------------------- Bug #20175 (Static vars can't store ref to new instance) [tests/lang/bug20175.phpt] Bug #21094 (set_error_handler not accepting methods) [tests/lang/bug21094.phpt] Bug #21600 (assign by reference function call changes variable contents) [tests/lang/bug21600.phpt] Bug #21800 (Segfault under interactive mode) [tests/lang/bug21800.phpt] Bug #21849 (self::constant doesn't work as method's default parameter) [tests/lang/bug21849.phpt] Bug #21961 (get_parent_class() segfault) [tests/lang/bug21961.phpt] session object deserialization [ext/session/tests/003.phpt] session_set_save_handler test [ext/session/tests/004.phpt] custom save handler, multiple session_start()s, complex data structure test. [ext/session/tests/005.phpt] aggregating everything [ext/standard/tests/aggregation/aggregate.phpt] aggregating all methods [ext/standard/tests/aggregation/aggregate_methods.phpt] aggregating methods specified in the list [ext/standard/tests/aggregation/aggregate_methods_by_list.phpt] aggregating methods matching regular expression [ext/standard/tests/aggregation/aggregate_methods_by_regexp.phpt] ===================================================================== ===================================================================== TEST RESULT SUMMARY --------------------------------------------------------------------- Exts skipped : 70 Exts tested : 15 --------------------------------------------------------------------- Number of tests : 508 Tests skipped : 219 (43.1%) Tests failed : 13 ( 2.6%) Tests passed : 276 (54.3%) --------------------------------------------------------------------- Time taken : 44 seconds ===================================================================== ================================================================================ /home/nezar/tmp/php5-200302081830/tests/lang/bug20175.phpt ================================================================================ ---- EXPECTED OUTPUT %s foo_static() foo_global() foo:1 foo_static() foo:1 bar_static() bar_global() bar:1 bar_static() bar_global() bar:2 wow_static() wow_global() wow:1 wow_static() wow:1 oop_test() oop_static() oop_class() oop:1 oop_static() oop:1 oop_test() oop_static() oop:1 ---- ACTUAL OUTPUT ---- FAILED ================================================================================ 001- %s 001+ 002- foo_static() 003- foo_global() 004- foo:1 005- foo_static() 006- foo:1 007- bar_static() 008- bar_global() 009- bar:1 010- bar_static() 011- bar_global() 012- bar:2 013- wow_static() 014- wow_global() 015- wow:1 016- wow_static() 017- wow:1 018- oop_test() 019- oop_static() 020- oop_class() 021- oop:1 022- oop_static() 023- oop:1 024- oop_test() 025- oop_static() 026- oop:1 ================================================================================ ================================================================================ /home/nezar/tmp/php5-200302081830/tests/lang/bug21094.phpt ================================================================================ ---- EXPECTED OUTPUT [1024] errstr: test, errfile: %s, errline: %d ---- ACTUAL OUTPUT Notice: Array to string conversion in /home/nezar/tmp/php5-200302081830/tests/lang/bug21094.php on line 8 Notice: test in /home/nezar/tmp/php5-200302081830/tests/lang/bug21094.php on line 10 ---- FAILED ================================================================================ 001- [1024] errstr: test, errfile: %s, errline: %d 001+ Notice: Array to string conversion in /home/nezar/tmp/php5-200302081830/tests/lang/bug21094.php on line 8 002+ 003+ Notice: test in /home/nezar/tmp/php5-200302081830/tests/lang/bug21094.php on line 10 ================================================================================ ================================================================================ /home/nezar/tmp/php5-200302081830/tests/lang/bug21600.phpt ================================================================================ ---- EXPECTED OUTPUT array(1) { ["foo"]=> string(4) "test" } array(1) { ["foo"]=> string(4) "test" } ---- ACTUAL OUTPUT array(1) { ["foo"]=> &string(4) "test" } array(1) { ["foo"]=> string(4) "test" } ---- FAILED ================================================================================ 003- string(4) "test" 003+ &string(4) "test" ================================================================================ ================================================================================ /home/nezar/tmp/php5-200302081830/tests/lang/bug21800.phpt ================================================================================ ---- EXPECTED OUTPUT Interactive mode enabled :test: ---- ACTUAL OUTPUT ---- FAILED ================================================================================ 001- Interactive mode enabled 001+ 002- 003- :test: ================================================================================ ================================================================================ /home/nezar/tmp/php5-200302081830/tests/lang/bug21849.phpt ================================================================================ ---- EXPECTED OUTPUT fubar ---- ACTUAL OUTPUT Fatal error: Undefined class 'self' in /home/nezar/tmp/php5-200302081830/tests/lang/bug21849.php on line 5 ---- FAILED ================================================================================ 001- fubar 001+ Fatal error: Undefined class 'self' in /home/nezar/tmp/php5-200302081830/tests/lang/bug21849.php on line 5 ================================================================================ ================================================================================ /home/nezar/tmp/php5-200302081830/tests/lang/bug21961.phpt ================================================================================ ---- EXPECTED OUTPUT string(14) "The old Tavern" ---- ACTUAL OUTPUT ---- FAILED ================================================================================ 001- string(14) "The old Tavern" 001+ ================================================================================ ================================================================================ /home/nezar/tmp/php5-200302081830/ext/session/tests/003.phpt ================================================================================ ---- EXPECTED OUTPUT object(foo)(2) { ["bar"]=> string(2) "ok" ["yes"]=> int(2) } array(1) { [3]=> &object(foo)(2) { ["bar"]=> string(2) "ok" ["yes"]=> int(2) } } ---- ACTUAL OUTPUT object(foo)(2) { ["bar"]=> string(2) "ok" ["yes"]=> int(2) } array(1) { [3]=> object(foo)(2) { ["bar"]=> string(2) "ok" ["yes"]=> int(2) } } ---- FAILED ================================================================================ 009- &object(foo)(2) { 009+ object(foo)(2) { ================================================================================ ================================================================================ /home/nezar/tmp/php5-200302081830/ext/session/tests/004.phpt ================================================================================ ---- EXPECTED OUTPUT OPEN: PHPSESSID READ: abtest object(foo)(2) { ["bar"]=> string(2) "ok" ["yes"]=> int(2) } array(1) { [3]=> &object(foo)(2) { ["bar"]=> string(2) "ok" ["yes"]=> int(2) } } WRITE: abtest, baz|O:3:"foo":2:{s:3:"bar";s:2:"ok";s:3:"yes";i:2;}arr|a:1:{i:3;O:3:"foo":2:{s:3:"bar";s:2:"ok";s:3:"yes";i:2;}} OPEN: PHPSESSID READ: abtest object(foo)(2) { ["bar"]=> string(2) "ok" ["yes"]=> int(2) } array(1) { [3]=> object(foo)(2) { ["bar"]=> string(2) "ok" ["yes"]=> int(2) } } DESTROY: abtest ---- ACTUAL OUTPUT OPEN: PHPSESSID READ: abtest object(foo)(2) { ["bar"]=> string(2) "ok" ["yes"]=> int(2) } array(1) { [3]=> object(foo)(2) { ["bar"]=> string(2) "ok" ["yes"]=> int(2) } } WRITE: abtest, baz|O:3:"foo":2:{s:3:"bar";s:2:"ok";s:3:"yes";i:2;}arr|a:1:{i:3;O:3:"foo":2:{s:3:"bar";s:2:"ok";s:3:"yes";i:2;}} OPEN: PHPSESSID READ: abtest object(foo)(2) { ["bar"]=> string(2) "ok" ["yes"]=> int(2) } array(1) { [3]=> object(foo)(2) { ["bar"]=> string(2) "ok" ["yes"]=> int(2) } } DESTROY: abtest ---- FAILED ================================================================================ 011- &object(foo)(2) { 011+ object(foo)(2) { ================================================================================ ================================================================================ /home/nezar/tmp/php5-200302081830/ext/session/tests/005.phpt ================================================================================ ---- EXPECTED OUTPUT OPEN: PHPSESSID READ: abtest object(foo)(2) { ["bar"]=> string(2) "ok" ["yes"]=> int(2) } array(1) { [3]=> &object(foo)(2) { ["bar"]=> string(2) "ok" ["yes"]=> int(2) } } WRITE: abtest, baz|O:3:"foo":2:{s:3:"bar";s:2:"ok";s:3:"yes";i:2;}arr|a:1:{i:3;O:3:"foo":2:{s:3:"bar";s:2:"ok";s:3:"yes";i:2;}} CLOSE OPEN: PHPSESSID READ: abtest object(foo)(2) { ["bar"]=> string(2) "ok" ["yes"]=> int(3) } array(1) { [3]=> &object(foo)(2) { ["bar"]=> string(2) "ok" ["yes"]=> int(3) } } int(123) WRITE: abtest, baz|O:3:"foo":2:{s:3:"bar";s:2:"ok";s:3:"yes";i:3;}arr|a:1:{i:3;O:3:"foo":2:{s:3:"bar";s:2:"ok";s:3:"yes";i:3;}}c|i:123; CLOSE OPEN: PHPSESSID READ: abtest object(foo)(2) { ["bar"]=> string(2) "ok" ["yes"]=> int(3) } array(1) { [3]=> object(foo)(2) { ["bar"]=> string(2) "ok" ["yes"]=> int(3) } } int(123) DESTROY: abtest CLOSE ---- ACTUAL OUTPUT OPEN: PHPSESSID READ: abtest object(foo)(2) { ["bar"]=> string(2) "ok" ["yes"]=> int(2) } array(1) { [3]=> object(foo)(2) { ["bar"]=> string(2) "ok" ["yes"]=> int(2) } } WRITE: abtest, baz|O:3:"foo":2:{s:3:"bar";s:2:"ok";s:3:"yes";i:2;}arr|a:1:{i:3;O:3:"foo":2:{s:3:"bar";s:2:"ok";s:3:"yes";i:2;}} CLOSE OPEN: PHPSESSID READ: abtest object(foo)(2) { ["bar"]=> string(2) "ok" ["yes"]=> int(3) } array(1) { [3]=> object(foo)(2) { ["bar"]=> string(2) "ok" ["yes"]=> int(3) } } int(123) WRITE: abtest, baz|O:3:"foo":2:{s:3:"bar";s:2:"ok";s:3:"yes";i:3;}arr|a:1:{i:3;O:3:"foo":2:{s:3:"bar";s:2:"ok";s:3:"yes";i:3;}}c|i:123; CLOSE OPEN: PHPSESSID READ: abtest object(foo)(2) { ["bar"]=> string(2) "ok" ["yes"]=> int(3) } array(1) { [3]=> object(foo)(2) { ["bar"]=> string(2) "ok" ["yes"]=> int(3) } } int(123) DESTROY: abtest CLOSE ---- FAILED ================================================================================ 011- &object(foo)(2) { 011+ object(foo)(2) { 030- &object(foo)(2) { 030+ object(foo)(2) { ================================================================================ ================================================================================ /home/nezar/tmp/php5-200302081830/ext/standard/tests/aggregation/aggregate.phpt ================================================================================ ---- EXPECTED OUTPUT I'm alive! I'm helping! I'm aggregating! **** ---- ACTUAL OUTPUT I'm alive! Fatal error: Call to undefined method simple::do_this() in /home/nezar/tmp/php5-200302081830/ext/standard/tests/aggregation/aggregate.php on line 7 ---- FAILED ================================================================================ 002- I'm helping! 002+ 003- I'm aggregating! 003+ Fatal error: Call to undefined method simple::do_this() in /home/nezar/tmp/php5-200302081830/ext/standard/tests/aggregation/aggregate.php on line 7 004- **** ================================================================================ ================================================================================ /home/nezar/tmp/php5-200302081830/ext/standard/tests/aggregation/aggregate_methods.phpt ================================================================================ ---- EXPECTED OUTPUT I'm alive! mixing 100 simple,mix_it simple_prop mixing ---- ACTUAL OUTPUT I'm alive! Fatal error: Call to undefined method simple::mix_it() in /home/nezar/tmp/php5-200302081830/ext/standard/tests/aggregation/aggregate_methods.php on line 6 ---- FAILED ================================================================================ 002- mixing 002+ 003- 100 003+ Fatal error: Call to undefined method simple::mix_it() in /home/nezar/tmp/php5-200302081830/ext/standard/tests/aggregation/aggregate_methods.php on line 6 004- simple,mix_it 005- simple_prop 006- mixing ================================================================================ ================================================================================ /home/nezar/tmp/php5-200302081830/ext/standard/tests/aggregation/aggregate_methods_by_list.phpt ================================================================================ ---- EXPECTED OUTPUT I'm alive! simple,just_another_method I'm alive! simple,do_this,do_that yep, that's me ---- ACTUAL OUTPUT I'm alive! simple I'm alive! simple Fatal error: Call to undefined method simple::just_another_method() in /home/nezar/tmp/php5-200302081830/ext/standard/tests/aggregation/aggregate_methods_by_list.php on line 10 ---- FAILED ================================================================================ 002- simple,just_another_method 002+ simple 004- simple,do_this,do_that 004+ simple 005- yep, that's me 005+ 006+ Fatal error: Call to undefined method simple::just_another_method() in /home/nezar/tmp/php5-200302081830/ext/standard/tests/aggregation/aggregate_methods_by_list.php on line 10 ================================================================================ ================================================================================ /home/nezar/tmp/php5-200302081830/ext/standard/tests/aggregation/aggregate_methods_by_regexp.phpt ================================================================================ ---- EXPECTED OUTPUT I'm alive! simple,do_this,do_that I'm alive! simple,just_another_method ---- ACTUAL OUTPUT I'm alive! simple I'm alive! simple ---- FAILED ================================================================================ 002- simple,do_this,do_that 002+ simple 004- simple,just_another_method 004+ simple ================================================================================ ================================================================================ BUILD ENVIRONMENT ================================================================================ OS: Linux Automake: automake (GNU automake) 1.4-p6 Copyright (C) 1999, 2001 Free Software Foundation, Inc. This is free software; see the source for copying conditions. There is NO warranty; not even for MERCHANTABILITY or FITNESS FOR A PARTICULAR PURPOSE. Written by Tom Tromey <tromey@redhat.com> Autoconf: Autoconf version 2.13 Libtool: ltmain.sh (GNU libtool) 1.4.2 (1.922.2.53 2001/09/11 03:18:52) Compiler: Reading specs from /usr//bin/../lib/gcc-lib/i586-mandrake-linux-gnu/3.2/specs Configured with: ../configure --prefix=/usr --libdir=/usr/lib --with-slibdir=/lib --mandir=/usr/share/man --infodir=/usr/share/info --enable-shared --enable-threads=posix --disable-checking --enable-long-long --enable-__cxa_atexit --enable-languages=c,c++,ada,f77,objc,java --host=i586-mandrake-linux-gnu --with-system-zlib Thread model: posix gcc version 3.2 (Mandrake Linux 9.0 3.2-1mdk) Bison: bison (GNU Bison) 1.35 Copyright 1984, 1986, 1989, 1992, 2000, 2001, 2002 Free Software Foundation, Inc. This is free software; see the source for copying conditions. There is NO warranty; not even for MERCHANTABILITY or FITNESS FOR A PARTICULAR PURPOSE. User's E-mail: nnielsen at proventum dot net ================================================================================ PHPINFO ================================================================================ phpinfo() PHP Version => 5.0.0-dev System => Linux fezremote1.control.dk 2.4.19-16mdk #1 Fri Sep 20 18:15:05 CEST 2002 i686 Build Date => Feb 8 2003 21:34:47 Configure Command => './configure' '--with-zlib' '--enable-sockets' '--enable-sysvmsg' '--enable-sysvsem' '--enable-sysvshm' '--with-mysql' '--with-postgres' '--enable-dba' '--with-gd' '--enable-gd-native-ttf' '--with-ttf' '--with-apxs2=/usr/local/apache2/bin/apxs' Server API => Command Line Interface Virtual Directory Support => disabled Configuration File (php.ini) Path => /usr/local/lib PHP API => 20020918 PHP Extension => 20020429 Zend Extension => 90021012 Debug Build => no Thread Safety => disabled Registered PHP Streams => php, http, ftp, compress.zlib This program makes use of the Zend Scripting Language Engine: Zend Engine v2.0.0-dev, Copyright (c) 1998-2003 Zend Technologies<br /> _______________________________________________________________________ Configuration PHP Core Directive => Local Value => Master Value allow_call_time_pass_reference => On => On allow_url_fopen => On => On always_populate_raw_post_data => Off => Off arg_separator.input => &amp; => &amp; arg_separator.output => &amp; => &amp; asp_tags => Off => Off auto_append_file => no value => no value auto_prepend_file => no value => no value browscap => no value => no value default_charset => no value => no value default_mimetype => text/html => text/html define_syslog_variables => Off => Off disable_functions => no value => no value display_errors => On => On display_startup_errors => Off => Off doc_root => no value => no value docref_ext => no value => no value docref_root => http://www.php.net/ => http://www.php.net/ enable_dl => On => On error_append_string => no value => no value error_log => no value => no value error_prepend_string => no value => no value error_reporting => no value => no value expose_php => On => On extension_dir => /usr/local/lib/php/extensions/no-debug-non-zts-20020429 => /usr/local/lib/php/extensions/no-debug-non-zts-20020429 file_uploads => On => On gpc_order => GPC => GPC highlight.bg => #FFFFFF => #FFFFFF highlight.comment => #FF8000 => #FF8000 highlight.default => #0000BB => #0000BB highlight.html => #000000 => #000000 highlight.keyword => #007700 => #007700 highlight.string => #DD0000 => #DD0000 html_errors => Off => On ignore_repeated_errors => Off => Off ignore_repeated_source => Off => Off ignore_user_abort => Off => Off implicit_flush => On => Off include_path => .:/usr/local/lib/php => .:/usr/local/lib/php log_errors => Off => Off log_errors_max_len => 1024 => 1024 magic_quotes_gpc => On => On magic_quotes_runtime => Off => Off magic_quotes_sybase => Off => Off max_execution_time => 0 => 30 max_input_time => -1 => -1 open_basedir => no value => no value output_buffering => 0 => 0 output_handler => no value => no value post_max_size => 8M => 8M precision => 14 => 14 register_argc_argv => On => On register_globals => Off => Off report_memleaks => On => On report_zend_debug => On => On safe_mode => Off => Off safe_mode_exec_dir => 1 => 1 safe_mode_gid => Off => Off safe_mode_include_dir => no value => no value sendmail_from => no value => no value sendmail_path => /usr/sbin/sendmail -t -i => /usr/sbin/sendmail -t -i short_open_tag => On => On SMTP => localhost => localhost smtp_port => 25 => 25 sql.safe_mode => Off => Off track_errors => Off => Off unserialize_callback_func => no value => no value upload_max_filesize => 2M => 2M upload_tmp_dir => no value => no value user_dir => no value => no value variables_order => no value => no value xmlrpc_error_number => 0 => 0 xmlrpc_errors => Off => Off y2k_compliance => On => On zend2.implicit_clone => no value => no value ctype ctype functions => enabled dba DBA support => enabled Supported handlers => cdb cdb_make flatfile gd GD Support => enabled GD Version => bundled (2.0 compatible) GIF Read Support => enabled PNG Support => enabled WBMP Support => enabled XBM Support => enabled mysql MySQL Support => enabled Active Persistent Links => 0 Active Links => 0 Client API version => 3.23.49 MYSQL_MODULE_TYPE => builtin MYSQL_SOCKET => /tmp/mysql.sock MYSQL_INCLUDE => MYSQL_LIBS => Directive => Local Value => Master Value mysql.allow_persistent => On => On mysql.connect_timeout => -1 => -1 mysql.default_host => no value => no value mysql.default_password => no value => no value mysql.default_port => no value => no value mysql.default_socket => no value => no value mysql.default_user => no value => no value mysql.max_links => Unlimited => Unlimited mysql.max_persistent => Unlimited => Unlimited mysql.trace_mode => Off => Off pcre PCRE (Perl Compatible Regular Expressions) Support => enabled PCRE Library Version => 3.92 11-Sep-2002 posix Revision => $Revision: 1.54 $ session Session Support => enabled Registered save handlers => files user Directive => Local Value => Master Value session.auto_start => Off => Off session.bug_compat_42 => On => On session.bug_compat_warn => On => On session.cache_expire => 180 => 180 session.cache_limiter => nocache => nocache session.cookie_domain => no value => no value session.cookie_lifetime => 0 => 0 session.cookie_path => / => / session.cookie_secure => Off => Off session.entropy_file => no value => no value session.entropy_length => 0 => 0 session.gc_dividend => 100 => 100 session.gc_maxlifetime => 1440 => 1440 session.gc_probability => 1 => 1 session.hash_bits_per_character => 4 => 4 session.hash_function => 0 => 0 session.name => PHPSESSID => PHPSESSID session.referer_check => no value => no value session.save_handler => files => files session.save_path => /tmp => /tmp session.serialize_handler => php => php session.use_cookies => On => On session.use_only_cookies => Off => Off session.use_trans_sid => Off => Off sockets Sockets Support => enabled standard Regex Library => Bundled library enabled Dynamic Library Support => enabled Path to sendmail => /usr/sbin/sendmail -t -i Directive => Local Value => Master Value assert.active => 1 => 1 assert.bail => 0 => 0 assert.callback => no value => no value assert.quiet_eval => 0 => 0 assert.warning => 1 => 1 auto_detect_line_endings => 0 => 0 default_socket_timeout => 60 => 60 safe_mode_allowed_env_vars => PHP_ => PHP_ safe_mode_protected_env_vars => LD_LIBRARY_PATH => LD_LIBRARY_PATH url_rewriter.tags => a=href,area=href,frame=src,form=,fieldset= => a=href,area=href,frame=src,form=,fieldset= user_agent => no value => no value sysvmsg sysvmsg support => enabled Revision => $Revision: 1.8 $ tokenizer Tokenizer Support => enabled xml XML Support => active XML Namespace Support => active EXPAT Version => 1.95.5 zlib ZLib Support => enabled Compiled Version => 1.1.4 Linked Version => 1.1.4 Directive => Local Value => Master Value zlib.output_compression => Off => Off zlib.output_compression_level => -1 => -1 zlib.output_handler => no value => no value Additional Modules Module Name sysvsem sysvshm Environment Variable => Value LESSKEY => /etc/.less KDE_MULTIHEAD => false SSH_AGENT_PID => 2197 HOSTNAME => fezremote1.control.dk LC_MONETARY => en_US TEST_PHP_SRCDIR => /home/nezar/tmp/php5-200302081830 TERM => xterm SHELL => /bin/sh HISTSIZE => 1000 MAKEFLAGS => XDM_MANAGED => /var/run/xdmctl/xdmctl-:0,maysd,mayfn,sched SSH_CLIENT => deleted TMPDIR => /home/nezar/tmp QT_XFT => 0 GS_LIB => /home/nezar/.kde/share/fonts GTK_RC_FILES => /etc/gtk/gtkrc:/home/nezar/.gtkrc:/home/nezar/.gtkrc-kde CVSROOT => nezar@linux1.control.dk:/var/cvsroot LC_NUMERIC => en_US SSH_TTY => deleted USER => nezar LS_COLORS => no=00:fi=00:di=01;34:ln=01;36:pi=40;33:so=01;35:bd=40;33;01:cd=40;33;01:or=01;05;37;41:mi=01;05;37;41:ex=01;32:*.cmd=01;32:*.exe=01;32:*.com=01;32:*.btm=01;32:*.bat=01;32:*.tar=01;31:*.tgz=01;31:*.tbz2=01;31:*.arc=01;31:*.arj=01;31:*.taz=01;31:*.lzh=01;31:*.lha=01;31:*.zip=01;31:*.z=01;31:*.Z=01;31:*.gz=01;31:*.bz2=01;31:*.bz=01;31:*.tz=01;31:*.rpm=01;31:*.jpg=01;35:*.jpeg=01;35:*.gif=01;35:*.bmp=01;35:*.xbm=01;35:*.xpm=01;35:*.png=01;35:*.tif=01;35:*.tiff=01;35: SCRIPT_FILENAME => GDK_USE_XFT => 1 SSH_AUTH_SOCK => deleted SESSION_MANAGER => local/fezremote1.control.dk:/tmp/.ICE-unix/2315 GNOME_DISABLE_CRASH_DIALOG => 1 MAKELEVEL => 1 MFLAGS => KONSOLE_DCOP => DCOPRef(konsole-2331,konsole) NLSPATH => /usr/share/locale/%l/%N PATH => /usr//bin:/bin:/usr/bin::/usr/local/bin:/usr/X11R6/bin:/usr/games:/home/nezar/bin MAIL => /var/spool/mail/nezar LC_MESSAGES => en_US _ => /home/nezar/tmp/php5-200302081830/sapi/cli/php LC_COLLATE => en_US SECURE_LEVEL => 3 PWD => /home/nezar/tmp/php5-200302081830 KONSOLE_DCOP_SESSION => DCOPRef(konsole-2331,session-2) INPUTRC => /etc/inputrc XMODIFIERS => @im=none HELP_BROWSER => kfmclient openProfile webbrowsing LANG => en_US TEST_PHP_EXECUTABLE => /home/nezar/tmp/php5-200302081830/sapi/cli/php REDIRECT_STATUS => PATH_TRANSLATED => HISTCONTROL => ignoredups HOME => /home/nezar SHLVL => 4 CONTENT_LENGTH => LANGUAGE => en_US:en LESS => -MM LOGNAME => nezar TMP => /home/nezar/tmp QUERY_STRING => LC_CTYPE => en_US LESSOPEN => |/usr/bin/lesspipe.sh %s BROWSER => kfmclient openProfile webbrowsing CONTENT_TYPE => DISPLAY => :0 CC => gcc REQUEST_METHOD => LC_TIME => en_US G_BROKEN_FILENAMES => 1 XAUTHORITY => /home/nezar/.Xauthority COLORTERM => mc => () { mkdir -p $HOME/.mc/tmp 2>/dev/null; chmod 700 $HOME/.mc/tmp; MC=$HOME/.mc/tmp/mc-$$; /usr/bin/mc -P "$@" >"$MC"; cd "cat $MC"; rm -i -f "$MC"; unset MC } PHP Variables Variable => Value _SERVER["LESSKEY"] => /etc/.less _SERVER["KDE_MULTIHEAD"] => false _SERVER["SSH_AGENT_PID"] => 2197 _SERVER["HOSTNAME"] => fezremote1.control.dk _SERVER["LC_MONETARY"] => en_US _SERVER["TEST_PHP_SRCDIR"] => /home/nezar/tmp/php5-200302081830 _SERVER["TERM"] => xterm _SERVER["SHELL"] => /bin/sh _SERVER["HISTSIZE"] => 1000 _SERVER["MAKEFLAGS"] => _SERVER["XDM_MANAGED"] => /var/run/xdmctl/xdmctl-:0,maysd,mayfn,sched _SERVER["SSH_CLIENT"] => deleted _SERVER["TMPDIR"] => /home/nezar/tmp _SERVER["QT_XFT"] => 0 _SERVER["GS_LIB"] => /home/nezar/.kde/share/fonts _SERVER["GTK_RC_FILES"] => /etc/gtk/gtkrc:/home/nezar/.gtkrc:/home/nezar/.gtkrc-kde _SERVER["CVSROOT"] => nezar@linux1.control.dk:/var/cvsroot _SERVER["LC_NUMERIC"] => en_US _SERVER["SSH_TTY"] => deleted _SERVER["USER"] => nezar _SERVER["LS_COLORS"] => no=00:fi=00:di=01;34:ln=01;36:pi=40;33:so=01;35:bd=40;33;01:cd=40;33;01:or=01;05;37;41:mi=01;05;37;41:ex=01;32:*.cmd=01;32:*.exe=01;32:*.com=01;32:*.btm=01;32:*.bat=01;32:*.tar=01;31:*.tgz=01;31:*.tbz2=01;31:*.arc=01;31:*.arj=01;31:*.taz=01;31:*.lzh=01;31:*.lha=01;31:*.zip=01;31:*.z=01;31:*.Z=01;31:*.gz=01;31:*.bz2=01;31:*.bz=01;31:*.tz=01;31:*.rpm=01;31:*.jpg=01;35:*.jpeg=01;35:*.gif=01;35:*.bmp=01;35:*.xbm=01;35:*.xpm=01;35:*.png=01;35:*.tif=01;35:*.tiff=01;35: _SERVER["SCRIPT_FILENAME"] => _SERVER["GDK_USE_XFT"] => 1 _SERVER["SSH_AUTH_SOCK"] => deleted _SERVER["SESSION_MANAGER"] => local/fezremote1.control.dk:/tmp/.ICE-unix/2315 _SERVER["GNOME_DISABLE_CRASH_DIALOG"] => 1 _SERVER["MAKELEVEL"] => 1 _SERVER["MFLAGS"] => _SERVER["KONSOLE_DCOP"] => DCOPRef(konsole-2331,konsole) _SERVER["NLSPATH"] => /usr/share/locale/%l/%N _SERVER["PATH"] => /usr//bin:/bin:/usr/bin::/usr/local/bin:/usr/X11R6/bin:/usr/games:/home/nezar/bin _SERVER["MAIL"] => /var/spool/mail/nezar _SERVER["LC_MESSAGES"] => en_US _SERVER["_"] => /home/nezar/tmp/php5-200302081830/sapi/cli/php _SERVER["LC_COLLATE"] => en_US _SERVER["SECURE_LEVEL"] => 3 _SERVER["PWD"] => /home/nezar/tmp/php5-200302081830 _SERVER["KONSOLE_DCOP_SESSION"] => DCOPRef(konsole-2331,session-2) _SERVER["INPUTRC"] => /etc/inputrc _SERVER["XMODIFIERS"] => @im=none _SERVER["HELP_BROWSER"] => kfmclient openProfile webbrowsing _SERVER["LANG"] => en_US _SERVER["TEST_PHP_EXECUTABLE"] => /home/nezar/tmp/php5-200302081830/sapi/cli/php _SERVER["REDIRECT_STATUS"] => _SERVER["PATH_TRANSLATED"] => _SERVER["HISTCONTROL"] => ignoredups _SERVER["HOME"] => /home/nezar _SERVER["SHLVL"] => 4 _SERVER["CONTENT_LENGTH"] => _SERVER["LANGUAGE"] => en_US:en _SERVER["LESS"] => -MM _SERVER["LOGNAME"] => nezar _SERVER["TMP"] => /home/nezar/tmp _SERVER["QUERY_STRING"] => _SERVER["LC_CTYPE"] => en_US _SERVER["LESSOPEN"] => |/usr/bin/lesspipe.sh %s _SERVER["BROWSER"] => kfmclient openProfile webbrowsing _SERVER["CONTENT_TYPE"] => _SERVER["DISPLAY"] => :0 _SERVER["CC"] => gcc _SERVER["REQUEST_METHOD"] => _SERVER["LC_TIME"] => en_US _SERVER["G_BROKEN_FILENAMES"] => 1 _SERVER["XAUTHORITY"] => /home/nezar/.Xauthority _SERVER["COLORTERM"] => _SERVER["mc"] => () { mkdir -p $HOME/.mc/tmp 2>/dev/null; chmod 700 $HOME/.mc/tmp; MC=$HOME/.mc/tmp/mc-$$; /usr/bin/mc -P \"$@\" >\"$MC\"; cd \"cat $MC\"; rm -i -f \"$MC\"; unset MC } _SERVER["PHP_SELF"] => _SERVER["SCRIPT_NAME"] => _SERVER["DOCUMENT_ROOT"] => _SERVER["argv"] => Array ( ) _SERVER["argc"] => 0 _ENV["LESSKEY"] => /etc/.less _ENV["KDE_MULTIHEAD"] => false _ENV["SSH_AGENT_PID"] => 2197 _ENV["HOSTNAME"] => fezremote1.control.dk _ENV["LC_MONETARY"] => en_US _ENV["TEST_PHP_SRCDIR"] => /home/nezar/tmp/php5-200302081830 _ENV["TERM"] => xterm _ENV["SHELL"] => /bin/sh _ENV["HISTSIZE"] => 1000 _ENV["MAKEFLAGS"] => _ENV["XDM_MANAGED"] => /var/run/xdmctl/xdmctl-:0,maysd,mayfn,sched _ENV["SSH_CLIENT"] => deleted _ENV["TMPDIR"] => /home/nezar/tmp _ENV["QT_XFT"] => 0 _ENV["GS_LIB"] => /home/nezar/.kde/share/fonts _ENV["GTK_RC_FILES"] => /etc/gtk/gtkrc:/home/nezar/.gtkrc:/home/nezar/.gtkrc-kde _ENV["CVSROOT"] => nezar@linux1.control.dk:/var/cvsroot _ENV["LC_NUMERIC"] => en_US _ENV["SSH_TTY"] => deleted _ENV["USER"] => nezar _ENV["LS_COLORS"] => no=00:fi=00:di=01;34:ln=01;36:pi=40;33:so=01;35:bd=40;33;01:cd=40;33;01:or=01;05;37;41:mi=01;05;37;41:ex=01;32:*.cmd=01;32:*.exe=01;32:*.com=01;32:*.btm=01;32:*.bat=01;32:*.tar=01;31:*.tgz=01;31:*.tbz2=01;31:*.arc=01;31:*.arj=01;31:*.taz=01;31:*.lzh=01;31:*.lha=01;31:*.zip=01;31:*.z=01;31:*.Z=01;31:*.gz=01;31:*.bz2=01;31:*.bz=01;31:*.tz=01;31:*.rpm=01;31:*.jpg=01;35:*.jpeg=01;35:*.gif=01;35:*.bmp=01;35:*.xbm=01;35:*.xpm=01;35:*.png=01;35:*.tif=01;35:*.tiff=01;35: _ENV["SCRIPT_FILENAME"] => _ENV["GDK_USE_XFT"] => 1 _ENV["SSH_AUTH_SOCK"] => deleted _ENV["SESSION_MANAGER"] => local/fezremote1.control.dk:/tmp/.ICE-unix/2315 _ENV["GNOME_DISABLE_CRASH_DIALOG"] => 1 _ENV["MAKELEVEL"] => 1 _ENV["MFLAGS"] => _ENV["KONSOLE_DCOP"] => DCOPRef(konsole-2331,konsole) _ENV["NLSPATH"] => /usr/share/locale/%l/%N _ENV["PATH"] => /usr//bin:/bin:/usr/bin::/usr/local/bin:/usr/X11R6/bin:/usr/games:/home/nezar/bin _ENV["MAIL"] => /var/spool/mail/nezar _ENV["LC_MESSAGES"] => en_US _ENV["_"] => /home/nezar/tmp/php5-200302081830/sapi/cli/php _ENV["LC_COLLATE"] => en_US _ENV["SECURE_LEVEL"] => 3 _ENV["PWD"] => /home/nezar/tmp/php5-200302081830 _ENV["KONSOLE_DCOP_SESSION"] => DCOPRef(konsole-2331,session-2) _ENV["INPUTRC"] => /etc/inputrc _ENV["XMODIFIERS"] => @im=none _ENV["HELP_BROWSER"] => kfmclient openProfile webbrowsing _ENV["LANG"] => en_US _ENV["TEST_PHP_EXECUTABLE"] => /home/nezar/tmp/php5-200302081830/sapi/cli/php _ENV["REDIRECT_STATUS"] => _ENV["PATH_TRANSLATED"] => _ENV["HISTCONTROL"] => ignoredups _ENV["HOME"] => /home/nezar _ENV["SHLVL"] => 4 _ENV["CONTENT_LENGTH"] => _ENV["LANGUAGE"] => en_US:en _ENV["LESS"] => -MM _ENV["LOGNAME"] => nezar _ENV["TMP"] => /home/nezar/tmp _ENV["QUERY_STRING"] => _ENV["LC_CTYPE"] => en_US _ENV["LESSOPEN"] => |/usr/bin/lesspipe.sh %s _ENV["BROWSER"] => kfmclient openProfile webbrowsing _ENV["CONTENT_TYPE"] => _ENV["DISPLAY"] => :0 _ENV["CC"] => gcc _ENV["REQUEST_METHOD"] => _ENV["LC_TIME"] => en_US _ENV["G_BROKEN_FILENAMES"] => 1 _ENV["XAUTHORITY"] => /home/nezar/.Xauthority _ENV["COLORTERM"] => _ENV["mc"] => () { mkdir -p $HOME/.mc/tmp 2>/dev/null; chmod 700 $HOME/.mc/tmp; MC=$HOME/.mc/tmp/mc-$$; /usr/bin/mc -P \"$@\" >\"$MC\"; cd \"cat $MC\"; rm -i -f \"$MC\"; unset MC } PHP License This program is free software; you can redistribute it and/or modify it under the terms of the PHP License as published by the PHP Group and included in the distribution in the file: LICENSE This program is distributed in the hope that it will be useful, but WITHOUT ANY WARRANTY; without even the implied warranty of MERCHANTABILITY or FITNESS FOR A PARTICULAR PURPOSE. If you did not receive a copy of the PHP license, or have any questions about PHP licensing, please contact license@php.net.

« previous php.qa (#8884) next »