Test results [failed]
| From: | noreply@php.net | Date: | Sun, 09 Feb 2003 13:00:40 +0000 |
| Subject: | Test results [failed] | ||
| Groups: | php.qa | ||
| Request: | Send a blank email to php-qa+get-8895@lists.php.net to get a copy of this message | ||
=====================================================================
FAILED TEST SUMMARY
---------------------------------------------------------------------
File type functions [D:\work\php4\ext\standard\tests\file\001.phpt]
is_*() and file_exists() return values are boolean. [D:\work\php4\ext\standard\tests\file\003.phpt]
Bug #21131: fopen($filename, "a+") has broken position
[D:\work\php4\ext\standard\tests\file\bug21131.phpt]
getopt [D:\work\php4\ext\standard\tests\general_functions\getopt.phpt]
Various pow() tests [D:\work\php4\ext\standard\tests\math\pow.phpt]
unserialize() floats with E notation (#18654) [D:\work\php4\ext\standard\tests\serialize\003.phpt]
strtotime() function [D:\work\php4\ext\standard\tests\time\002.phpt]
gzopen(), gzread(), gzwrite() [D:\work\php4\ext\zlib\tests\gzreadgzwrite.phpt]
gzopen(), gzread(), gzwrite() for non-compressed data
[D:\work\php4\ext\zlib\tests\gzreadgzwriteplain.phpt]
Testing register_shutdown_function() with timeout. (Bug: #21513) [D:\work\php4\tests\func\005a.phpt]
Bug #21600 (assign by reference function call changes variable contents)
[D:\work\php4\tests\lang\bug21600.phpt]
=====================================================================
=====================================================================
TEST RESULT SUMMARY
---------------------------------------------------------------------
Exts skipped : 72
Exts tested : 15
---------------------------------------------------------------------
Number of tests : 458
Tests skipped : 216 (47.2%)
Tests failed : 11 ( 2.4%)
Tests passed : 231 (50.4%)
---------------------------------------------------------------------
Time taken : 44 seconds
=====================================================================
================================================================================
D:\work\php4\ext\standard\tests\file\001.phpt
================================================================================
---- EXPECTED OUTPUT
test.file does not exist
test.file exists
test.link exists
test.file is not a symlink
test.link is a symlink
test.file exists
test.link lstat and stat differ at element 1
test.link lstat and stat differ at element 2
test.link lstat and stat differ at element 7
test.link lstat and stat differ at element 8
test.link lstat and stat differ at element 9
test.link lstat and stat differ at element 10
test.file is file
test.link is link
test.file permissions are 0744
test.file size is 0
test.file is writeable
test.file is readable
test.file is executable
test.file is a regular file
test.link is a regular file
test.link is not a directory
../file is a directory
test.file is not a directory
test.file does not exist
test.file does not exist
---- ACTUAL OUTPUT
test.file does not exist
test.file exists
Fatal error: Call to undefined function: symlink() in D:\work\php4\ext\standard\tests\file\001.php
on line 18
---- FAILED
================================================================================
003- test.link exists
003+
004- test.file is not a symlink
004+ Fatal error: Call to undefined function: symlink() in
D:\work\php4\ext\standard\tests\file\001.php on line 18
005- test.link is a symlink
006- test.file exists
007- test.link lstat and stat differ at element 1
008- test.link lstat and stat differ at element 2
009- test.link lstat and stat differ at element 7
010- test.link lstat and stat differ at element 8
011- test.link lstat and stat differ at element 9
012- test.link lstat and stat differ at element 10
013- test.file is file
014- test.link is link
015- test.file permissions are 0744
016- test.file size is 0
017- test.file is writeable
018- test.file is readable
019- test.file is executable
020- test.file is a regular file
021- test.link is a regular file
022- test.link is not a directory
023- ../file is a directory
024- test.file is not a directory
025- test.file does not exist
026- test.file does not exist
================================================================================
================================================================================
D:\work\php4\ext\standard\tests\file\003.phpt
================================================================================
---- EXPECTED OUTPUT
boolean
boolean
boolean
boolean
boolean
boolean
boolean
boolean
boolean
boolean
---- ACTUAL OUTPUT
boolean
boolean
Fatal error: Call to undefined function: is_executable() in
D:\work\php4\ext\standard\tests\file\003.php on line 14
---- FAILED
================================================================================
003- boolean
003+
004- boolean
004+ Fatal error: Call to undefined function: is_executable() in
D:\work\php4\ext\standard\tests\file\003.php on line 14
005- boolean
006- boolean
007- boolean
008- boolean
009- boolean
010- boolean
================================================================================
================================================================================
D:\work\php4\ext\standard\tests\file\bug21131.phpt
================================================================================
---- EXPECTED OUTPUT
int(6)
int(0)
foobar
---- ACTUAL OUTPUT
int(0)
int(0)
foobar
---- FAILED
================================================================================
001- int(6)
001+ int(0)
================================================================================
================================================================================
D:\work\php4\ext\standard\tests\general_functions\getopt.phpt
================================================================================
---- EXPECTED OUTPUT
array(5) {
["v"]=>
bool(false)
["h"]=>
bool(false)
["d"]=>
string(4) "test"
["m"]=>
string(4) "1234"
["t"]=>
bool(false)
}
---- ACTUAL OUTPUT
Fatal error: Call to undefined function: getopt() in
D:\work\php4\ext\standard\tests\general_functions\getopt.php on line 2
---- FAILED
================================================================================
001- array(5) {
001+ Fatal error: Call to undefined function: getopt() in
D:\work\php4\ext\standard\tests\general_functions\getopt.php on line 2
002- ["v"]=>
003- bool(false)
004- ["h"]=>
005- bool(false)
006- ["d"]=>
007- string(4) "test"
008- ["m"]=>
009- string(4) "1234"
010- ["t"]=>
011- bool(false)
012- }
================================================================================
================================================================================
D:\work\php4\ext\standard\tests\math\pow.phpt
================================================================================
---- EXPECTED OUTPUT
1,1,0,0
On failure, please mail result to php-dev@lists.php.net
OK
---- ACTUAL OUTPUT
1,1,0,0
On failure, please mail result to php-dev@lists.php.net
Assert failed:
TRUE === is_infinite(pow(0,-2))
Left: bool(true)
Right: bool(false)
Assert failed:
TRUE === is_infinite(pow(0,-1))
Left: bool(true)
Right: bool(false)
Assert failed:
TRUE === is_infinite(pow(0,-2.0))
Left: bool(true)
Right: bool(false)
Assert failed:
TRUE === is_infinite(pow(0,-1.0))
Left: bool(true)
Right: bool(false)
Assert failed:
TRUE === is_infinite(pow(0.0,-2.0))
Left: bool(true)
Right: bool(false)
Assert failed:
TRUE === is_infinite(pow(0.0,-1.0))
Left: bool(true)
Right: bool(false)
Assert failed:
TRUE === is_infinite(pow( 0.0,-2))
Left: bool(true)
Right: bool(false)
Assert failed:
TRUE === is_infinite(pow( 0.0,-1))
Left: bool(true)
Right: bool(false)
---- FAILED
================================================================================
003- OK
003+
004+ Assert failed:
005+ TRUE === is_infinite(pow(0,-2))
006+ Left: bool(true)
007+ Right: bool(false)
008+
009+ Assert failed:
010+ TRUE === is_infinite(pow(0,-1))
011+ Left: bool(true)
012+ Right: bool(false)
013+
014+ Assert failed:
015+ TRUE === is_infinite(pow(0,-2.0))
016+ Left: bool(true)
017+ Right: bool(false)
018+
019+ Assert failed:
020+ TRUE === is_infinite(pow(0,-1.0))
021+ Left: bool(true)
022+ Right: bool(false)
023+
024+ Assert failed:
025+ TRUE === is_infinite(pow(0.0,-2.0))
026+ Left: bool(true)
027+ Right: bool(false)
028+
029+ Assert failed:
030+ TRUE === is_infinite(pow(0.0,-1.0))
031+ Left: bool(true)
032+ Right: bool(false)
033+
034+ Assert failed:
035+ TRUE === is_infinite(pow( 0.0,-2))
036+ Left: bool(true)
037+ Right: bool(false)
038+
039+ Assert failed:
040+ TRUE === is_infinite(pow( 0.0,-1))
041+ Left: bool(true)
042+ Right: bool(false)
================================================================================
================================================================================
D:\work\php4\ext\standard\tests\serialize\003.phpt
================================================================================
---- EXPECTED OUTPUT
d:100;
float(100)
d:5.2E+25;
float(5.2E+25)
d:8.529E-22;
float(8.529E-22)
d:9E-09;
float(9.E-9)
---- ACTUAL OUTPUT
d:100;
float(100)
d:5.2E+025;
float(5.2E+25)
d:8.529E-022;
float(8.529E-22)
d:9E-009;
float(9.E-9)
---- FAILED
================================================================================
004- d:5.2E+25;
004+ d:5.2E+025;
007- d:8.529E-22;
007+ d:8.529E-022;
010- d:9E-09;
010+ d:9E-009;
================================================================================
================================================================================
D:\work\php4\ext\standard\tests\time\002.phpt
================================================================================
---- EXPECTED OUTPUT
1999-10-13 00:00:00
1999-10-13 00:00:00
2000-01-19 00:00:00
2000-01-19 00:00:00
2001-12-21 00:00:00
2001-12-21 00:00:00
2001-12-21 12:16:00
2001-12-21 12:16:00
1969-12-31 23:59:59
2001-10-22 21:19:58
2001-10-22 23:19:58
2001-10-22 23:32:58
2001-10-22 19:19:58
2001-10-22 19:06:58
1999-10-13 00:00:00
1999-10-13 00:00:00
2000-01-19 00:00:00
2000-01-19 00:00:00
2001-12-21 00:00:00
2001-12-21 00:00:00
2001-12-21 12:16:00
2001-12-21 12:16:00
1970-01-01 00:59:59
2001-10-22 21:19:58
2001-10-23 01:19:58
2001-10-23 01:32:58
2001-10-22 21:19:58
2001-10-22 21:06:58
---- ACTUAL OUTPUT
1999-10-13 00:00:00
1999-10-13 00:00:00
2000-01-19 00:00:00
2000-01-19 00:00:00
2001-12-21 00:00:00
2001-12-21 00:00:00
2001-12-21 12:16:00
2001-12-21 12:16:00
Warning: date() [/phpmanual/function.date.html]: Windows does not support dates prior to midnight
(00:00:00), January 1, 1970 in D:\work\php4\ext\standard\tests\time\002.php on line 21
2001-10-22 21:19:58
2001-10-22 23:19:58
2001-10-22 23:32:58
2001-10-22 19:19:58
2001-10-22 19:06:58
1999-10-13 00:00:00
1999-10-13 00:00:00
2000-01-19 00:00:00
2000-01-19 00:00:00
2001-12-21 00:00:00
2001-12-21 00:00:00
2001-12-21 12:16:00
2001-12-21 12:16:00
Warning: date() [/phpmanual/function.date.html]: Windows does not support dates prior to midnight
(00:00:00), January 1, 1970 in D:\work\php4\ext\standard\tests\time\002.php on line 26
2001-10-22 21:19:58
2001-10-23 00:19:58
2001-10-23 00:32:58
2001-10-22 20:19:58
2001-10-22 20:06:58
---- FAILED
================================================================================
009- 1969-12-31 23:59:59
009+
010- 2001-10-22 21:19:58
010+ Warning: date() [/phpmanual/function.date.html]: Windows does not support dates prior to
midnight (00:00:00), January 1, 1970 in D:\work\php4\ext\standard\tests\time\002.php on line 21
011- 2001-10-22 23:19:58
011+ 2001-10-22 21:19:58
012- 2001-10-22 23:32:58
012+ 2001-10-22 23:19:58
013- 2001-10-22 19:19:58
013+ 2001-10-22 23:32:58
014- 2001-10-22 19:06:58
014+ 2001-10-22 19:19:58
015- 1999-10-13 00:00:00
015+ 2001-10-22 19:06:58
017- 2000-01-19 00:00:00
017+ 1999-10-13 00:00:00
019- 2001-12-21 00:00:00
019+ 2000-01-19 00:00:00
021- 2001-12-21 12:16:00
021+ 2001-12-21 00:00:00
023- 1970-01-01 00:59:59
023+ 2001-12-21 12:16:00
024- 2001-10-22 21:19:58
024+
025- 2001-10-23 01:19:58
025+ Warning: date() [/phpmanual/function.date.html]: Windows does not support dates prior to
midnight (00:00:00), January 1, 1970 in D:\work\php4\ext\standard\tests\time\002.php on line 26
026- 2001-10-23 01:32:58
026+ 2001-10-22 21:19:58
027- 2001-10-22 21:19:58
027+ 2001-10-23 00:19:58
028- 2001-10-22 21:06:58
028+ 2001-10-23 00:32:58
029+ 2001-10-22 20:19:58
030+ 2001-10-22 20:06:58
================================================================================
================================================================================
D:\work\php4\ext\zlib\tests\gzreadgzwrite.phpt
================================================================================
---- EXPECTED OUTPUT
int(36864)
int(36864)
Strings are equal
---- ACTUAL OUTPUT
int(36864)
int(36864)
Strings are not equal
string(0) ""
Warning: unlink(C:\DOKUME~1\ADMINI~1\LOKALE~1\Temp\php1B12.tmp) [/phpmanual/function.unlink.html]:
Permission denied in D:\work\php4\ext\zlib\tests\gzreadgzwrite.php on line 20
---- FAILED
================================================================================
003- Strings are equal
003+ Strings are not equal
004+ string(0) ""
005+
006+ Warning: unlink(C:\DOKUME~1\ADMINI~1\LOKALE~1\Temp\php1B12.tmp)
[/phpmanual/function.unlink.html]: Permission denied in
D:\work\php4\ext\zlib\tests\gzreadgzwrite.php on line 20
================================================================================
================================================================================
D:\work\php4\ext\zlib\tests\gzreadgzwriteplain.phpt
================================================================================
---- EXPECTED OUTPUT
int(36864)
int(36864)
Strings are equal
int(18432)
Strings are equal
---- ACTUAL OUTPUT
int(36864)
int(36864)
Strings are not equal
string(0) ""
int(0)
Strings are not equal
string(0) ""
Warning: unlink(C:\DOKUME~1\ADMINI~1\LOKALE~1\Temp\php1B13.tmp) [/phpmanual/function.unlink.html]:
Permission denied in D:\work\php4\ext\zlib\tests\gzreadgzwriteplain.php on line 32
---- FAILED
================================================================================
003- Strings are equal
003+ Strings are not equal
004- int(18432)
004+ string(0) ""
005- Strings are equal
005+ int(0)
006+ Strings are not equal
007+ string(0) ""
008+
009+ Warning: unlink(C:\DOKUME~1\ADMINI~1\LOKALE~1\Temp\php1B13.tmp)
[/phpmanual/function.unlink.html]: Permission denied in
D:\work\php4\ext\zlib\tests\gzreadgzwriteplain.php on line 32
================================================================================
================================================================================
D:\work\php4\tests\func\005a.phpt
================================================================================
---- EXPECTED OUTPUT
Start
Shutdown
---- ACTUAL OUTPUT
Start
---- FAILED
================================================================================
002- Shutdown
================================================================================
================================================================================
D:\work\php4\tests\lang\bug21600.phpt
================================================================================
---- EXPECTED OUTPUT
array(1) {
["foo"]=>
string(4) "test"
}
array(1) {
["foo"]=>
string(4) "test"
}
---- ACTUAL OUTPUT
array(1) {
["foo"]=>
&string(4) "test"
}
array(1) {
["foo"]=>
string(4) "test"
}
---- FAILED
================================================================================
003- string(4) "test"
003+ &string(4) "test"
================================================================================
================================================================================
BUILD ENVIRONMENT
================================================================================
OS:
WINNT
Automake:
N/A
Autoconf:
N/A
Libtool:
N/A
Compiler:
N/A
Bison:
User's E-mail: k dot schroeder at php dot net
================================================================================
PHPINFO
================================================================================
phpinfo()
PHP Version => 4.3.1-dev
System => Windows NT TANIS 5.0 build 2195
Build Date => Feb 6 2003 15:12:28
Server API => Command Line Interface
Virtual Directory Support => enabled
Configuration File (php.ini) Path => C:\WINNT\php.ini
PHP API => 20020918
PHP Extension => 20020429
Zend Extension => 20021010
Debug Build => no
Thread Safety => enabled
Registered PHP Streams => php, http, ftp, compress.zlib
This program makes use of the Zend Scripting Language Engine:
Zend Engine v1.3.0, Copyright (c) 1998-2003 Zend Technologies<br />
_______________________________________________________________________
Configuration
PHP Core
Directive => Local Value => Master Value
allow_call_time_pass_reference => On => On
allow_url_fopen => On => On
always_populate_raw_post_data => Off => Off
arg_separator.input => & => &
arg_separator.output => & => &
asp_tags => Off => Off
auto_append_file => no value => no value
auto_prepend_file => no value => no value
browscap => no value => no value
default_charset => no value => no value
default_mimetype => text/html => text/html
define_syslog_variables => Off => Off
disable_functions => no value => no value
display_errors => On => On
display_startup_errors => Off => Off
doc_root => no value => no value
docref_ext => no value => no value
docref_root => http://www.php.net/ => http://www.php.net/
enable_dl => On => On
error_append_string => no value => no value
error_log => no value => no value
error_prepend_string => no value => no value
error_reporting => 2039 => 2039
expose_php => On => On
extension_dir => ./ => ./
file_uploads => On => On
gpc_order => GPC => GPC
highlight.bg => #FFFFFF => #FFFFFF
highlight.comment => #FF8000 => #FF8000
highlight.default => #0000BB => #0000BB
highlight.html => #000000 => #000000
highlight.keyword => #007700 => #007700
highlight.string => #DD0000 => #DD0000
html_errors => Off => On
ignore_repeated_errors => Off => Off
ignore_repeated_source => Off => Off
ignore_user_abort => Off => Off
implicit_flush => On => Off
include_path => .;c:\php4\pear => .;c:\php4\pear
log_errors => Off => Off
log_errors_max_len => 1024 => 1024
magic_quotes_gpc => On => On
magic_quotes_runtime => Off => Off
magic_quotes_sybase => Off => Off
max_execution_time => 0 => 30
max_input_time => 60 => 60
open_basedir => no value => no value
output_buffering => no value => no value
output_handler => no value => no value
post_max_size => 8M => 8M
precision => 12 => 12
register_argc_argv => On => On
register_globals => Off => Off
report_memleaks => On => On
safe_mode => Off => Off
safe_mode_exec_dir => no value => no value
safe_mode_gid => Off => Off
safe_mode_include_dir => no value => no value
sendmail_from => k.schroeder@php.net => k.schroeder@php.net
sendmail_path => no value => no value
short_open_tag => On => On
SMTP => 192.168.1.1 => 192.168.1.1
smtp_port => 25 => 25
sql.safe_mode => Off => Off
track_errors => Off => Off
unserialize_callback_func => no value => no value
upload_max_filesize => 2M => 2M
upload_tmp_dir => no value => no value
user_dir => no value => no value
variables_order => EGPCS => EGPCS
xmlrpc_error_number => 0 => 0
xmlrpc_errors => Off => Off
y2k_compliance => On => On
bcmath
BCMath support => enabled
calendar
Calendar support => enabled
com
Directive => Local Value => Master Value
com.allow_dcom => Off => Off
com.autoregister_casesensitive => On => On
com.autoregister_typelib => Off => Off
com.autoregister_verbose => Off => Off
com.typelib_file => no value => no value
ctype
ctype functions => enabled
ftp
FTP support => enabled
mysql
MySQL Support => enabled
Active Persistent Links => 0
Active Links => 0
Client API version => 3.23.49
Directive => Local Value => Master Value
mysql.allow_persistent => On => On
mysql.connect_timeout => -1 => -1
mysql.default_host => no value => no value
mysql.default_password => no value => no value
mysql.default_port => no value => no value
mysql.default_socket => no value => no value
mysql.default_user => no value => no value
mysql.max_links => Unlimited => Unlimited
mysql.max_persistent => Unlimited => Unlimited
mysql.trace_mode => Off => Off
odbc
ODBC Support => enabled
Active Persistent Links => 0
Active Links => 0
ODBC library => Win32
Directive => Local Value => Master Value
odbc.allow_persistent => On => On
odbc.check_persistent => On => On
odbc.default_db => no value => no value
odbc.default_pw => <i>no value</i> => <i>no value</i>
odbc.default_user => no value => no value
odbc.defaultbinmode => return as is => return as is
odbc.defaultlrl => return up to 4096 bytes => return up to 4096 bytes
odbc.max_links => Unlimited => Unlimited
odbc.max_persistent => Unlimited => Unlimited
overload
User-Space Object Overloading Support => enabled
pcre
PCRE (Perl Compatible Regular Expressions) Support => enabled
PCRE Library Version => 3.92 11-Sep-2002
session
Session Support => enabled
Registered save handlers => files user
Directive => Local Value => Master Value
session.auto_start => Off => Off
session.bug_compat_42 => On => On
session.bug_compat_warn => On => On
session.cache_expire => 180 => 180
session.cache_limiter => nocache => nocache
session.cookie_domain => no value => no value
session.cookie_lifetime => 0 => 0
session.cookie_path => / => /
session.cookie_secure => Off => Off
session.entropy_file => no value => no value
session.entropy_length => 0 => 0
session.gc_dividend => 100 => 100
session.gc_maxlifetime => 1440 => 1440
session.gc_probability => 1 => 1
session.name => PHPSESSID => PHPSESSID
session.referer_check => no value => no value
session.save_handler => files => files
session.save_path => D:\work => D:\work
session.serialize_handler => php => php
session.use_cookies => On => On
session.use_only_cookies => Off => Off
session.use_trans_sid => Off => Off
standard
Regex Library => Bundled library enabled
Dynamic Library Support => enabled
Internal Sendmail Support for Windows => enabled
Directive => Local Value => Master Value
assert.active => 1 => 1
assert.bail => 0 => 0
assert.callback => no value => no value
assert.quiet_eval => 0 => 0
assert.warning => 1 => 1
auto_detect_line_endings => 0 => 0
default_socket_timeout => 60 => 60
safe_mode_allowed_env_vars => PHP_ => PHP_
safe_mode_protected_env_vars => LD_LIBRARY_PATH => LD_LIBRARY_PATH
url_rewriter.tags => a=href,area=href,frame=src,input=src,form=,fieldset= =>
a=href,area=href,frame=src,input=src,form=,fieldset=
user_agent => no value => no value
tokenizer
Tokenizer Support => enabled
wddx
WDDX Support => enabled
xml
XML Support => active
XML Namespace Support => active
EXPAT Version => 1.95.2
zlib
ZLib Support => enabled
Compiled Version => 1.1.4
Linked Version => 1.1.4
Directive => Local Value => Master Value
zlib.output_compression => Off => Off
zlib.output_compression_level => -1 => -1
zlib.output_handler => no value => no value
Additional Modules
Module Name
Environment
Variable => Value
ALLUSERSPROFILE => C:\Dokumente und Einstellungen\All Users
APPDATA => C:\Dokumente und Einstellungen\Administrator\Anwendungsdaten
BUILDTOOLS => d:\work\build
CHECKOUT => -r PHP_4_3 php4
CLASSPATH => D:\FrontBase\Java\frontbasejdbc.jar;D:\FrontBase\Java\FrontBasePlugIn.jar
CommonProgramFiles => C:\Programme\Gemeinsame Dateien
COMPUTERNAME => TANIS
ComSpec => C:\WINNT\system32\cmd.exe
FB_HOME_DIR => D:\FrontBase
FB_HOME_DRIVE => D:
FSUFFIX => 2003-09-02_13-37
HOMEDRIVE => C:
HOMEPATH => \
INCLUDE =>
D:\dev\CVS\pear\PECL\threads;d:\work\build\PECL\include;d:\work\build\PECL\include\threads;d:\work\php4;d:\work\php4\main;d:\work\php4\TSRM;d:\work\php4\win32;d:\work\php4\Zend;D:\Programme\Microsoft.NET\FrameworkSDK\include\;C:\Programme\Microsoft
Visual Studio .NET\Vc7\include\;D:\Programme\Microsoft Visual
Studio\VC98\atl\include;D:\Programme\Microsoft Visual Studio\VC98\mfc\include;D:\Programme\Microsoft
Visual Studio\VC98\include
INCLUE => D:\Programme\Microsoft.NET\FrameworkSDK\include\;C:\Programme\Microsoft Visual Studio
.NET\Vc7\include\;D:\Programme\Microsoft Visual Studio\VC98\atl\include;D:\Programme\Microsoft
Visual Studio\VC98\mfc\include;D:\Programme\Microsoft Visual Studio\VC98\include
LIB => C:\Programme\Microsoft Visual Studio
.NET\Vc7\lib\;D:\Programme\Microsoft.NET\FrameworkSDK\Lib\;D:\Programme\Microsoft Visual
Studio\VC98\mfc\lib;D:\Programme\Microsoft Visual Studio\VC98\lib
LOGONSERVER => \\TANIS
MSDevDir => D:\Programme\Microsoft Visual Studio\Common\MSDev98
NUMBER_OF_PROCESSORS => 2
ORIG_INCLUDE => D:\Programme\Microsoft.NET\FrameworkSDK\include\;C:\Programme\Microsoft Visual
Studio .NET\Vc7\include\;D:\Programme\Microsoft Visual
Studio\VC98\atl\include;D:\Programme\Microsoft Visual Studio\VC98\mfc\include;D:\Programme\Microsoft
Visual Studio\VC98\include
ORIG_LIB => C:\Programme\Microsoft Visual Studio
.NET\Vc7\lib\;D:\Programme\Microsoft.NET\FrameworkSDK\Lib\;D:\Programme\Microsoft Visual
Studio\VC98\mfc\lib;D:\Programme\Microsoft Visual Studio\VC98\lib
ORIG_PATH => D:\Programme\Microsoft.NET\FrameworkSDK\Bin\;C:\Programme\Microsoft Visual Studio
.NET\Common7\IDE\;C:\WINNT\Microsoft.NET\Framework\v1.0.3705\;C:\Programme\Microsoft Visual Studio
.NET\Vc7\bin\;C:\WINNT\system32;C:\WINNT;C:\WINNT\System32\Wbem;D:\PROGRA~1\ULTRAE~1;D:\Programme\Microsoft
Visual Studio\Common\Tools\WinNT;D:\Programme\Microsoft Visual
Studio\Common\MSDev98\Bin;D:\Programme\Microsoft Visual Studio\Common\Tools;D:\Programme\Microsoft
Visual Studio\VC98\bin;D:\Programme\CVS for NT
OS => Windows_NT
Os2LibPath => C:\WINNT\system32\os2\dll;
OUT_DIR => d:\work\release\2003-09-02_13-37
Path => D:\Programme\Microsoft.NET\FrameworkSDK\Bin\;C:\Programme\Microsoft Visual Studio
.NET\Common7\IDE\;C:\WINNT\Microsoft.NET\Framework\v1.0.3705\;C:\Programme\Microsoft Visual Studio
.NET\Vc7\bin\;C:\WINNT\system32;C:\WINNT;C:\WINNT\System32\Wbem;D:\PROGRA~1\ULTRAE~1;D:\Programme\Microsoft
Visual Studio\Common\Tools\WinNT;D:\Programme\Microsoft Visual
Studio\Common\MSDev98\Bin;D:\Programme\Microsoft Visual Studio\Common\Tools;D:\Programme\Microsoft
Visual Studio\VC98\bin;D:\Programme\CVS for
NT;d:\work\release\2003-09-02_13-37;d:\work\release\2003-09-02_13-37\dlls;d:\work\release\2003-09-02_13-37\extensions
PATHEXT => .COM;.EXE;.BAT;.CMD;.VBS;.VBE;.JS;.JSE;.WSF;.WSH
PATH_TRANSLATED => D:\work\php4\tests\strings\004.php
PEAR_DIR => D:\dev\CVS\pear
PROCESSOR_ARCHITECTURE => x86
PROCESSOR_IDENTIFIER => x86 Family 6 Model 8 Stepping 3, GenuineIntel
PROCESSOR_LEVEL => 6
PROCESSOR_REVISION => 0803
ProgramFiles => C:\Programme
PROMPT => $P$G
REDIRECT_STATUS => 1
RELEASE_DIR => d:\work\release
REQUEST_METHOD => GET
SCRIPT_FILENAME => D:\work\php4\tests\strings\004.php
SRC_DIR => d:\work\php4
SystemDrive => C:
SystemRoot => C:\WINNT
TEMP => C:\DOKUME~1\ADMINI~1\LOKALE~1\Temp
TEST_PHP_EXECUTABLE => d:\work\release\2003-09-02_13-37\cli\php.exe
THEDATE => 09.02.2003
THETIME => 13:37
TMP => C:\DOKUME~1\ADMINI~1\LOKALE~1\Temp
USERDNSDOMAIN => KASIS.kai-schroeder.net
USERDOMAIN => KASIS
USERNAME => Administrator
USERPROFILE => C:\Dokumente und Einstellungen\Administrator
windir => C:\WINNT
WORK_DIR => d:\work
PHP Variables
Variable => Value
_SERVER["ALLUSERSPROFILE"] => C:\\Dokumente und Einstellungen\\All Users
_SERVER["APPDATA"] => C:\\Dokumente und Einstellungen\\Administrator\\Anwendungsdaten
_SERVER["BUILDTOOLS"] => d:\\work\\build
_SERVER["CHECKOUT"] => -r PHP_4_3 php4
_SERVER["CLASSPATH"] =>
D:\\FrontBase\\Java\\frontbasejdbc.jar;D:\\FrontBase\\Java\\FrontBasePlugIn.jar
_SERVER["CommonProgramFiles"] => C:\\Programme\\Gemeinsame Dateien
_SERVER["COMPUTERNAME"] => TANIS
_SERVER["ComSpec"] => C:\\WINNT\\system32\\cmd.exe
_SERVER["FB_HOME_DIR"] => D:\\FrontBase
_SERVER["FB_HOME_DRIVE"] => D:
_SERVER["FSUFFIX"] => 2003-09-02_13-37
_SERVER["HOMEDRIVE"] => C:
_SERVER["HOMEPATH"] => \\
_SERVER["INCLUDE"] =>
D:\\dev\\CVS\\pear\\PECL\\threads;d:\\work\\build\\PECL\\include;d:\\work\\build\\PECL\\include\\threads;d:\\work\\php4;d:\\work\\php4\\main;d:\\work\\php4\\TSRM;d:\\work\\php4\\win32;d:\\work\\php4\\Zend;D:\\Programme\\Microsoft.NET\\FrameworkSDK\\include\\;C:\\Programme\\Microsoft
Visual Studio .NET\\Vc7\\include\\;D:\\Programme\\Microsoft Visual
Studio\\VC98\\atl\\include;D:\\Programme\\Microsoft Visual
Studio\\VC98\\mfc\\include;D:\\Programme\\Microsoft Visual Studio\\VC98\\include
_SERVER["INCLUE"] =>
D:\\Programme\\Microsoft.NET\\FrameworkSDK\\include\\;C:\\Programme\\Microsoft Visual Studio
.NET\\Vc7\\include\\;D:\\Programme\\Microsoft Visual
Studio\\VC98\\atl\\include;D:\\Programme\\Microsoft Visual
Studio\\VC98\\mfc\\include;D:\\Programme\\Microsoft Visual Studio\\VC98\\include
_SERVER["LIB"] => C:\\Programme\\Microsoft Visual Studio
.NET\\Vc7\\lib\\;D:\\Programme\\Microsoft.NET\\FrameworkSDK\\Lib\\;D:\\Programme\\Microsoft Visual
Studio\\VC98\\mfc\\lib;D:\\Programme\\Microsoft Visual Studio\\VC98\\lib
_SERVER["LOGONSERVER"] => \\\\TANIS
_SERVER["MSDevDir"] => D:\\Programme\\Microsoft Visual Studio\\Common\\MSDev98
_SERVER["NUMBER_OF_PROCESSORS"] => 2
_SERVER["ORIG_INCLUDE"] =>
D:\\Programme\\Microsoft.NET\\FrameworkSDK\\include\\;C:\\Programme\\Microsoft Visual Studio
.NET\\Vc7\\include\\;D:\\Programme\\Microsoft Visual
Studio\\VC98\\atl\\include;D:\\Programme\\Microsoft Visual
Studio\\VC98\\mfc\\include;D:\\Programme\\Microsoft Visual Studio\\VC98\\include
_SERVER["ORIG_LIB"] => C:\\Programme\\Microsoft Visual Studio
.NET\\Vc7\\lib\\;D:\\Programme\\Microsoft.NET\\FrameworkSDK\\Lib\\;D:\\Programme\\Microsoft Visual
Studio\\VC98\\mfc\\lib;D:\\Programme\\Microsoft Visual Studio\\VC98\\lib
_SERVER["ORIG_PATH"] =>
D:\\Programme\\Microsoft.NET\\FrameworkSDK\\Bin\\;C:\\Programme\\Microsoft Visual Studio
.NET\\Common7\\IDE\\;C:\\WINNT\\Microsoft.NET\\Framework\\v1.0.3705\\;C:\\Programme\\Microsoft
Visual Studio
.NET\\Vc7\\bin\\;C:\\WINNT\\system32;C:\\WINNT;C:\\WINNT\\System32\\Wbem;D:\\PROGRA~1\\ULTRAE~1;D:\\Programme\\Microsoft
Visual Studio\\Common\\Tools\\WinNT;D:\\Programme\\Microsoft Visual
Studio\\Common\\MSDev98\\Bin;D:\\Programme\\Microsoft Visual
Studio\\Common\\Tools;D:\\Programme\\Microsoft Visual Studio\\VC98\\bin;D:\\Programme\\CVS for NT
_SERVER["OS"] => Windows_NT
_SERVER["Os2LibPath"] => C:\\WINNT\\system32\\os2\\dll;
_SERVER["OUT_DIR"] => d:\\work\\release\\2003-09-02_13-37
_SERVER["Path"] =>
D:\\Programme\\Microsoft.NET\\FrameworkSDK\\Bin\\;C:\\Programme\\Microsoft Visual Studio
.NET\\Common7\\IDE\\;C:\\WINNT\\Microsoft.NET\\Framework\\v1.0.3705\\;C:\\Programme\\Microsoft
Visual Studio
.NET\\Vc7\\bin\\;C:\\WINNT\\system32;C:\\WINNT;C:\\WINNT\\System32\\Wbem;D:\\PROGRA~1\\ULTRAE~1;D:\\Programme\\Microsoft
Visual Studio\\Common\\Tools\\WinNT;D:\\Programme\\Microsoft Visual
Studio\\Common\\MSDev98\\Bin;D:\\Programme\\Microsoft Visual
Studio\\Common\\Tools;D:\\Programme\\Microsoft Visual Studio\\VC98\\bin;D:\\Programme\\CVS for
NT;d:\\work\\release\\2003-09-02_13-37;d:\\work\\release\\2003-09-02_13-37\\dlls;d:\\work\\release\\2003-09-02_13-37\\extensions
_SERVER["PATHEXT"] => .COM;.EXE;.BAT;.CMD;.VBS;.VBE;.JS;.JSE;.WSF;.WSH
_SERVER["PATH_TRANSLATED"] =>
_SERVER["PEAR_DIR"] => D:\\dev\\CVS\\pear
_SERVER["PROCESSOR_ARCHITECTURE"] => x86
_SERVER["PROCESSOR_IDENTIFIER"] => x86 Family 6 Model 8 Stepping 3, GenuineIntel
_SERVER["PROCESSOR_LEVEL"] => 6
_SERVER["PROCESSOR_REVISION"] => 0803
_SERVER["ProgramFiles"] => C:\\Programme
_SERVER["PROMPT"] => $P$G
_SERVER["REDIRECT_STATUS"] => 1
_SERVER["RELEASE_DIR"] => d:\\work\\release
_SERVER["REQUEST_METHOD"] => GET
_SERVER["SCRIPT_FILENAME"] =>
_SERVER["SRC_DIR"] => d:\\work\\php4
_SERVER["SystemDrive"] => C:
_SERVER["SystemRoot"] => C:\\WINNT
_SERVER["TEMP"] => C:\\DOKUME~1\\ADMINI~1\\LOKALE~1\\Temp
_SERVER["TEST_PHP_EXECUTABLE"] => d:\\work\\release\\2003-09-02_13-37\\cli\\php.exe
_SERVER["THEDATE"] => 09.02.2003
_SERVER["THETIME"] => 13:37
_SERVER["TMP"] => C:\\DOKUME~1\\ADMINI~1\\LOKALE~1\\Temp
_SERVER["USERDNSDOMAIN"] => KASIS.kai-schroeder.net
_SERVER["USERDOMAIN"] => KASIS
_SERVER["USERNAME"] => Administrator
_SERVER["USERPROFILE"] => C:\\Dokumente und Einstellungen\\Administrator
_SERVER["windir"] => C:\\WINNT
_SERVER["WORK_DIR"] => d:\\work
_SERVER["PHP_SELF"] =>
_SERVER["SCRIPT_NAME"] =>
_SERVER["DOCUMENT_ROOT"] =>
_SERVER["argv"] => Array
(
)
_SERVER["argc"] => 0
_ENV["ALLUSERSPROFILE"] => C:\\Dokumente und Einstellungen\\All Users
_ENV["APPDATA"] => C:\\Dokumente und Einstellungen\\Administrator\\Anwendungsdaten
_ENV["BUILDTOOLS"] => d:\\work\\build
_ENV["CHECKOUT"] => -r PHP_4_3 php4
_ENV["CLASSPATH"] =>
D:\\FrontBase\\Java\\frontbasejdbc.jar;D:\\FrontBase\\Java\\FrontBasePlugIn.jar
_ENV["CommonProgramFiles"] => C:\\Programme\\Gemeinsame Dateien
_ENV["COMPUTERNAME"] => TANIS
_ENV["ComSpec"] => C:\\WINNT\\system32\\cmd.exe
_ENV["FB_HOME_DIR"] => D:\\FrontBase
_ENV["FB_HOME_DRIVE"] => D:
_ENV["FSUFFIX"] => 2003-09-02_13-37
_ENV["HOMEDRIVE"] => C:
_ENV["HOMEPATH"] => \\
_ENV["INCLUDE"] =>
D:\\dev\\CVS\\pear\\PECL\\threads;d:\\work\\build\\PECL\\include;d:\\work\\build\\PECL\\include\\threads;d:\\work\\php4;d:\\work\\php4\\main;d:\\work\\php4\\TSRM;d:\\work\\php4\\win32;d:\\work\\php4\\Zend;D:\\Programme\\Microsoft.NET\\FrameworkSDK\\include\\;C:\\Programme\\Microsoft
Visual Studio .NET\\Vc7\\include\\;D:\\Programme\\Microsoft Visual
Studio\\VC98\\atl\\include;D:\\Programme\\Microsoft Visual
Studio\\VC98\\mfc\\include;D:\\Programme\\Microsoft Visual Studio\\VC98\\include
_ENV["INCLUE"] =>
D:\\Programme\\Microsoft.NET\\FrameworkSDK\\include\\;C:\\Programme\\Microsoft Visual Studio
.NET\\Vc7\\include\\;D:\\Programme\\Microsoft Visual
Studio\\VC98\\atl\\include;D:\\Programme\\Microsoft Visual
Studio\\VC98\\mfc\\include;D:\\Programme\\Microsoft Visual Studio\\VC98\\include
_ENV["LIB"] => C:\\Programme\\Microsoft Visual Studio
.NET\\Vc7\\lib\\;D:\\Programme\\Microsoft.NET\\FrameworkSDK\\Lib\\;D:\\Programme\\Microsoft Visual
Studio\\VC98\\mfc\\lib;D:\\Programme\\Microsoft Visual Studio\\VC98\\lib
_ENV["LOGONSERVER"] => \\\\TANIS
_ENV["MSDevDir"] => D:\\Programme\\Microsoft Visual Studio\\Common\\MSDev98
_ENV["NUMBER_OF_PROCESSORS"] => 2
_ENV["ORIG_INCLUDE"] =>
D:\\Programme\\Microsoft.NET\\FrameworkSDK\\include\\;C:\\Programme\\Microsoft Visual Studio
.NET\\Vc7\\include\\;D:\\Programme\\Microsoft Visual
Studio\\VC98\\atl\\include;D:\\Programme\\Microsoft Visual
Studio\\VC98\\mfc\\include;D:\\Programme\\Microsoft Visual Studio\\VC98\\include
_ENV["ORIG_LIB"] => C:\\Programme\\Microsoft Visual Studio
.NET\\Vc7\\lib\\;D:\\Programme\\Microsoft.NET\\FrameworkSDK\\Lib\\;D:\\Programme\\Microsoft Visual
Studio\\VC98\\mfc\\lib;D:\\Programme\\Microsoft Visual Studio\\VC98\\lib
_ENV["ORIG_PATH"] =>
D:\\Programme\\Microsoft.NET\\FrameworkSDK\\Bin\\;C:\\Programme\\Microsoft Visual Studio
.NET\\Common7\\IDE\\;C:\\WINNT\\Microsoft.NET\\Framework\\v1.0.3705\\;C:\\Programme\\Microsoft
Visual Studio
.NET\\Vc7\\bin\\;C:\\WINNT\\system32;C:\\WINNT;C:\\WINNT\\System32\\Wbem;D:\\PROGRA~1\\ULTRAE~1;D:\\Programme\\Microsoft
Visual Studio\\Common\\Tools\\WinNT;D:\\Programme\\Microsoft Visual
Studio\\Common\\MSDev98\\Bin;D:\\Programme\\Microsoft Visual
Studio\\Common\\Tools;D:\\Programme\\Microsoft Visual Studio\\VC98\\bin;D:\\Programme\\CVS for NT
_ENV["OS"] => Windows_NT
_ENV["Os2LibPath"] => C:\\WINNT\\system32\\os2\\dll;
_ENV["OUT_DIR"] => d:\\work\\release\\2003-09-02_13-37
_ENV["Path"] =>
D:\\Programme\\Microsoft.NET\\FrameworkSDK\\Bin\\;C:\\Programme\\Microsoft Visual Studio
.NET\\Common7\\IDE\\;C:\\WINNT\\Microsoft.NET\\Framework\\v1.0.3705\\;C:\\Programme\\Microsoft
Visual Studio
.NET\\Vc7\\bin\\;C:\\WINNT\\system32;C:\\WINNT;C:\\WINNT\\System32\\Wbem;D:\\PROGRA~1\\ULTRAE~1;D:\\Programme\\Microsoft
Visual Studio\\Common\\Tools\\WinNT;D:\\Programme\\Microsoft Visual
Studio\\Common\\MSDev98\\Bin;D:\\Programme\\Microsoft Visual
Studio\\Common\\Tools;D:\\Programme\\Microsoft Visual Studio\\VC98\\bin;D:\\Programme\\CVS for
NT;d:\\work\\release\\2003-09-02_13-37;d:\\work\\release\\2003-09-02_13-37\\dlls;d:\\work\\release\\2003-09-02_13-37\\extensions
_ENV["PATHEXT"] => .COM;.EXE;.BAT;.CMD;.VBS;.VBE;.JS;.JSE;.WSF;.WSH
_ENV["PATH_TRANSLATED"] => D:\\work\\php4\\tests\\strings\\004.php
_ENV["PEAR_DIR"] => D:\\dev\\CVS\\pear
_ENV["PROCESSOR_ARCHITECTURE"] => x86
_ENV["PROCESSOR_IDENTIFIER"] => x86 Family 6 Model 8 Stepping 3, GenuineIntel
_ENV["PROCESSOR_LEVEL"] => 6
_ENV["PROCESSOR_REVISION"] => 0803
_ENV["ProgramFiles"] => C:\\Programme
_ENV["PROMPT"] => $P$G
_ENV["REDIRECT_STATUS"] => 1
_ENV["RELEASE_DIR"] => d:\\work\\release
_ENV["REQUEST_METHOD"] => GET
_ENV["SCRIPT_FILENAME"] => D:\\work\\php4\\tests\\strings\\004.php
_ENV["SRC_DIR"] => d:\\work\\php4
_ENV["SystemDrive"] => C:
_ENV["SystemRoot"] => C:\\WINNT
_ENV["TEMP"] => C:\\DOKUME~1\\ADMINI~1\\LOKALE~1\\Temp
_ENV["TEST_PHP_EXECUTABLE"] => d:\\work\\release\\2003-09-02_13-37\\cli\\php.exe
_ENV["THEDATE"] => 09.02.2003
_ENV["THETIME"] => 13:37
_ENV["TMP"] => C:\\DOKUME~1\\ADMINI~1\\LOKALE~1\\Temp
_ENV["USERDNSDOMAIN"] => KASIS.kai-schroeder.net
_ENV["USERDOMAIN"] => KASIS
_ENV["USERNAME"] => Administrator
_ENV["USERPROFILE"] => C:\\Dokumente und Einstellungen\\Administrator
_ENV["windir"] => C:\\WINNT
_ENV["WORK_DIR"] => d:\\work
PHP License
This program is free software; you can redistribute it and/or modify
it under the terms of the PHP License as published by the PHP Group
and included in the distribution in the file: LICENSE
This program is distributed in the hope that it will be useful,
but WITHOUT ANY WARRANTY; without even the implied warranty of
MERCHANTABILITY or FITNESS FOR A PARTICULAR PURPOSE.
If you did not receive a copy of the PHP license, or have any
questions about PHP licensing, please contact license@php.net.