Test results [failed]

From: Date: Sun, 09 Feb 2003 20:19:06 +0000
Subject: Test results [failed]
Groups: php.qa 
Request: Send a blank email to php-qa+get-8904@lists.php.net to get a copy of this message
===================================================================== FAILED TEST SUMMARY --------------------------------------------------------------------- Bug #20175 (Static vars can't store ref to new instance) [tests/lang/bug20175.phpt] Bug #21094 (set_error_handler not accepting methods) [tests/lang/bug21094.phpt] Bug #21600 (assign by reference function call changes variable contents) [tests/lang/bug21600.phpt] Bug #21800 (Segfault under interactive mode) [tests/lang/bug21800.phpt] Bug #21849 (self::constant doesn't work as method's default parameter) [tests/lang/bug21849.phpt] Bug #21961 (get_parent_class() segfault) [tests/lang/bug21961.phpt] session object deserialization [ext/session/tests/003.phpt] session_set_save_handler test [ext/session/tests/004.phpt] custom save handler, multiple session_start()s, complex data structure test. [ext/session/tests/005.phpt] aggregating everything [ext/standard/tests/aggregation/aggregate.phpt] aggregating all methods [ext/standard/tests/aggregation/aggregate_methods.phpt] aggregating methods specified in the list [ext/standard/tests/aggregation/aggregate_methods_by_list.phpt] aggregating methods matching regular expression [ext/standard/tests/aggregation/aggregate_methods_by_regexp.phpt] ===================================================================== ===================================================================== TEST RESULT SUMMARY --------------------------------------------------------------------- Exts skipped : 72 Exts tested : 13 --------------------------------------------------------------------- Number of tests : 511 Tests skipped : 232 (45.4%) Tests failed : 13 ( 2.5%) Tests passed : 266 (52.1%) --------------------------------------------------------------------- Time taken : 68 seconds ===================================================================== ================================================================================ /home/httpd/html/PHP/php5/tests/lang/bug20175.phpt ================================================================================ ---- EXPECTED OUTPUT %s foo_static() foo_global() foo:1 foo_static() foo:1 bar_static() bar_global() bar:1 bar_static() bar_global() bar:2 wow_static() wow_global() wow:1 wow_static() wow:1 oop_test() oop_static() oop_class() oop:1 oop_static() oop:1 oop_test() oop_static() oop:1 ---- ACTUAL OUTPUT ---- FAILED ================================================================================ 001- %s 001+ 002- foo_static() 003- foo_global() 004- foo:1 005- foo_static() 006- foo:1 007- bar_static() 008- bar_global() 009- bar:1 010- bar_static() 011- bar_global() 012- bar:2 013- wow_static() 014- wow_global() 015- wow:1 016- wow_static() 017- wow:1 018- oop_test() 019- oop_static() 020- oop_class() 021- oop:1 022- oop_static() 023- oop:1 024- oop_test() 025- oop_static() 026- oop:1 ================================================================================ ================================================================================ /home/httpd/html/PHP/php5/tests/lang/bug21094.phpt ================================================================================ ---- EXPECTED OUTPUT [1024] errstr: test, errfile: %s, errline: %d ---- ACTUAL OUTPUT Notice: Array to string conversion in /home/httpd/html/PHP/php5/tests/lang/bug21094.php on line 8 Notice: test in /home/httpd/html/PHP/php5/tests/lang/bug21094.php on line 10 ---- FAILED ================================================================================ 001- [1024] errstr: test, errfile: %s, errline: %d 001+ Notice: Array to string conversion in /home/httpd/html/PHP/php5/tests/lang/bug21094.php on line 8 002+ 003+ Notice: test in /home/httpd/html/PHP/php5/tests/lang/bug21094.php on line 10 ================================================================================ ================================================================================ /home/httpd/html/PHP/php5/tests/lang/bug21600.phpt ================================================================================ ---- EXPECTED OUTPUT array(1) { ["foo"]=> string(4) "test" } array(1) { ["foo"]=> string(4) "test" } ---- ACTUAL OUTPUT array(1) { ["foo"]=> &string(4) "test" } array(1) { ["foo"]=> string(4) "test" } ---- FAILED ================================================================================ 003- string(4) "test" 003+ &string(4) "test" ================================================================================ ================================================================================ /home/httpd/html/PHP/php5/tests/lang/bug21800.phpt ================================================================================ ---- EXPECTED OUTPUT Interactive mode enabled :test: ---- ACTUAL OUTPUT ---- FAILED ================================================================================ 001- Interactive mode enabled 001+ 002- 003- :test: ================================================================================ ================================================================================ /home/httpd/html/PHP/php5/tests/lang/bug21849.phpt ================================================================================ ---- EXPECTED OUTPUT fubar ---- ACTUAL OUTPUT Fatal error: Undefined class 'self' in /home/httpd/html/PHP/php5/tests/lang/bug21849.php on line 5 ---- FAILED ================================================================================ 001- fubar 001+ Fatal error: Undefined class 'self' in /home/httpd/html/PHP/php5/tests/lang/bug21849.php on line 5 ================================================================================ ================================================================================ /home/httpd/html/PHP/php5/tests/lang/bug21961.phpt ================================================================================ ---- EXPECTED OUTPUT string(14) "The old Tavern" ---- ACTUAL OUTPUT ---- FAILED ================================================================================ 001- string(14) "The old Tavern" 001+ ================================================================================ ================================================================================ /home/httpd/html/PHP/php5/ext/session/tests/003.phpt ================================================================================ ---- EXPECTED OUTPUT object(foo)(2) { ["bar"]=> string(2) "ok" ["yes"]=> int(2) } array(1) { [3]=> &object(foo)(2) { ["bar"]=> string(2) "ok" ["yes"]=> int(2) } } ---- ACTUAL OUTPUT object(foo)(2) { ["bar"]=> string(2) "ok" ["yes"]=> int(2) } array(1) { [3]=> object(foo)(2) { ["bar"]=> string(2) "ok" ["yes"]=> int(2) } } ---- FAILED ================================================================================ 009- &object(foo)(2) { 009+ object(foo)(2) { ================================================================================ ================================================================================ /home/httpd/html/PHP/php5/ext/session/tests/004.phpt ================================================================================ ---- EXPECTED OUTPUT OPEN: PHPSESSID READ: abtest object(foo)(2) { ["bar"]=> string(2) "ok" ["yes"]=> int(2) } array(1) { [3]=> &object(foo)(2) { ["bar"]=> string(2) "ok" ["yes"]=> int(2) } } WRITE: abtest, baz|O:3:"foo":2:{s:3:"bar";s:2:"ok";s:3:"yes";i:2;}arr|a:1:{i:3;O:3:"foo":2:{s:3:"bar";s:2:"ok";s:3:"yes";i:2;}} OPEN: PHPSESSID READ: abtest object(foo)(2) { ["bar"]=> string(2) "ok" ["yes"]=> int(2) } array(1) { [3]=> object(foo)(2) { ["bar"]=> string(2) "ok" ["yes"]=> int(2) } } DESTROY: abtest ---- ACTUAL OUTPUT OPEN: PHPSESSID READ: abtest object(foo)(2) { ["bar"]=> string(2) "ok" ["yes"]=> int(2) } array(1) { [3]=> object(foo)(2) { ["bar"]=> string(2) "ok" ["yes"]=> int(2) } } WRITE: abtest, baz|O:3:"foo":2:{s:3:"bar";s:2:"ok";s:3:"yes";i:2;}arr|a:1:{i:3;O:3:"foo":2:{s:3:"bar";s:2:"ok";s:3:"yes";i:2;}} OPEN: PHPSESSID READ: abtest object(foo)(2) { ["bar"]=> string(2) "ok" ["yes"]=> int(2) } array(1) { [3]=> object(foo)(2) { ["bar"]=> string(2) "ok" ["yes"]=> int(2) } } DESTROY: abtest ---- FAILED ================================================================================ 011- &object(foo)(2) { 011+ object(foo)(2) { ================================================================================ ================================================================================ /home/httpd/html/PHP/php5/ext/session/tests/005.phpt ================================================================================ ---- EXPECTED OUTPUT OPEN: PHPSESSID READ: abtest object(foo)(2) { ["bar"]=> string(2) "ok" ["yes"]=> int(2) } array(1) { [3]=> &object(foo)(2) { ["bar"]=> string(2) "ok" ["yes"]=> int(2) } } WRITE: abtest, baz|O:3:"foo":2:{s:3:"bar";s:2:"ok";s:3:"yes";i:2;}arr|a:1:{i:3;O:3:"foo":2:{s:3:"bar";s:2:"ok";s:3:"yes";i:2;}} CLOSE OPEN: PHPSESSID READ: abtest object(foo)(2) { ["bar"]=> string(2) "ok" ["yes"]=> int(3) } array(1) { [3]=> &object(foo)(2) { ["bar"]=> string(2) "ok" ["yes"]=> int(3) } } int(123) WRITE: abtest, baz|O:3:"foo":2:{s:3:"bar";s:2:"ok";s:3:"yes";i:3;}arr|a:1:{i:3;O:3:"foo":2:{s:3:"bar";s:2:"ok";s:3:"yes";i:3;}}c|i:123; CLOSE OPEN: PHPSESSID READ: abtest object(foo)(2) { ["bar"]=> string(2) "ok" ["yes"]=> int(3) } array(1) { [3]=> object(foo)(2) { ["bar"]=> string(2) "ok" ["yes"]=> int(3) } } int(123) DESTROY: abtest CLOSE ---- ACTUAL OUTPUT OPEN: PHPSESSID READ: abtest object(foo)(2) { ["bar"]=> string(2) "ok" ["yes"]=> int(2) } array(1) { [3]=> object(foo)(2) { ["bar"]=> string(2) "ok" ["yes"]=> int(2) } } WRITE: abtest, baz|O:3:"foo":2:{s:3:"bar";s:2:"ok";s:3:"yes";i:2;}arr|a:1:{i:3;O:3:"foo":2:{s:3:"bar";s:2:"ok";s:3:"yes";i:2;}} CLOSE OPEN: PHPSESSID READ: abtest object(foo)(2) { ["bar"]=> string(2) "ok" ["yes"]=> int(3) } array(1) { [3]=> object(foo)(2) { ["bar"]=> string(2) "ok" ["yes"]=> int(3) } } int(123) WRITE: abtest, baz|O:3:"foo":2:{s:3:"bar";s:2:"ok";s:3:"yes";i:3;}arr|a:1:{i:3;O:3:"foo":2:{s:3:"bar";s:2:"ok";s:3:"yes";i:3;}}c|i:123; CLOSE OPEN: PHPSESSID READ: abtest object(foo)(2) { ["bar"]=> string(2) "ok" ["yes"]=> int(3) } array(1) { [3]=> object(foo)(2) { ["bar"]=> string(2) "ok" ["yes"]=> int(3) } } int(123) DESTROY: abtest CLOSE ---- FAILED ================================================================================ 011- &object(foo)(2) { 011+ object(foo)(2) { 030- &object(foo)(2) { 030+ object(foo)(2) { ================================================================================ ================================================================================ /home/httpd/html/PHP/php5/ext/standard/tests/aggregation/aggregate.phpt ================================================================================ ---- EXPECTED OUTPUT I'm alive! I'm helping! I'm aggregating! **** ---- ACTUAL OUTPUT I'm alive! Fatal error: Call to undefined method simple::do_this() in /home/httpd/html/PHP/php5/ext/standard/tests/aggregation/aggregate.php on line 7 ---- FAILED ================================================================================ 002- I'm helping! 002+ 003- I'm aggregating! 003+ Fatal error: Call to undefined method simple::do_this() in /home/httpd/html/PHP/php5/ext/standard/tests/aggregation/aggregate.php on line 7 004- **** ================================================================================ ================================================================================ /home/httpd/html/PHP/php5/ext/standard/tests/aggregation/aggregate_methods.phpt ================================================================================ ---- EXPECTED OUTPUT I'm alive! mixing 100 simple,mix_it simple_prop mixing ---- ACTUAL OUTPUT I'm alive! Fatal error: Call to undefined method simple::mix_it() in /home/httpd/html/PHP/php5/ext/standard/tests/aggregation/aggregate_methods.php on line 6 ---- FAILED ================================================================================ 002- mixing 002+ 003- 100 003+ Fatal error: Call to undefined method simple::mix_it() in /home/httpd/html/PHP/php5/ext/standard/tests/aggregation/aggregate_methods.php on line 6 004- simple,mix_it 005- simple_prop 006- mixing ================================================================================ ================================================================================ /home/httpd/html/PHP/php5/ext/standard/tests/aggregation/aggregate_methods_by_list.phpt ================================================================================ ---- EXPECTED OUTPUT I'm alive! simple,just_another_method I'm alive! simple,do_this,do_that yep, that's me ---- ACTUAL OUTPUT I'm alive! simple I'm alive! simple Fatal error: Call to undefined method simple::just_another_method() in /home/httpd/html/PHP/php5/ext/standard/tests/aggregation/aggregate_methods_by_list.php on line 10 ---- FAILED ================================================================================ 002- simple,just_another_method 002+ simple 004- simple,do_this,do_that 004+ simple 005- yep, that's me 005+ 006+ Fatal error: Call to undefined method simple::just_another_method() in /home/httpd/html/PHP/php5/ext/standard/tests/aggregation/aggregate_methods_by_list.php on line 10 ================================================================================ ================================================================================ /home/httpd/html/PHP/php5/ext/standard/tests/aggregation/aggregate_methods_by_regexp.phpt ================================================================================ ---- EXPECTED OUTPUT I'm alive! simple,do_this,do_that I'm alive! simple,just_another_method ---- ACTUAL OUTPUT I'm alive! simple I'm alive! simple ---- FAILED ================================================================================ 002- simple,do_this,do_that 002+ simple 004- simple,just_another_method 004+ simple ================================================================================ ================================================================================ BUILD ENVIRONMENT ================================================================================ OS: Linux Automake: automake (GNU automake) 1.6.3 Written by Tom Tromey <tromey@redhat.com>. Copyright 2002 Free Software Foundation, Inc. This is free software; see the source for copying conditions. There is NO warranty; not even for MERCHANTABILITY or FITNESS FOR A PARTICULAR PURPOSE. Autoconf: autoconf (GNU Autoconf) 2.53 Written by David J. MacKenzie and Akim Demaille. Copyright 2002 Free Software Foundation, Inc. This is free software; see the source for copying conditions. There is NO warranty; not even for MERCHANTABILITY or FITNESS FOR A PARTICULAR PURPOSE. Libtool: ltmain.sh (GNU libtool) 1.4.2 (1.922.2.53 2001/09/11 03:18:52) Compiler: Reading specs from /usr/lib/gcc-lib/i386-redhat-linux/3.2/specs Configured with: ../configure --prefix=/usr --mandir=/usr/share/man --infodir=/usr/share/info --enable-shared --enable-threads=posix --disable-checking --host=i386-redhat-linux --with-system-zlib --enable-__cxa_atexit Thread model: posix gcc version 3.2 20020903 (Red Hat Linux 8.0 3.2-7) Bison: bison (GNU Bison) 1.35 Copyright 1984, 1986, 1989, 1992, 2000, 2001, 2002 Free Software Foundation, Inc. Questo e' software libero; vedere il sorgente per le condizioni cui e' sottoposta la copia. NON c'è ALCUNA garanzia, neanche di COMMERCIABILITA` o di ADEGUATEZZA AD UN PARTICOLARE SCOPO. User's E-mail: michel at ziobudda dot net ================================================================================ PHPINFO ================================================================================ phpinfo() PHP Version => 5.0.0-dev System => Linux localhost.localdomain 2.4.19-ac4 #2 mar dic 3 12:06:01 CET 2002 i686 Build Date => Feb 8 2003 08:52:24 Configure Command => './configure' '--with-apxs2=/usr/local/httpd-2.0.43/bin/apxs' '--prefix=/usr/local/php5-08022003/' '--with-openssl' '--with-zlib' '--with-bz2' '--with-gd' '--with-mysql' '--with-xmlrpc' '--with-atd' Server API => Command Line Interface Virtual Directory Support => disabled Configuration File (php.ini) Path => /usr/local/php5-08022003//lib PHP API => 20020918 PHP Extension => 20020429 Zend Extension => 90021012 Debug Build => no Thread Safety => disabled Registered PHP Streams => php, http, ftp, https, ftps, compress.bzip2, compress.zlib This program makes use of the Zend Scripting Language Engine: Zend Engine v2.0.0-dev, Copyright (c) 1998-2003 Zend Technologies<br /> _______________________________________________________________________ Configuration PHP Core Directive => Local Value => Master Value allow_call_time_pass_reference => On => On allow_url_fopen => On => On always_populate_raw_post_data => Off => Off arg_separator.input => &amp; => &amp; arg_separator.output => &amp; => &amp; asp_tags => Off => Off auto_append_file => no value => no value auto_prepend_file => no value => no value browscap => no value => no value default_charset => no value => no value default_mimetype => text/html => text/html define_syslog_variables => Off => Off disable_functions => no value => no value display_errors => On => On display_startup_errors => Off => Off doc_root => no value => no value docref_ext => no value => no value docref_root => http://www.php.net/ => http://www.php.net/ enable_dl => On => On error_append_string => no value => no value error_log => no value => no value error_prepend_string => no value => no value error_reporting => no value => no value expose_php => On => On extension_dir => /usr/local/php5-08022003//lib/php/extensions/no-debug-non-zts-20020429 => /usr/local/php5-08022003//lib/php/extensions/no-debug-non-zts-20020429 file_uploads => On => On gpc_order => GPC => GPC highlight.bg => #FFFFFF => #FFFFFF highlight.comment => #FF8000 => #FF8000 highlight.default => #0000BB => #0000BB highlight.html => #000000 => #000000 highlight.keyword => #007700 => #007700 highlight.string => #DD0000 => #DD0000 html_errors => Off => On ignore_repeated_errors => Off => Off ignore_repeated_source => Off => Off ignore_user_abort => Off => Off implicit_flush => On => Off include_path => .:/usr/local/php5-08022003//lib/php => .:/usr/local/php5-08022003//lib/php log_errors => Off => Off log_errors_max_len => 1024 => 1024 magic_quotes_gpc => On => On magic_quotes_runtime => Off => Off magic_quotes_sybase => Off => Off max_execution_time => 0 => 30 max_input_time => -1 => -1 open_basedir => no value => no value output_buffering => 0 => 0 output_handler => no value => no value post_max_size => 8M => 8M precision => 14 => 14 register_argc_argv => On => On register_globals => Off => Off report_memleaks => On => On report_zend_debug => On => On safe_mode => Off => Off safe_mode_exec_dir => 1 => 1 safe_mode_gid => Off => Off safe_mode_include_dir => no value => no value sendmail_from => no value => no value sendmail_path => -t -i => -t -i short_open_tag => On => On SMTP => localhost => localhost smtp_port => 25 => 25 sql.safe_mode => Off => Off track_errors => Off => Off unserialize_callback_func => no value => no value upload_max_filesize => 2M => 2M upload_tmp_dir => no value => no value user_dir => no value => no value variables_order => no value => no value xmlrpc_error_number => 0 => 0 xmlrpc_errors => Off => Off y2k_compliance => On => On zend2.implicit_clone => no value => no value bz2 BZip2 Support => Enabled BZip2 Version => 1.0.2, 30-Dec-2001 ctype ctype functions => enabled gd GD Support => enabled GD Version => bundled (2.0 compatible) GIF Read Support => enabled PNG Support => enabled WBMP Support => enabled XBM Support => enabled mysql MySQL Support => enabled Active Persistent Links => 0 Active Links => 0 Client API version => 3.23.49 MYSQL_MODULE_TYPE => builtin MYSQL_SOCKET => /var/lib/mysql/mysql.sock MYSQL_INCLUDE => MYSQL_LIBS => Directive => Local Value => Master Value mysql.allow_persistent => On => On mysql.connect_timeout => -1 => -1 mysql.default_host => no value => no value mysql.default_password => no value => no value mysql.default_port => no value => no value mysql.default_socket => no value => no value mysql.default_user => no value => no value mysql.max_links => Unlimited => Unlimited mysql.max_persistent => Unlimited => Unlimited mysql.trace_mode => Off => Off openssl OpenSSL support => enabled OpenSSL Version => OpenSSL 0.9.6b [engine] 9 Jul 2001 pcre PCRE (Perl Compatible Regular Expressions) Support => enabled PCRE Library Version => 3.92 11-Sep-2002 posix Revision => $Revision: 1.54 $ session Session Support => enabled Registered save handlers => files user Directive => Local Value => Master Value session.auto_start => Off => Off session.bug_compat_42 => On => On session.bug_compat_warn => On => On session.cache_expire => 180 => 180 session.cache_limiter => nocache => nocache session.cookie_domain => no value => no value session.cookie_lifetime => 0 => 0 session.cookie_path => / => / session.cookie_secure => Off => Off session.entropy_file => no value => no value session.entropy_length => 0 => 0 session.gc_dividend => 100 => 100 session.gc_maxlifetime => 1440 => 1440 session.gc_probability => 1 => 1 session.hash_bits_per_character => 4 => 4 session.hash_function => 0 => 0 session.name => PHPSESSID => PHPSESSID session.referer_check => no value => no value session.save_handler => files => files session.save_path => /tmp => /tmp session.serialize_handler => php => php session.use_cookies => On => On session.use_only_cookies => Off => Off session.use_trans_sid => Off => Off standard Regex Library => Bundled library enabled Dynamic Library Support => enabled Directive => Local Value => Master Value assert.active => 1 => 1 assert.bail => 0 => 0 assert.callback => no value => no value assert.quiet_eval => 0 => 0 assert.warning => 1 => 1 auto_detect_line_endings => 0 => 0 default_socket_timeout => 60 => 60 safe_mode_allowed_env_vars => PHP_ => PHP_ safe_mode_protected_env_vars => LD_LIBRARY_PATH => LD_LIBRARY_PATH url_rewriter.tags => a=href,area=href,frame=src,form=,fieldset= => a=href,area=href,frame=src,form=,fieldset= user_agent => no value => no value tokenizer Tokenizer Support => enabled xml XML Support => active XML Namespace Support => active EXPAT Version => 1.95.5 xmlrpc core library version => xmlrpc-epi v. 0.51 php extension version => 0.51 author => Dan Libby homepage => http://xmlrpc-epi.sourceforge.net open sourced by => Epinions.com zlib ZLib Support => enabled Compiled Version => 1.1.4 Linked Version => 1.1.4 Directive => Local Value => Master Value zlib.output_compression => Off => Off zlib.output_compression_level => -1 => -1 zlib.output_handler => no value => no value Additional Modules Module Name Environment Variable => Value KDE_MULTIHEAD => false SSH_AGENT_PID => 1280 HOSTNAME => localhost.localdomain TEST_PHP_SRCDIR => /home/httpd/html/PHP/php5 TERM => xterm SHELL => /bin/sh HISTSIZE => 1000 MAKEFLAGS => SSH_CLIENT => deleted GS_LIB => /home/michel/.kde/share/fonts GTK_RC_FILES => /etc/gtk/gtkrc:/home/michel/.gtkrc:/home/michel/.gtkrc-kde QTDIR => /usr/lib/qt3-gcc3.2 SSH_TTY => deleted USER => michel LS_COLORS => no=00:fi=00:di=00;34:ln=00;36:pi=40;33:so=00;35:bd=40;33;01:cd=40;33;01:or=01;05;37;41:mi=01;05;37;41:ex=00;32:*.cmd=00;32:*.exe=00;32:*.com=00;32:*.btm=00;32:*.bat=00;32:*.sh=00;32:*.csh=00;32:*.tar=00;31:*.tgz=00;31:*.arj=00;31:*.taz=00;31:*.lzh=00;31:*.zip=00;31:*.z=00;31:*.Z=00;31:*.gz=00;31:*.bz2=00;31:*.bz=00;31:*.tz=00;31:*.rpm=00;31:*.cpio=00;31:*.jpg=00;35:*.gif=00;35:*.bmp=00;35:*.xbm=00;35:*.xpm=00;35:*.png=00;35:*.tif=00;35: SCRIPT_FILENAME => SSH_AUTH_SOCK => deleted SESSION_MANAGER => local/localhost.localdomain:/tmp/.ICE-unix/1353 MAKELEVEL => 1 MFLAGS => KONSOLE_DCOP => DCOPRef(konsole-1367,konsole) PATH => /usr/local/hpoj-0.90/sbin:/usr/local/hpoj-0.90/bin:/usr/local/hpoj-0.90/sbin:/usr/local/hpoj-0.90/bin:/usr/local/bin:/usr/bin:/bin:/usr/X11R6/bin:/usr/local/mozilla:/home/michel/bin:/usr/local/mozilla MAIL => /var/spool/mail/michel _ => /home/httpd/html/PHP/php5/sapi/cli/php PWD => /home/httpd/html/PHP/php5 KONSOLE_DCOP_SESSION => DCOPRef(konsole-1367,session-2) INPUTRC => /etc/inputrc XMODIFIERS => @im=none LANG => it_IT.ISO8859-1 TEST_PHP_EXECUTABLE => /home/httpd/html/PHP/php5/sapi/cli/php REDIRECT_STATUS => PATH_TRANSLATED => GDMSESSION => KDE SSH_ASKPASS => /usr/libexec/openssh/gnome-ssh-askpass HOME => /home/michel SHLVL => 5 CONTENT_LENGTH => LOGNAME => michel QUERY_STRING => LESSOPEN => |/usr/bin/lesspipe.sh %s CONTENT_TYPE => DISPLAY => :0 CC => gcc REQUEST_METHOD => G_BROKEN_FILENAMES => 1 XAUTHORITY => /home/michel/.Xauthority COLORTERM => PHP Variables Variable => Value _SERVER["KDE_MULTIHEAD"] => false _SERVER["SSH_AGENT_PID"] => 1280 _SERVER["HOSTNAME"] => localhost.localdomain _SERVER["TEST_PHP_SRCDIR"] => /home/httpd/html/PHP/php5 _SERVER["TERM"] => xterm _SERVER["SHELL"] => /bin/sh _SERVER["HISTSIZE"] => 1000 _SERVER["MAKEFLAGS"] => _SERVER["SSH_CLIENT"] => deleted _SERVER["GS_LIB"] => /home/michel/.kde/share/fonts _SERVER["GTK_RC_FILES"] => /etc/gtk/gtkrc:/home/michel/.gtkrc:/home/michel/.gtkrc-kde _SERVER["QTDIR"] => /usr/lib/qt3-gcc3.2 _SERVER["SSH_TTY"] => deleted _SERVER["USER"] => michel _SERVER["LS_COLORS"] => no=00:fi=00:di=00;34:ln=00;36:pi=40;33:so=00;35:bd=40;33;01:cd=40;33;01:or=01;05;37;41:mi=01;05;37;41:ex=00;32:*.cmd=00;32:*.exe=00;32:*.com=00;32:*.btm=00;32:*.bat=00;32:*.sh=00;32:*.csh=00;32:*.tar=00;31:*.tgz=00;31:*.arj=00;31:*.taz=00;31:*.lzh=00;31:*.zip=00;31:*.z=00;31:*.Z=00;31:*.gz=00;31:*.bz2=00;31:*.bz=00;31:*.tz=00;31:*.rpm=00;31:*.cpio=00;31:*.jpg=00;35:*.gif=00;35:*.bmp=00;35:*.xbm=00;35:*.xpm=00;35:*.png=00;35:*.tif=00;35: _SERVER["SCRIPT_FILENAME"] => _SERVER["SSH_AUTH_SOCK"] => deleted _SERVER["SESSION_MANAGER"] => local/localhost.localdomain:/tmp/.ICE-unix/1353 _SERVER["MAKELEVEL"] => 1 _SERVER["MFLAGS"] => _SERVER["KONSOLE_DCOP"] => DCOPRef(konsole-1367,konsole) _SERVER["PATH"] => /usr/local/hpoj-0.90/sbin:/usr/local/hpoj-0.90/bin:/usr/local/hpoj-0.90/sbin:/usr/local/hpoj-0.90/bin:/usr/local/bin:/usr/bin:/bin:/usr/X11R6/bin:/usr/local/mozilla:/home/michel/bin:/usr/local/mozilla _SERVER["MAIL"] => /var/spool/mail/michel _SERVER["_"] => /home/httpd/html/PHP/php5/sapi/cli/php _SERVER["PWD"] => /home/httpd/html/PHP/php5 _SERVER["KONSOLE_DCOP_SESSION"] => DCOPRef(konsole-1367,session-2) _SERVER["INPUTRC"] => /etc/inputrc _SERVER["XMODIFIERS"] => @im=none _SERVER["LANG"] => it_IT.ISO8859-1 _SERVER["TEST_PHP_EXECUTABLE"] => /home/httpd/html/PHP/php5/sapi/cli/php _SERVER["REDIRECT_STATUS"] => _SERVER["PATH_TRANSLATED"] => _SERVER["GDMSESSION"] => KDE _SERVER["SSH_ASKPASS"] => /usr/libexec/openssh/gnome-ssh-askpass _SERVER["HOME"] => /home/michel _SERVER["SHLVL"] => 5 _SERVER["CONTENT_LENGTH"] => _SERVER["LOGNAME"] => michel _SERVER["QUERY_STRING"] => _SERVER["LESSOPEN"] => |/usr/bin/lesspipe.sh %s _SERVER["CONTENT_TYPE"] => _SERVER["DISPLAY"] => :0 _SERVER["CC"] => gcc _SERVER["REQUEST_METHOD"] => _SERVER["G_BROKEN_FILENAMES"] => 1 _SERVER["XAUTHORITY"] => /home/michel/.Xauthority _SERVER["COLORTERM"] => _SERVER["PHP_SELF"] => _SERVER["SCRIPT_NAME"] => _SERVER["DOCUMENT_ROOT"] => _SERVER["argv"] => Array ( ) _SERVER["argc"] => 0 _ENV["KDE_MULTIHEAD"] => false _ENV["SSH_AGENT_PID"] => 1280 _ENV["HOSTNAME"] => localhost.localdomain _ENV["TEST_PHP_SRCDIR"] => /home/httpd/html/PHP/php5 _ENV["TERM"] => xterm _ENV["SHELL"] => /bin/sh _ENV["HISTSIZE"] => 1000 _ENV["MAKEFLAGS"] => _ENV["SSH_CLIENT"] => deleted _ENV["GS_LIB"] => /home/michel/.kde/share/fonts _ENV["GTK_RC_FILES"] => /etc/gtk/gtkrc:/home/michel/.gtkrc:/home/michel/.gtkrc-kde _ENV["QTDIR"] => /usr/lib/qt3-gcc3.2 _ENV["SSH_TTY"] => deleted _ENV["USER"] => michel _ENV["LS_COLORS"] => no=00:fi=00:di=00;34:ln=00;36:pi=40;33:so=00;35:bd=40;33;01:cd=40;33;01:or=01;05;37;41:mi=01;05;37;41:ex=00;32:*.cmd=00;32:*.exe=00;32:*.com=00;32:*.btm=00;32:*.bat=00;32:*.sh=00;32:*.csh=00;32:*.tar=00;31:*.tgz=00;31:*.arj=00;31:*.taz=00;31:*.lzh=00;31:*.zip=00;31:*.z=00;31:*.Z=00;31:*.gz=00;31:*.bz2=00;31:*.bz=00;31:*.tz=00;31:*.rpm=00;31:*.cpio=00;31:*.jpg=00;35:*.gif=00;35:*.bmp=00;35:*.xbm=00;35:*.xpm=00;35:*.png=00;35:*.tif=00;35: _ENV["SCRIPT_FILENAME"] => _ENV["SSH_AUTH_SOCK"] => deleted _ENV["SESSION_MANAGER"] => local/localhost.localdomain:/tmp/.ICE-unix/1353 _ENV["MAKELEVEL"] => 1 _ENV["MFLAGS"] => _ENV["KONSOLE_DCOP"] => DCOPRef(konsole-1367,konsole) _ENV["PATH"] => /usr/local/hpoj-0.90/sbin:/usr/local/hpoj-0.90/bin:/usr/local/hpoj-0.90/sbin:/usr/local/hpoj-0.90/bin:/usr/local/bin:/usr/bin:/bin:/usr/X11R6/bin:/usr/local/mozilla:/home/michel/bin:/usr/local/mozilla _ENV["MAIL"] => /var/spool/mail/michel _ENV["_"] => /home/httpd/html/PHP/php5/sapi/cli/php _ENV["PWD"] => /home/httpd/html/PHP/php5 _ENV["KONSOLE_DCOP_SESSION"] => DCOPRef(konsole-1367,session-2) _ENV["INPUTRC"] => /etc/inputrc _ENV["XMODIFIERS"] => @im=none _ENV["LANG"] => it_IT.ISO8859-1 _ENV["TEST_PHP_EXECUTABLE"] => /home/httpd/html/PHP/php5/sapi/cli/php _ENV["REDIRECT_STATUS"] => _ENV["PATH_TRANSLATED"] => _ENV["GDMSESSION"] => KDE _ENV["SSH_ASKPASS"] => /usr/libexec/openssh/gnome-ssh-askpass _ENV["HOME"] => /home/michel _ENV["SHLVL"] => 5 _ENV["CONTENT_LENGTH"] => _ENV["LOGNAME"] => michel _ENV["QUERY_STRING"] => _ENV["LESSOPEN"] => |/usr/bin/lesspipe.sh %s _ENV["CONTENT_TYPE"] => _ENV["DISPLAY"] => :0 _ENV["CC"] => gcc _ENV["REQUEST_METHOD"] => _ENV["G_BROKEN_FILENAMES"] => 1 _ENV["XAUTHORITY"] => /home/michel/.Xauthority _ENV["COLORTERM"] => PHP License This program is free software; you can redistribute it and/or modify it under the terms of the PHP License as published by the PHP Group and included in the distribution in the file: LICENSE This program is distributed in the hope that it will be useful, but WITHOUT ANY WARRANTY; without even the implied warranty of MERCHANTABILITY or FITNESS FOR A PARTICULAR PURPOSE. If you did not receive a copy of the PHP license, or have any questions about PHP licensing, please contact license@php.net.

« previous php.qa (#8904) next »