Test results [failed]
| From: | noreply@php.net | Date: | Thu, 27 Feb 2003 22:52:42 +0000 |
| Subject: | Test results [failed] | ||
| Groups: | php.qa | ||
| Request: | Send a blank email to php-qa+get-9604@lists.php.net to get a copy of this message | ||
=====================================================================
FAILED TEST SUMMARY
---------------------------------------------------------------------
Bug #21131: fopen($filename, "a+") has broken position
[ext/standard/tests/file/bug21131.phpt]
strtotime() function [ext/standard/tests/time/002.phpt]
=====================================================================
=====================================================================
TEST RESULT SUMMARY
---------------------------------------------------------------------
Exts skipped : 75
Exts tested : 13
---------------------------------------------------------------------
Number of tests : 443
Tests skipped : 217 (49.0%)
Tests failed : 2 ( 0.5%)
Tests passed : 224 (50.6%)
---------------------------------------------------------------------
Time taken : 133 seconds
=====================================================================
================================================================================
/export/home/duncan/src/php-4.3.1/ext/standard/tests/file/bug21131.phpt
================================================================================
---- EXPECTED OUTPUT
int(6)
int(0)
foobar
---- ACTUAL OUTPUT
int(0)
int(0)
foobar
---- FAILED
================================================================================
001- int(6)
001+ int(0)
================================================================================
================================================================================
/export/home/duncan/src/php-4.3.1/ext/standard/tests/time/002.phpt
================================================================================
---- EXPECTED OUTPUT
1999-10-13 00:00:00
1999-10-13 00:00:00
2000-01-19 00:00:00
2000-01-19 00:00:00
2001-12-21 00:00:00
2001-12-21 00:00:00
2001-12-21 12:16:00
2001-12-21 12:16:00
1969-12-31 23:59:59
2001-10-22 21:19:58
2001-10-22 23:19:58
2001-10-22 23:32:58
2001-10-22 19:19:58
2001-10-22 19:06:58
1999-10-13 00:00:00
1999-10-13 00:00:00
2000-01-19 00:00:00
2000-01-19 00:00:00
2001-12-21 00:00:00
2001-12-21 00:00:00
2001-12-21 12:16:00
2001-12-21 12:16:00
1970-01-01 00:59:59
2001-10-22 21:19:58
2001-10-23 01:19:58
2001-10-23 01:32:58
2001-10-22 21:19:58
2001-10-22 21:06:58
---- ACTUAL OUTPUT
1999-10-13 00:00:00
1999-10-13 00:00:00
2000-01-19 00:00:00
2000-01-19 00:00:00
2001-12-21 00:00:00
2001-12-21 00:00:00
2001-12-21 12:16:00
2001-12-21 12:16:00
1969-12-31 23:59:59
2001-10-22 21:19:58
2001-10-22 23:19:58
2001-10-22 23:32:58
2001-10-22 19:19:58
2001-10-22 19:06:58
1999-10-13 00:00:00
1999-10-13 00:00:00
2000-01-19 00:00:00
2000-01-19 00:00:00
2001-12-21 00:00:00
2001-12-21 00:00:00
2001-12-21 12:16:00
2001-12-21 12:16:00
1969-12-31 23:59:59
2001-10-22 21:19:58
2001-10-22 23:19:58
2001-10-22 23:32:58
2001-10-22 19:19:58
2001-10-22 19:06:58
---- FAILED
================================================================================
023- 1970-01-01 00:59:59
023+ 1969-12-31 23:59:59
025- 2001-10-23 01:19:58
025+ 2001-10-22 23:19:58
026- 2001-10-23 01:32:58
026+ 2001-10-22 23:32:58
027- 2001-10-22 21:19:58
027+ 2001-10-22 19:19:58
028- 2001-10-22 21:06:58
028+ 2001-10-22 19:06:58
================================================================================
================================================================================
BUILD ENVIRONMENT
================================================================================
OS:
SunOS
Automake:
Autoconf:
Libtool:
ltmain.sh (GNU libtool) 1.4.2 (1.922.2.53 2001/09/11 03:18:52)
Compiler:
Reading specs from /usr/local/lib/gcc-lib/sparc-sun-solaris2.8/3.2/specs
Configured with: ../configure --with-as=/usr/ccs/bin/as --with-ld=/usr/ccs/bin/ld --disable-nls
Thread model: posix
gcc version 3.2
Bison:
GNU Bison version 1.28
User's E-mail: drsharp at pacbell dot net
================================================================================
PHPINFO
================================================================================
phpinfo()
PHP Version => 4.3.1
System => SunOS bark 5.8 Generic_108528-16 sun4u
Build Date => Feb 27 2003 13:35:28
Configure Command => './configure' '--with-mysql=/usr/local/mysql'
'--with-gd' '--with-apxs=/usr/apache/bin/apxs' '--enable-sockets'
'--with-openssl' '--with-jpeg-dir=../jpeg' '--with-zlib-dir=/usr'
Server API => Command Line Interface
Virtual Directory Support => disabled
Configuration File (php.ini) Path => /usr/local/lib
PHP API => 20020918
PHP Extension => 20020429
Zend Extension => 20021010
Debug Build => no
Thread Safety => disabled
Registered PHP Streams => php, http, ftp, https, ftps, compress.zlib
This program makes use of the Zend Scripting Language Engine:
Zend Engine v1.3.0, Copyright (c) 1998-2002 Zend Technologies
_______________________________________________________________________
Configuration
PHP Core
Directive => Local Value => Master Value
allow_call_time_pass_reference => On => On
allow_url_fopen => On => On
always_populate_raw_post_data => Off => Off
arg_separator.input => & => &
arg_separator.output => & => &
asp_tags => Off => Off
auto_append_file => no value => no value
auto_prepend_file => no value => no value
browscap => no value => no value
default_charset => no value => no value
default_mimetype => text/html => text/html
define_syslog_variables => Off => Off
disable_functions => no value => no value
display_errors => On => On
display_startup_errors => Off => Off
doc_root => no value => no value
docref_ext => no value => no value
docref_root => http://www.php.net/ => http://www.php.net/
enable_dl => On => On
error_append_string => no value => no value
error_log => no value => no value
error_prepend_string => no value => no value
error_reporting => no value => no value
expose_php => On => On
extension_dir => /usr/local/lib/php/extensions/no-debug-non-zts-20020429 =>
/usr/local/lib/php/extensions/no-debug-non-zts-20020429
file_uploads => On => On
gpc_order => GPC => GPC
highlight.bg => #FFFFFF => #FFFFFF
highlight.comment => #FF8000 => #FF8000
highlight.default => #0000BB => #0000BB
highlight.html => #000000 => #000000
highlight.keyword => #007700 => #007700
highlight.string => #DD0000 => #DD0000
html_errors => Off => On
ignore_repeated_errors => Off => Off
ignore_repeated_source => Off => Off
ignore_user_abort => Off => Off
implicit_flush => On => Off
include_path => .:/usr/local/lib/php => .:/usr/local/lib/php
log_errors => Off => Off
log_errors_max_len => 1024 => 1024
magic_quotes_gpc => On => On
magic_quotes_runtime => Off => Off
magic_quotes_sybase => Off => Off
max_execution_time => 0 => 30
max_input_time => -1 => -1
open_basedir => no value => no value
output_buffering => 0 => 0
output_handler => no value => no value
post_max_size => 8M => 8M
precision => 14 => 14
register_argc_argv => On => On
register_globals => Off => Off
report_memleaks => On => On
safe_mode => Off => Off
safe_mode_exec_dir => 1 => 1
safe_mode_gid => Off => Off
safe_mode_include_dir => no value => no value
sendmail_from => no value => no value
sendmail_path => /usr/lib/sendmail -t -i => /usr/lib/sendmail -t -i
short_open_tag => On => On
SMTP => localhost => localhost
smtp_port => 25 => 25
sql.safe_mode => Off => Off
track_errors => Off => Off
unserialize_callback_func => no value => no value
upload_max_filesize => 2M => 2M
upload_tmp_dir => no value => no value
user_dir => no value => no value
variables_order => no value => no value
xmlrpc_error_number => 0 => 0
xmlrpc_errors => Off => Off
y2k_compliance => On => On
ctype
ctype functions => enabled
gd
GD Support => enabled
GD Version => bundled (2.0 compatible)
GIF Read Support => enabled
JPG Support => enabled
PNG Support => enabled
WBMP Support => enabled
mysql
MySQL Support => enabled
Active Persistent Links => 0
Active Links => 0
Client API version => 3.23.55
MYSQL_MODULE_TYPE => external
MYSQL_SOCKET => /tmp/mysql.sock
MYSQL_INCLUDE => -I/usr/local/mysql/include/mysql
MYSQL_LIBS => -L/usr/local/mysql/lib/mysql -lmysqlclient
Directive => Local Value => Master Value
mysql.allow_persistent => On => On
mysql.connect_timeout => -1 => -1
mysql.default_host => no value => no value
mysql.default_password => no value => no value
mysql.default_port => no value => no value
mysql.default_socket => no value => no value
mysql.default_user => no value => no value
mysql.max_links => Unlimited => Unlimited
mysql.max_persistent => Unlimited => Unlimited
mysql.trace_mode => Off => Off
openssl
OpenSSL support => enabled
OpenSSL Version => OpenSSL 0.9.6g 9 Aug 2002
overload
User-Space Object Overloading Support => enabled
pcre
PCRE (Perl Compatible Regular Expressions) Support => enabled
PCRE Library Version => 3.92 11-Sep-2002
posix
Revision => $Revision: 1.51 $
session
Session Support => enabled
Registered save handlers => files user
Directive => Local Value => Master Value
session.auto_start => Off => Off
session.bug_compat_42 => On => On
session.bug_compat_warn => On => On
session.cache_expire => 180 => 180
session.cache_limiter => nocache => nocache
session.cookie_domain => no value => no value
session.cookie_lifetime => 0 => 0
session.cookie_path => / => /
session.cookie_secure => Off => Off
session.entropy_file => no value => no value
session.entropy_length => 0 => 0
session.gc_dividend => 100 => 100
session.gc_maxlifetime => 1440 => 1440
session.gc_probability => 1 => 1
session.name => PHPSESSID => PHPSESSID
session.referer_check => no value => no value
session.save_handler => files => files
session.save_path => /tmp => /tmp
session.serialize_handler => php => php
session.use_cookies => On => On
session.use_only_cookies => Off => Off
session.use_trans_sid => Off => Off
sockets
Sockets Support => enabled
standard
Regex Library => Bundled library enabled
Dynamic Library Support => enabled
Path to sendmail => /usr/lib/sendmail -t -i
Directive => Local Value => Master Value
assert.active => 1 => 1
assert.bail => 0 => 0
assert.callback => no value => no value
assert.quiet_eval => 0 => 0
assert.warning => 1 => 1
auto_detect_line_endings => 0 => 0
default_socket_timeout => 60 => 60
safe_mode_allowed_env_vars => PHP_ => PHP_
safe_mode_protected_env_vars => LD_LIBRARY_PATH => LD_LIBRARY_PATH
url_rewriter.tags => a=href,area=href,frame=src,form=,fieldset= =>
a=href,area=href,frame=src,form=,fieldset=
user_agent => no value => no value
tokenizer
Tokenizer Support => enabled
xml
XML Support => active
XML Namespace Support => active
EXPAT Version => 1.95.2
zlib
ZLib Support => enabled
Compiled Version => 1.1.3
Linked Version => 1.1.3
Directive => Local Value => Master Value
zlib.output_compression => Off => Off
zlib.output_compression_level => -1 => -1
zlib.output_handler => no value => no value
Additional Modules
Module Name
Environment
Variable => Value
CC => gcc
CLASSPATH => /opt/NSCPcom/java:/opt/NSCPcom/java/classes
CONTENT_LENGTH => CONTENT_TYPE => ENV => /export/home/duncan/.kshrc
HOME => /export/home/duncan
LD_LIBRARY_PATH => /usr/openwin/lib:/usr/dt/lib:/usr/local/lib
LOGNAME => duncan
MAIL => /var/mail//duncan
MAKEFLAGS => MAKELEVEL => 1
MANPATH => /usr/share/man:/usr/local/man:/opt/sfw/man:/usr/openwin/share/man:/opt/ipf/man
MOZILLA_HOME => /SUNWns6
PATH =>
/opt/SUNWns6:/sbin:/usr/sbin:/usr/local/bin:/usr/bin:/usr/ccs/bin:/usr/dt/bin:/usr/ucb:/usr/openwin/bin
PATH_TRANSLATED => PWD => /export/home/duncan/src/php-4.3.1
QUERY_STRING => REDIRECT_STATUS => REQUEST_METHOD => SCRIPT_FILENAME => SGS_SUPPORT
=> libmakestate.so.1
SHELL => /bin/ksh
SSH_CLIENT => 192.168.34.12 757 22
SSH_TTY => /dev/pts/12
TERM => dtterm
TEST_PHP_EXECUTABLE => /export/home/duncan/src/php-4.3.1/sapi/cli/php
TEST_PHP_SRCDIR => /export/home/duncan/src/php-4.3.1
TZ => US/Pacific
USER => duncan
VIRTUAL_ROOT => /
_ => /usr/ccs/bin/make
PHP Variables
Variable => Value
_SERVER["CC"] => gcc
_SERVER["CLASSPATH"] => /opt/NSCPcom/java:/opt/NSCPcom/java/classes
_SERVER["CONTENT_LENGTH"] =>
_SERVER["CONTENT_TYPE"] =>
_SERVER["ENV"] => /export/home/duncan/.kshrc
_SERVER["HOME"] => /export/home/duncan
_SERVER["LD_LIBRARY_PATH"] => /usr/openwin/lib:/usr/dt/lib:/usr/local/lib
_SERVER["LOGNAME"] => duncan
_SERVER["MAIL"] => /var/mail//duncan
_SERVER["MAKEFLAGS"] =>
_SERVER["MAKELEVEL"] => 1
_SERVER["MANPATH"] =>
/usr/share/man:/usr/local/man:/opt/sfw/man:/usr/openwin/share/man:/opt/ipf/man
_SERVER["MOZILLA_HOME"] => /SUNWns6
_SERVER["PATH"] =>
/opt/SUNWns6:/sbin:/usr/sbin:/usr/local/bin:/usr/bin:/usr/ccs/bin:/usr/dt/bin:/usr/ucb:/usr/openwin/bin
_SERVER["PATH_TRANSLATED"] =>
_SERVER["PWD"] => /export/home/duncan/src/php-4.3.1
_SERVER["QUERY_STRING"] =>
_SERVER["REDIRECT_STATUS"] =>
_SERVER["REQUEST_METHOD"] =>
_SERVER["SCRIPT_FILENAME"] =>
_SERVER["SGS_SUPPORT"] => libmakestate.so.1
_SERVER["SHELL"] => /bin/ksh
_SERVER["SSH_CLIENT"] => 192.168.34.12 757 22
_SERVER["SSH_TTY"] => /dev/pts/12
_SERVER["TERM"] => dtterm
_SERVER["TEST_PHP_EXECUTABLE"] => /export/home/duncan/src/php-4.3.1/sapi/cli/php
_SERVER["TEST_PHP_SRCDIR"] => /export/home/duncan/src/php-4.3.1
_SERVER["TZ"] => US/Pacific
_SERVER["USER"] => duncan
_SERVER["VIRTUAL_ROOT"] => /
_SERVER["_"] => /usr/ccs/bin/make
_SERVER["PHP_SELF"] =>
_SERVER["SCRIPT_NAME"] =>
_SERVER["DOCUMENT_ROOT"] =>
_SERVER["argv"] => Array
(
)
_SERVER["argc"] => 0
_ENV["CC"] => gcc
_ENV["CLASSPATH"] => /opt/NSCPcom/java:/opt/NSCPcom/java/classes
_ENV["CONTENT_LENGTH"] =>
_ENV["CONTENT_TYPE"] =>
_ENV["ENV"] => /export/home/duncan/.kshrc
_ENV["HOME"] => /export/home/duncan
_ENV["LD_LIBRARY_PATH"] => /usr/openwin/lib:/usr/dt/lib:/usr/local/lib
_ENV["LOGNAME"] => duncan
_ENV["MAIL"] => /var/mail//duncan
_ENV["MAKEFLAGS"] =>
_ENV["MAKELEVEL"] => 1
_ENV["MANPATH"] =>
/usr/share/man:/usr/local/man:/opt/sfw/man:/usr/openwin/share/man:/opt/ipf/man
_ENV["MOZILLA_HOME"] => /SUNWns6
_ENV["PATH"] =>
/opt/SUNWns6:/sbin:/usr/sbin:/usr/local/bin:/usr/bin:/usr/ccs/bin:/usr/dt/bin:/usr/ucb:/usr/openwin/bin
_ENV["PATH_TRANSLATED"] =>
_ENV["PWD"] => /export/home/duncan/src/php-4.3.1
_ENV["QUERY_STRING"] =>
_ENV["REDIRECT_STATUS"] =>
_ENV["REQUEST_METHOD"] =>
_ENV["SCRIPT_FILENAME"] =>
_ENV["SGS_SUPPORT"] => libmakestate.so.1
_ENV["SHELL"] => /bin/ksh
_ENV["SSH_CLIENT"] => 192.168.34.12 757 22
_ENV["SSH_TTY"] => /dev/pts/12
_ENV["TERM"] => dtterm
_ENV["TEST_PHP_EXECUTABLE"] => /export/home/duncan/src/php-4.3.1/sapi/cli/php
_ENV["TEST_PHP_SRCDIR"] => /export/home/duncan/src/php-4.3.1
_ENV["TZ"] => US/Pacific
_ENV["USER"] => duncan
_ENV["VIRTUAL_ROOT"] => /
_ENV["_"] => /usr/ccs/bin/make
PHP License
This program is free software; you can redistribute it and/or modify
it under the terms of the PHP License as published by the PHP Group
and included in the distribution in the file: LICENSE
This program is distributed in the hope that it will be useful,
but WITHOUT ANY WARRANTY; without even the implied warranty of
MERCHANTABILITY or FITNESS FOR A PARTICULAR PURPOSE.
If you did not receive a copy of the PHP license, or have any
questions about PHP licensing, please contact license@php.net.