Test results [failed]

From: Date: Tue, 04 Mar 2003 10:07:36 +0000
Subject: Test results [failed]
Groups: php.qa 
Request: Send a blank email to php-qa+get-9720@lists.php.net to get a copy of this message
===================================================================== FAILED TEST SUMMARY --------------------------------------------------------------------- String functions [tests/strings/001.phpt] File type functions [ext/standard/tests/file/001.phpt] Bug #21131: fopen($filename, "a+") has broken position [ext/standard/tests/file/bug21131.phpt] microtime() function [ext/standard/tests/time/001.phpt] strtotime() function [ext/standard/tests/time/002.phpt] Check for mktime with out-of-range parameters [ext/standard/tests/time/003.phpt] ===================================================================== ===================================================================== TEST RESULT SUMMARY --------------------------------------------------------------------- Exts skipped : 80 Exts tested : 8 --------------------------------------------------------------------- Number of tests : 443 Tests skipped : 238 (53.7%) Tests failed : 6 ( 1.4%) Tests passed : 199 (44.9%) --------------------------------------------------------------------- Time taken : 37 seconds ===================================================================== ================================================================================ /cygdrive/e/linux/php4/tests/strings/001.phpt ================================================================================ ---- EXPECTED OUTPUT Testing strtok: passed Testing strstr: passed Testing strrchr: passed Testing strtoupper: passed Testing strtolower: passed Testing substr: passed Testing rawurlencode: passed Testing rawurldecode: passed Testing urlencode: passed Testing urldecode: passed Testing quotemeta: passed Testing ufirst: passed Testing strtr: passed Testing addslashes: passed Testing stripslashes: passed Testing uniqid: passed ---- ACTUAL OUTPUT Testing strtok: passed Testing strstr: passed Testing strrchr: passed Testing strtoupper: passed Testing strtolower: passed Testing substr: passed Testing rawurlencode: passed Testing rawurldecode: passed Testing urlencode: passed Testing urldecode: passed Testing quotemeta: passed Testing ufirst: passed Testing strtr: passed Testing addslashes: passed Testing stripslashes: passed Testing uniqid: failed! ---- FAILED ================================================================================ 016- Testing uniqid: passed 016+ Testing uniqid: failed! ================================================================================ ================================================================================ /cygdrive/e/linux/php4/ext/standard/tests/file/001.phpt ================================================================================ ---- EXPECTED OUTPUT test.file does not exist test.file exists test.link exists test.file is not a symlink test.link is a symlink test.file exists test.link lstat and stat differ at element 1 test.link lstat and stat differ at element 2 test.link lstat and stat differ at element 7 test.link lstat and stat differ at element 8 test.link lstat and stat differ at element 9 test.link lstat and stat differ at element 10 test.file is file test.link is link test.file permissions are 0744 test.file size is 0 test.file is writeable test.file is readable test.file is executable test.file is a regular file test.link is a regular file test.link is not a directory ../file is a directory test.file is not a directory test.file does not exist test.file does not exist ---- ACTUAL OUTPUT test.file does not exist test.file exists test.link exists test.file is not a symlink test.link is a symlink test.file exists test.link lstat and stat differ at element 1 test.link lstat and stat differ at element 2 test.link lstat and stat differ at element 7 test.link lstat and stat differ at element 9 test.link lstat and stat differ at element 10 test.file is file test.link is link test.file permissions are 0644 test.file size is 0 test.file is writeable test.file is readable test.file is not executable test.file is a regular file test.link is a regular file test.link is not a directory ../file is a directory test.file is not a directory test.file does not exist test.file does not exist ---- FAILED ================================================================================ 010- test.link lstat and stat differ at element 8 010+ test.link lstat and stat differ at element 9 011- test.link lstat and stat differ at element 9 011+ test.link lstat and stat differ at element 10 012- test.link lstat and stat differ at element 10 012+ test.file is file 013- test.file is file 013+ test.link is link 014- test.link is link 014+ test.file permissions are 0644 015- test.file permissions are 0744 015+ test.file size is 0 016- test.file size is 0 016+ test.file is writeable 017- test.file is writeable 017+ test.file is readable 018- test.file is readable 018+ test.file is not executable 019- test.file is executable 019+ test.file is a regular file 020- test.file is a regular file 020+ test.link is a regular file 021- test.link is a regular file 021+ test.link is not a directory 022- test.link is not a directory 022+ ../file is a directory 023- ../file is a directory 023+ test.file is not a directory 024- test.file is not a directory 024+ test.file does not exist 026- test.file does not exist ================================================================================ ================================================================================ /cygdrive/e/linux/php4/ext/standard/tests/file/bug21131.phpt ================================================================================ ---- EXPECTED OUTPUT int(6) int(0) foobar ---- ACTUAL OUTPUT int(0) int(0) foobar ---- FAILED ================================================================================ 001- int(6) 001+ int(0) ================================================================================ ================================================================================ /cygdrive/e/linux/php4/ext/standard/tests/time/001.phpt ================================================================================ ---- EXPECTED OUTPUT Passed: 100000 Failed: 0 ---- ACTUAL OUTPUT Passed: 7742 Failed: 92258 000002: 1046772409 0.31444100 < 1046772409 0.31444100 000003: 1046772409 0.31444100 < 1046772409 0.31444100 000004: 1046772409 0.31444100 < 1046772409 0.31444100 000005: 1046772409 0.31444100 < 1046772409 0.31444100 000006: 1046772409 0.31444100 < 1046772409 0.31444100 000008: 1046772409 0.31544100 < 1046772409 0.31544100 000009: 1046772409 0.31544100 < 1046772409 0.31544100 000010: 1046772409 0.31544100 < 1046772409 0.31544100 000011: 1046772409 0.31544100 < 1046772409 0.31544100 000012: 1046772409 0.31544100 < 1046772409 0.31544100 000013: 1046772409 0.31544100 < 1046772409 0.31544100 ---- FAILED ================================================================================ 001- Passed: 100000 001+ Passed: 7742 002- Failed: 0 002+ Failed: 92258 003+ 000002: 1046772409 0.31444100 < 1046772409 0.31444100 004+ 000003: 1046772409 0.31444100 < 1046772409 0.31444100 005+ 000004: 1046772409 0.31444100 < 1046772409 0.31444100 006+ 000005: 1046772409 0.31444100 < 1046772409 0.31444100 007+ 000006: 1046772409 0.31444100 < 1046772409 0.31444100 008+ 000008: 1046772409 0.31544100 < 1046772409 0.31544100 009+ 000009: 1046772409 0.31544100 < 1046772409 0.31544100 010+ 000010: 1046772409 0.31544100 < 1046772409 0.31544100 011+ 000011: 1046772409 0.31544100 < 1046772409 0.31544100 012+ 000012: 1046772409 0.31544100 < 1046772409 0.31544100 013+ 000013: 1046772409 0.31544100 < 1046772409 0.31544100 ================================================================================ ================================================================================ /cygdrive/e/linux/php4/ext/standard/tests/time/002.phpt ================================================================================ ---- EXPECTED OUTPUT 1999-10-13 00:00:00 1999-10-13 00:00:00 2000-01-19 00:00:00 2000-01-19 00:00:00 2001-12-21 00:00:00 2001-12-21 00:00:00 2001-12-21 12:16:00 2001-12-21 12:16:00 1969-12-31 23:59:59 2001-10-22 21:19:58 2001-10-22 23:19:58 2001-10-22 23:32:58 2001-10-22 19:19:58 2001-10-22 19:06:58 1999-10-13 00:00:00 1999-10-13 00:00:00 2000-01-19 00:00:00 2000-01-19 00:00:00 2001-12-21 00:00:00 2001-12-21 00:00:00 2001-12-21 12:16:00 2001-12-21 12:16:00 1970-01-01 00:59:59 2001-10-22 21:19:58 2001-10-23 01:19:58 2001-10-23 01:32:58 2001-10-22 21:19:58 2001-10-22 21:06:58 ---- ACTUAL OUTPUT 1999-10-13 00:00:00 1999-10-13 00:00:00 2000-01-19 00:00:00 2000-01-19 00:00:00 2001-12-21 00:00:00 2001-12-21 00:00:00 2001-12-21 12:16:00 2001-12-21 12:16:00 1969-12-31 23:59:59 2001-10-22 21:19:58 2001-10-22 23:19:58 2001-10-22 23:32:58 2001-10-22 19:19:58 2001-10-22 19:06:58 1999-10-13 00:00:00 1999-10-13 00:00:00 2000-01-19 00:00:00 2000-01-19 00:00:00 2001-12-21 00:00:00 2001-12-21 00:00:00 2001-12-21 12:16:00 2001-12-21 12:16:00 1969-12-31 23:59:59 2001-10-22 21:19:58 2001-10-22 23:19:58 2001-10-22 23:32:58 2001-10-22 19:19:58 2001-10-22 19:06:58 ---- FAILED ================================================================================ 023- 1970-01-01 00:59:59 023+ 1969-12-31 23:59:59 025- 2001-10-23 01:19:58 025+ 2001-10-22 23:19:58 026- 2001-10-23 01:32:58 026+ 2001-10-22 23:32:58 027- 2001-10-22 21:19:58 027+ 2001-10-22 19:19:58 028- 2001-10-22 21:06:58 028+ 2001-10-22 19:06:58 ================================================================================ ================================================================================ /cygdrive/e/linux/php4/ext/standard/tests/time/003.phpt ================================================================================ ---- EXPECTED OUTPUT 2000-02-29 2000-02-28 2000-02-29 2001-02-28 2001-03-01 1999-11-30 2000-05-29 12:00:00 2000-05-29 13:00:00 2000-05-29 12:00:00 2000-01-31 12:00:00 2000-01-31 12:00:00 2000-01-31 11:00:00 2000-04-29 12:00:00 2000-04-29 13:00:00 2000-04-29 12:00:00 ---- ACTUAL OUTPUT 2000-02-29 2000-02-28 2000-02-29 2001-02-28 2001-03-01 1999-11-30 2000-05-29 12:00:00 2000-05-29 12:00:00 1969-12-31 23:58:58 2000-01-31 12:00:00 2000-01-31 12:00:00 1969-10-01 23:58:58 2000-04-29 12:00:00 2000-04-29 12:00:00 1969-12-29 23:58:58 ---- FAILED ================================================================================ 008- 2000-05-29 13:00:00 008+ 2000-05-29 12:00:00 009- 2000-05-29 12:00:00 009+ 1969-12-31 23:58:58 012- 2000-01-31 11:00:00 012+ 1969-10-01 23:58:58 014- 2000-04-29 13:00:00 014+ 2000-04-29 12:00:00 015- 2000-04-29 12:00:00 015+ 1969-12-29 23:58:58 ================================================================================ ================================================================================ BUILD ENVIRONMENT ================================================================================ OS: CYGWIN_NT-5.0 Automake: automake (GNU automake) 1.4-p5 Copyright (C) 1999, 2001 Free Software Foundation, Inc. This is free software; see the source for copying conditions. There is NO warranty; not even for MERCHANTABILITY or FITNESS FOR A PARTICULAR PURPOSE. Written by Tom Tromey <tromey@cygnus.com> Autoconf: Autoconf version 2.13 Libtool: ltmain.sh (GNU libtool) 1.4.2 (1.922.2.53 2001/09/11 03:18:52) Compiler: Reading specs from /bin/../lib/gcc-lib/i686-pc-cygwin/3.2/specs Configured with: /netrel/src/gcc-3.2-3/configure --enable-languages=c,c++,f77,java --enable-libgcj --enable-threads=posix --with-system-zlib --enable-nls --without-included-gettext --enable-interpreter --disable-sjlj-exceptions --disable-version-specific-runtime-libs --enable-shared --build=i686-pc-linux --host=i686-pc-cygwin --target=i686-pc-cygwin --enable-haifa --prefix=/usr --exec-prefix=/usr --sysconfdir=/etc --libdir=/usr/lib --includedir=/nonexistent/include --libexecdir=/usr/sbin Thread model: posix gcc version 3.2 20020927 (prerelease) Bison: bison (GNU Bison) 1.875 Written by Robert Corbett and Richard Stallman. Copyright (C) 2002 Free Software Foundation, Inc. This is free software; see the source for copying conditions. There is NO warranty; not even for MERCHANTABILITY or FITNESS FOR A PARTICULAR PURPOSE. User's E-mail: xuefer at 21cn dot com ================================================================================ PHPINFO ================================================================================ phpinfo() PHP Version => 4.3.1 System => CYGWIN_NT-5.0 bitlook 1.3.20(0.73/3/2) 2003-02-08 12:10 i686 Build Date => Mar 4 2003 17:52:51 Configure Command => './configure' '--with-cli' '--without-xml' Server API => Command Line Interface Virtual Directory Support => disabled Configuration File (php.ini) Path => /usr/local/lib PHP API => 20020918 PHP Extension => 20020429 Zend Extension => 20021010 Debug Build => no Thread Safety => disabled Registered PHP Streams => php, http, ftp This program makes use of the Zend Scripting Language Engine: Zend Engine v1.3.0, Copyright (c) 1998-2002 Zend Technologies _______________________________________________________________________ Configuration PHP Core Directive => Local Value => Master Value allow_call_time_pass_reference => On => On allow_url_fopen => On => On always_populate_raw_post_data => Off => Off arg_separator.input => &amp; => &amp; arg_separator.output => &amp; => &amp; asp_tags => Off => Off auto_append_file => no value => no value auto_prepend_file => no value => no value browscap => no value => no value default_charset => no value => no value default_mimetype => text/html => text/html define_syslog_variables => Off => Off disable_functions => no value => no value display_errors => On => On display_startup_errors => Off => Off doc_root => no value => no value docref_ext => no value => no value docref_root => http://www.php.net/ => http://www.php.net/ enable_dl => On => On error_append_string => no value => no value error_log => no value => no value error_prepend_string => no value => no value error_reporting => no value => no value expose_php => On => On extension_dir => /usr/local/lib/php/extensions/no-debug-non-zts-20020429 => /usr/local/lib/php/extensions/no-debug-non-zts-20020429 file_uploads => On => On gpc_order => GPC => GPC highlight.bg => #FFFFFF => #FFFFFF highlight.comment => #FF8000 => #FF8000 highlight.default => #0000BB => #0000BB highlight.html => #000000 => #000000 highlight.keyword => #007700 => #007700 highlight.string => #DD0000 => #DD0000 html_errors => Off => On ignore_repeated_errors => Off => Off ignore_repeated_source => Off => Off ignore_user_abort => Off => Off implicit_flush => On => Off include_path => .:/usr/local/lib/php => .:/usr/local/lib/php log_errors => Off => Off log_errors_max_len => 1024 => 1024 magic_quotes_gpc => On => On magic_quotes_runtime => Off => Off magic_quotes_sybase => Off => Off max_execution_time => 0 => 30 max_input_time => -1 => -1 open_basedir => no value => no value output_buffering => 0 => 0 output_handler => no value => no value post_max_size => 8M => 8M precision => 14 => 14 register_argc_argv => On => On register_globals => Off => Off report_memleaks => On => On safe_mode => Off => Off safe_mode_exec_dir => 1 => 1 safe_mode_gid => Off => Off safe_mode_include_dir => no value => no value sendmail_from => no value => no value sendmail_path => -t -i => -t -i short_open_tag => On => On SMTP => localhost => localhost smtp_port => 25 => 25 sql.safe_mode => Off => Off track_errors => Off => Off unserialize_callback_func => no value => no value upload_max_filesize => 2M => 2M upload_tmp_dir => no value => no value user_dir => no value => no value variables_order => no value => no value xmlrpc_error_number => 0 => 0 xmlrpc_errors => Off => Off y2k_compliance => On => On ctype ctype functions => enabled mysql MySQL Support => enabled Active Persistent Links => 0 Active Links => 0 Client API version => 3.23.49 MYSQL_MODULE_TYPE => builtin MYSQL_SOCKET => /tmp/mysql.sock MYSQL_INCLUDE => MYSQL_LIBS => Directive => Local Value => Master Value mysql.allow_persistent => On => On mysql.connect_timeout => -1 => -1 mysql.default_host => no value => no value mysql.default_password => no value => no value mysql.default_port => no value => no value mysql.default_socket => no value => no value mysql.default_user => no value => no value mysql.max_links => Unlimited => Unlimited mysql.max_persistent => Unlimited => Unlimited mysql.trace_mode => Off => Off overload User-Space Object Overloading Support => enabled pcre PCRE (Perl Compatible Regular Expressions) Support => enabled PCRE Library Version => 3.92 11-Sep-2002 posix Revision => $Revision: 1.51 $ session Session Support => enabled Registered save handlers => files user Directive => Local Value => Master Value session.auto_start => Off => Off session.bug_compat_42 => On => On session.bug_compat_warn => On => On session.cache_expire => 180 => 180 session.cache_limiter => nocache => nocache session.cookie_domain => no value => no value session.cookie_lifetime => 0 => 0 session.cookie_path => / => / session.cookie_secure => Off => Off session.entropy_file => no value => no value session.entropy_length => 0 => 0 session.gc_dividend => 100 => 100 session.gc_maxlifetime => 1440 => 1440 session.gc_probability => 1 => 1 session.name => PHPSESSID => PHPSESSID session.referer_check => no value => no value session.save_handler => files => files session.save_path => /tmp => /tmp session.serialize_handler => php => php session.use_cookies => On => On session.use_only_cookies => Off => Off session.use_trans_sid => Off => Off standard Regex Library => Bundled library enabled Dynamic Library Support => enabled Directive => Local Value => Master Value assert.active => 1 => 1 assert.bail => 0 => 0 assert.callback => no value => no value assert.quiet_eval => 0 => 0 assert.warning => 1 => 1 auto_detect_line_endings => 0 => 0 default_socket_timeout => 60 => 60 safe_mode_allowed_env_vars => PHP_ => PHP_ safe_mode_protected_env_vars => LD_LIBRARY_PATH => LD_LIBRARY_PATH url_rewriter.tags => a=href,area=href,frame=src,form=,fieldset= => a=href,area=href,frame=src,form=,fieldset= user_agent => no value => no value tokenizer Tokenizer Support => enabled Additional Modules Module Name Environment Variable => Value ALLUSERSPROFILE => C:\Documents and Settings\All Users APPDATA => C:\Documents and Settings\Administrator\Application Data BLASTER => A220 I7 D1 H7 P330 T6 CC => gcc COLORFGBG => 0;default;15 COLORTERM => rxvt-xpm COMMONPROGRAMFILES => C:\Program Files\Common Files COMPUTERNAME => BITLOOK COMSPEC => C:\WINNT\System32\cmd.exe CONTENT_LENGTH => CONTENT_TYPE => DISPLAY => :0 ERROR_START => c:\cygwin\bin\dumper.exe HOME => /home/Administrator HOMEDRIVE => C: HOMEPATH => \ LANG => zh_CN LC_MESSAGES => zh_CN LOGONSERVER => \\BITLOOK LS_COLORS => no=00:fi=00:di=01;34:ln=01;36:pi=40;33:so=01;35:bd=40;33;01:cd=40;33;01:or=01;05;37;41:mi=01;05;37;41:ex=01;32:*.cmd=01;32:*.exe=01;32:*.com=01;32:*.btm=01;32:*.bat=01;32:*.sh=01;32:*.csh=01;32:*.tar=01;31:*.tgz=01;31:*.arj=01;31:*.taz=01;31:*.lzh=01;31:*.zip=01;31:*.z=01;31:*.Z=01;31:*.gz=01;31:*.bz2=01;31:*.bz=01;31:*.tz=01;31:*.rpm=01;31:*.cpio=01;31:*.jpg=01;35:*.gif=01;35:*.bmp=01;35:*.xbm=01;35:*.xpm=01;35:*.png=01;35:*.tif=01;35: MAKEFLAGS => --unix MAKELEVEL => 1 MAKE_MODE => unix MANPATH => :/usr/ssl/man MFLAGS => - --unix NUMBER_OF_PROCESSORS => 1 OLDPWD => /cygdrive/e/linux OS2LIBPATH => C:\WINNT\System32\os2\dll; OS => Windows_NT PATH => /bin:/sbin:/usr/bin:/usr/sbin:/usr/local/bin:/usr/local/sbin:/usr/X11R6/bin:~/bin:/c/Program files/BitKeeper PATHEXT => .COM;.EXE;.BAT;.CMD;.VBS;.VBE;.JS;.JSE;.WSF;.WSH PATH_TRANSLATED => PROCESSOR_ARCHITECTURE => x86 PROCESSOR_IDENTIFIER => x86 Family 6 Model 8 Stepping 3, GenuineIntel PROCESSOR_LEVEL => 6 PROCESSOR_REVISION => 0803 PROGRAMFILES => C:\Program Files PS1 => [\u@\h \W]\$ PWD => /cygdrive/e/linux/php4 QUERY_STRING => REDIRECT_STATUS => REQUEST_METHOD => SBPCI => D:\SBPCI SCRIPT_FILENAME => SHELL => /bin/sh SHLVL => 1 SYSTEMDRIVE => C: SYSTEMROOT => C:\WINNT TEMP => /cygdrive/c/TEMP TERM => xterm TEST_PHP_EXECUTABLE => /cygdrive/e/linux/php4/sapi/cli/php.exe TEST_PHP_SRCDIR => /cygdrive/e/linux/php4 TMP => /cygdrive/c/TEMP USER => Administrator USERDOMAIN => BITLOOK USERNAME => Administrator USERPROFILE => C:\Documents and Settings\Administrator WINDIR => C:\WINNT WINDOWID => 168035112 _ => /bin/make PHP Variables Variable => Value _SERVER["ALLUSERSPROFILE"] => C:\\Documents and Settings\\All Users _SERVER["APPDATA"] => C:\\Documents and Settings\\Administrator\\Application Data _SERVER["BLASTER"] => A220 I7 D1 H7 P330 T6 _SERVER["CC"] => gcc _SERVER["COLORFGBG"] => 0;default;15 _SERVER["COLORTERM"] => rxvt-xpm _SERVER["COMMONPROGRAMFILES"] => C:\\Program Files\\Common Files _SERVER["COMPUTERNAME"] => BITLOOK _SERVER["COMSPEC"] => C:\\WINNT\\System32\\cmd.exe _SERVER["CONTENT_LENGTH"] => _SERVER["CONTENT_TYPE"] => _SERVER["DISPLAY"] => :0 _SERVER["ERROR_START"] => c:\\cygwin\\bin\\dumper.exe _SERVER["HOME"] => /home/Administrator _SERVER["HOMEDRIVE"] => C: _SERVER["HOMEPATH"] => \\ _SERVER["LANG"] => zh_CN _SERVER["LC_MESSAGES"] => zh_CN _SERVER["LOGONSERVER"] => \\\\BITLOOK _SERVER["LS_COLORS"] => no=00:fi=00:di=01;34:ln=01;36:pi=40;33:so=01;35:bd=40;33;01:cd=40;33;01:or=01;05;37;41:mi=01;05;37;41:ex=01;32:*.cmd=01;32:*.exe=01;32:*.com=01;32:*.btm=01;32:*.bat=01;32:*.sh=01;32:*.csh=01;32:*.tar=01;31:*.tgz=01;31:*.arj=01;31:*.taz=01;31:*.lzh=01;31:*.zip=01;31:*.z=01;31:*.Z=01;31:*.gz=01;31:*.bz2=01;31:*.bz=01;31:*.tz=01;31:*.rpm=01;31:*.cpio=01;31:*.jpg=01;35:*.gif=01;35:*.bmp=01;35:*.xbm=01;35:*.xpm=01;35:*.png=01;35:*.tif=01;35: _SERVER["MAKEFLAGS"] => --unix _SERVER["MAKELEVEL"] => 1 _SERVER["MAKE_MODE"] => unix _SERVER["MANPATH"] => :/usr/ssl/man _SERVER["MFLAGS"] => - --unix _SERVER["NUMBER_OF_PROCESSORS"] => 1 _SERVER["OLDPWD"] => /cygdrive/e/linux _SERVER["OS2LIBPATH"] => C:\\WINNT\\System32\\os2\\dll; _SERVER["OS"] => Windows_NT _SERVER["PATH"] => /bin:/sbin:/usr/bin:/usr/sbin:/usr/local/bin:/usr/local/sbin:/usr/X11R6/bin:~/bin:/c/Program files/BitKeeper _SERVER["PATHEXT"] => .COM;.EXE;.BAT;.CMD;.VBS;.VBE;.JS;.JSE;.WSF;.WSH _SERVER["PATH_TRANSLATED"] => _SERVER["PROCESSOR_ARCHITECTURE"] => x86 _SERVER["PROCESSOR_IDENTIFIER"] => x86 Family 6 Model 8 Stepping 3, GenuineIntel _SERVER["PROCESSOR_LEVEL"] => 6 _SERVER["PROCESSOR_REVISION"] => 0803 _SERVER["PROGRAMFILES"] => C:\\Program Files _SERVER["PS1"] => [\\u@\\h \\W]\\$ _SERVER["PWD"] => /cygdrive/e/linux/php4 _SERVER["QUERY_STRING"] => _SERVER["REDIRECT_STATUS"] => _SERVER["REQUEST_METHOD"] => _SERVER["SBPCI"] => D:\\SBPCI _SERVER["SCRIPT_FILENAME"] => _SERVER["SHELL"] => /bin/sh _SERVER["SHLVL"] => 1 _SERVER["SYSTEMDRIVE"] => C: _SERVER["SYSTEMROOT"] => C:\\WINNT _SERVER["TEMP"] => /cygdrive/c/TEMP _SERVER["TERM"] => xterm _SERVER["TEST_PHP_EXECUTABLE"] => /cygdrive/e/linux/php4/sapi/cli/php.exe _SERVER["TEST_PHP_SRCDIR"] => /cygdrive/e/linux/php4 _SERVER["TMP"] => /cygdrive/c/TEMP _SERVER["USER"] => Administrator _SERVER["USERDOMAIN"] => BITLOOK _SERVER["USERNAME"] => Administrator _SERVER["USERPROFILE"] => C:\\Documents and Settings\\Administrator _SERVER["WINDIR"] => C:\\WINNT _SERVER["WINDOWID"] => 168035112 _SERVER["_"] => /bin/make _SERVER["PHP_SELF"] => _SERVER["SCRIPT_NAME"] => _SERVER["DOCUMENT_ROOT"] => _SERVER["argv"] => Array ( ) _SERVER["argc"] => 0 _ENV["ALLUSERSPROFILE"] => C:\\Documents and Settings\\All Users _ENV["APPDATA"] => C:\\Documents and Settings\\Administrator\\Application Data _ENV["BLASTER"] => A220 I7 D1 H7 P330 T6 _ENV["CC"] => gcc _ENV["COLORFGBG"] => 0;default;15 _ENV["COLORTERM"] => rxvt-xpm _ENV["COMMONPROGRAMFILES"] => C:\\Program Files\\Common Files _ENV["COMPUTERNAME"] => BITLOOK _ENV["COMSPEC"] => C:\\WINNT\\System32\\cmd.exe _ENV["CONTENT_LENGTH"] => _ENV["CONTENT_TYPE"] => _ENV["DISPLAY"] => :0 _ENV["ERROR_START"] => c:\\cygwin\\bin\\dumper.exe _ENV["HOME"] => /home/Administrator _ENV["HOMEDRIVE"] => C: _ENV["HOMEPATH"] => \\ _ENV["LANG"] => zh_CN _ENV["LC_MESSAGES"] => zh_CN _ENV["LOGONSERVER"] => \\\\BITLOOK _ENV["LS_COLORS"] => no=00:fi=00:di=01;34:ln=01;36:pi=40;33:so=01;35:bd=40;33;01:cd=40;33;01:or=01;05;37;41:mi=01;05;37;41:ex=01;32:*.cmd=01;32:*.exe=01;32:*.com=01;32:*.btm=01;32:*.bat=01;32:*.sh=01;32:*.csh=01;32:*.tar=01;31:*.tgz=01;31:*.arj=01;31:*.taz=01;31:*.lzh=01;31:*.zip=01;31:*.z=01;31:*.Z=01;31:*.gz=01;31:*.bz2=01;31:*.bz=01;31:*.tz=01;31:*.rpm=01;31:*.cpio=01;31:*.jpg=01;35:*.gif=01;35:*.bmp=01;35:*.xbm=01;35:*.xpm=01;35:*.png=01;35:*.tif=01;35: _ENV["MAKEFLAGS"] => --unix _ENV["MAKELEVEL"] => 1 _ENV["MAKE_MODE"] => unix _ENV["MANPATH"] => :/usr/ssl/man _ENV["MFLAGS"] => - --unix _ENV["NUMBER_OF_PROCESSORS"] => 1 _ENV["OLDPWD"] => /cygdrive/e/linux _ENV["OS2LIBPATH"] => C:\\WINNT\\System32\\os2\\dll; _ENV["OS"] => Windows_NT _ENV["PATH"] => /bin:/sbin:/usr/bin:/usr/sbin:/usr/local/bin:/usr/local/sbin:/usr/X11R6/bin:~/bin:/c/Program files/BitKeeper _ENV["PATHEXT"] => .COM;.EXE;.BAT;.CMD;.VBS;.VBE;.JS;.JSE;.WSF;.WSH _ENV["PATH_TRANSLATED"] => _ENV["PROCESSOR_ARCHITECTURE"] => x86 _ENV["PROCESSOR_IDENTIFIER"] => x86 Family 6 Model 8 Stepping 3, GenuineIntel _ENV["PROCESSOR_LEVEL"] => 6 _ENV["PROCESSOR_REVISION"] => 0803 _ENV["PROGRAMFILES"] => C:\\Program Files _ENV["PS1"] => [\\u@\\h \\W]\\$ _ENV["PWD"] => /cygdrive/e/linux/php4 _ENV["QUERY_STRING"] => _ENV["REDIRECT_STATUS"] => _ENV["REQUEST_METHOD"] => _ENV["SBPCI"] => D:\\SBPCI _ENV["SCRIPT_FILENAME"] => _ENV["SHELL"] => /bin/sh _ENV["SHLVL"] => 1 _ENV["SYSTEMDRIVE"] => C: _ENV["SYSTEMROOT"] => C:\\WINNT _ENV["TEMP"] => /cygdrive/c/TEMP _ENV["TERM"] => xterm _ENV["TEST_PHP_EXECUTABLE"] => /cygdrive/e/linux/php4/sapi/cli/php.exe _ENV["TEST_PHP_SRCDIR"] => /cygdrive/e/linux/php4 _ENV["TMP"] => /cygdrive/c/TEMP _ENV["USER"] => Administrator _ENV["USERDOMAIN"] => BITLOOK _ENV["USERNAME"] => Administrator _ENV["USERPROFILE"] => C:\\Documents and Settings\\Administrator _ENV["WINDIR"] => C:\\WINNT _ENV["WINDOWID"] => 168035112 _ENV["_"] => /bin/make PHP License This program is free software; you can redistribute it and/or modify it under the terms of the PHP License as published by the PHP Group and included in the distribution in the file: LICENSE This program is distributed in the hope that it will be useful, but WITHOUT ANY WARRANTY; without even the implied warranty of MERCHANTABILITY or FITNESS FOR A PARTICULAR PURPOSE. If you did not receive a copy of the PHP license, or have any questions about PHP licensing, please contact license@php.net.

« previous php.qa (#9720) next »