Test results [failed]

From: Date: Wed, 05 Mar 2003 16:02:59 +0000
Subject: Test results [failed]
Groups: php.qa 
Request: Send a blank email to php-qa+get-9763@lists.php.net to get a copy of this message
===================================================================== FAILED TEST SUMMARY --------------------------------------------------------------------- Bug #22367 (weird zval allocation problem) [tests/lang/bug22367.phpt] Bug #22510 (segfault among complex references) [tests/lang/bug22510.phpt] fopencookie detected and working (or cast mechanism works) [ext/standard/tests/file/fopencookie.phpt] Simple math tests [ext/standard/tests/math/abs.phpt] log() tests [ext/standard/tests/math/log.phpt] Various pow() tests [ext/standard/tests/math/pow.phpt] Simple math tests [ext/standard/tests/math/round.phpt] microtime() function [ext/standard/tests/time/001.phpt] strtotime() function [ext/standard/tests/time/002.phpt] mktime() [ext/standard/tests/time/mktime.phpt] ===================================================================== ===================================================================== TEST RESULT SUMMARY --------------------------------------------------------------------- Exts skipped : 75 Exts tested : 12 --------------------------------------------------------------------- Number of tests : 467 Tests skipped : 229 (49.0%) Tests failed : 10 ( 2.1%) Tests passed : 228 (48.8%) --------------------------------------------------------------------- Time taken : 136 seconds ===================================================================== ================================================================================ /home/meunier/php4-STABLE-200303051030/tests/lang/bug22367.phpt ================================================================================ ---- EXPECTED OUTPUT int(5) bool(false) bool(false) array(5) { [0]=> int(0) [1]=> int(1) [2]=> int(2) [3]=> int(3) [4]=> int(4) } array(5) { [0]=> int(0) [1]=> int(1) [2]=> int(2) [3]=> int(3) [4]=> int(4) } int(2) bool(true) bool(true) array(5) { [0]=> int(0) [1]=> int(1) [2]=> int(2) [3]=> int(3) [4]=> int(4) } array(5) { [0]=> int(0) [1]=> int(1) [2]=> int(2) [3]=> int(3) [4]=> int(4) } ---- ACTUAL OUTPUT int(5) bool(false) bool(false) array(5) { [0]=> int(4) [1]=> int(4) [2]=> int(4) [3]=> int(4) [4]=> int(4) } array(5) { [0]=> int(0) [1]=> int(1) [2]=> int(2) [3]=> int(3) [4]=> int(4) } int(2) bool(true) bool(true) array(5) { [0]=> int(0) [1]=> int(1) [2]=> int(2) [3]=> int(3) [4]=> int(4) } array(5) { [0]=> int(0) [1]=> int(1) [2]=> &int(2) [3]=> int(3) [4]=> int(4) } ---- FAILED ================================================================================ 006- int(0) 006+ int(4) 008- int(1) 008+ int(4) 010- int(2) 010+ int(4) 012- int(3) 012+ int(4) 049- int(2) 049+ &int(2) ================================================================================ ================================================================================ /home/meunier/php4-STABLE-200303051030/tests/lang/bug22510.phpt ================================================================================ ---- EXPECTED OUTPUT ok1 bar::run1 foo::method1 foo::method1 foo::finalize done! ok2 bar::run2 foo::method2 foo::method2 foo::finalize done! ok3 bar::run3 foo::method3 foo::method3 foo::finalize done! ouch bar::run1 foo::method1 foo::method1 foo::finalize I'm alive! ---- ACTUAL OUTPUT ok1 bar::run1 foo::method1 foo::method1 foo::finalize done! ok2 bar::run2 foo::method2 foo::method2 foo::finalize done! ok3 bar::run3 foo::method3 foo::method3 foo::finalize done! ouch bar::run1 foo::method1 foo::method1 foo::finalize ---- FAILED ================================================================================ 024- I'm alive! ================================================================================ ================================================================================ /home/meunier/php4-STABLE-200303051030/ext/standard/tests/file/fopencookie.phpt ================================================================================ ---- EXPECTED OUTPUT If you can read this, it worked ---- ACTUAL OUTPUT Warning: main() [/phpmanual/function.main.html]: userstream::stream_stat is not implemented! in /home/meunier/php4-STABLE-200303051030/ext/standard/tests/file/fopencookie.php on line 79 If you can read this, it worked ---- FAILED ================================================================================ 001- If you can read this, it worked 001+ Warning: main() [/phpmanual/function.main.html]: userstream::stream_stat is not implemented! in /home/meunier/php4-STABLE-200303051030/ext/standard/tests/file/fopencookie.php on line 79 002+ If you can read this, it worked ================================================================================ ================================================================================ /home/meunier/php4-STABLE-200303051030/ext/standard/tests/math/abs.phpt ================================================================================ ---- EXPECTED OUTPUT 1,1,0,0 OK ---- ACTUAL OUTPUT 1,1,1,1 Assert failed: -LONG_MIN+1 === abs(LONG_MIN-1) Left: int(-9223372036854775807) Right: int(9223372036854775807) Assert failed: -LONG_MIN === abs(LONG_MIN) Left: int(-9223372036854775808) Right: float(9.2233720368548E+18) ---- FAILED ================================================================================ 001- 1,1,0,0 001+ 1,1,1,1 002- OK 002+ 003+ Assert failed: 004+ -LONG_MIN+1 === abs(LONG_MIN-1) 005+ Left: int(-9223372036854775807) 006+ Right: int(9223372036854775807) 007+ 008+ Assert failed: 009+ -LONG_MIN === abs(LONG_MIN) 010+ Left: int(-9223372036854775808) 011+ Right: float(9.2233720368548E+18) ================================================================================ ================================================================================ /home/meunier/php4-STABLE-200303051030/ext/standard/tests/math/log.phpt ================================================================================ ---- EXPECTED OUTPUT On failure, please mail result to php-dev@lists.php.net 200 50 50 50 50 50 50 50 50 50 ---- ACTUAL OUTPUT On failure, please mail result to php-dev@lists.php.net ---- FAILED ================================================================================ 002- 200 003- 50 004- 50 005- 50 006- 50 007- 50 008- 50 009- 50 010- 50 011- 50 ================================================================================ ================================================================================ /home/meunier/php4-STABLE-200303051030/ext/standard/tests/math/pow.phpt ================================================================================ ---- EXPECTED OUTPUT 1,1,0,0 On failure, please mail result to php-dev@lists.php.net OK ---- ACTUAL OUTPUT 1,1,1,1 On failure, please mail result to php-dev@lists.php.net ---- FAILED ================================================================================ 001- 1,1,0,0 001+ 1,1,1,1 003- OK ================================================================================ ================================================================================ /home/meunier/php4-STABLE-200303051030/ext/standard/tests/math/round.phpt ================================================================================ ---- EXPECTED OUTPUT 1,1,0,0 OK ---- ACTUAL OUTPUT 1,1,1,1 Assert failed: LONG_MIN-1 ~== round(LONG_MIN - 0.6) Left: int(9223372036854775807) Right: float(-9.2233720368548E+18) Assert failed: LONG_MIN-1 ~== floor(LONG_MIN - 0.5) Left: int(9223372036854775807) Right: float(-9.2233720368548E+18) Assert failed: LONG_MAX+1 ~== ceil(LONG_MAX + 0.5) Left: int(-9223372036854775808) Right: float(9.2233720368548E+18) Assert failed: LONG_MAX+1 ~== round(LONG_MAX + 0.6) Left: int(-9223372036854775808) Right: float(9.2233720368548E+18) ---- FAILED ================================================================================ 001- 1,1,0,0 001+ 1,1,1,1 002- OK 002+ 003+ Assert failed: 004+ LONG_MIN-1 ~== round(LONG_MIN - 0.6) 005+ Left: int(9223372036854775807) 006+ Right: float(-9.2233720368548E+18) 007+ 008+ Assert failed: 009+ LONG_MIN-1 ~== floor(LONG_MIN - 0.5) 010+ Left: int(9223372036854775807) 011+ Right: float(-9.2233720368548E+18) 012+ 013+ Assert failed: 014+ LONG_MAX+1 ~== ceil(LONG_MAX + 0.5) 015+ Left: int(-9223372036854775808) 016+ Right: float(9.2233720368548E+18) 017+ 018+ Assert failed: 019+ LONG_MAX+1 ~== round(LONG_MAX + 0.6) 020+ Left: int(-9223372036854775808) 021+ Right: float(9.2233720368548E+18) ================================================================================ ================================================================================ /home/meunier/php4-STABLE-200303051030/ext/standard/tests/time/001.phpt ================================================================================ ---- EXPECTED OUTPUT Passed: 100000 Failed: 0 ---- ACTUAL OUTPUT Passed: 1822 Failed: 98178 000002: 1046880060 0.97813200 < 1046880060 0.97813200 000003: 1046880060 0.97813200 < 1046880060 0.97813200 000004: 1046880060 0.97813200 < 1046880060 0.97813200 000005: 1046880060 0.97813200 < 1046880060 0.97813200 000006: 1046880060 0.97813200 < 1046880060 0.97813200 000007: 1046880060 0.97813200 < 1046880060 0.97813200 000008: 1046880060 0.97813200 < 1046880060 0.97813200 000009: 1046880060 0.97813200 < 1046880060 0.97813200 000010: 1046880060 0.97813200 < 1046880060 0.97813200 000011: 1046880060 0.97813200 < 1046880060 0.97813200 000012: 1046880060 0.97813200 < 1046880060 0.97813200 ---- FAILED ================================================================================ 001- Passed: 100000 001+ Passed: 1822 002- Failed: 0 002+ Failed: 98178 003+ 000002: 1046880060 0.97813200 < 1046880060 0.97813200 004+ 000003: 1046880060 0.97813200 < 1046880060 0.97813200 005+ 000004: 1046880060 0.97813200 < 1046880060 0.97813200 006+ 000005: 1046880060 0.97813200 < 1046880060 0.97813200 007+ 000006: 1046880060 0.97813200 < 1046880060 0.97813200 008+ 000007: 1046880060 0.97813200 < 1046880060 0.97813200 009+ 000008: 1046880060 0.97813200 < 1046880060 0.97813200 010+ 000009: 1046880060 0.97813200 < 1046880060 0.97813200 011+ 000010: 1046880060 0.97813200 < 1046880060 0.97813200 012+ 000011: 1046880060 0.97813200 < 1046880060 0.97813200 013+ 000012: 1046880060 0.97813200 < 1046880060 0.97813200 ================================================================================ ================================================================================ /home/meunier/php4-STABLE-200303051030/ext/standard/tests/time/002.phpt ================================================================================ ---- EXPECTED OUTPUT 1999-10-13 00:00:00 1999-10-13 00:00:00 2000-01-19 00:00:00 2000-01-19 00:00:00 2001-12-21 00:00:00 2001-12-21 00:00:00 2001-12-21 12:16:00 2001-12-21 12:16:00 1969-12-31 23:59:59 2001-10-22 21:19:58 2001-10-22 23:19:58 2001-10-22 23:32:58 2001-10-22 19:19:58 2001-10-22 19:06:58 1999-10-13 00:00:00 1999-10-13 00:00:00 2000-01-19 00:00:00 2000-01-19 00:00:00 2001-12-21 00:00:00 2001-12-21 00:00:00 2001-12-21 12:16:00 2001-12-21 12:16:00 1970-01-01 00:59:59 2001-10-22 21:19:58 2001-10-23 01:19:58 2001-10-23 01:32:58 2001-10-22 21:19:58 2001-10-22 21:06:58 ---- ACTUAL OUTPUT 1999-10-13 00:00:00 1999-10-13 00:00:00 2000-01-19 00:00:00 2000-01-19 00:00:00 2001-12-21 00:00:00 2001-12-21 00:00:00 2001-12-21 12:16:00 2001-12-21 12:16:00 1970-01-01 00:59:59 2001-10-22 21:19:58 2001-10-23 01:19:58 2001-10-23 01:32:58 2001-10-22 21:19:58 2001-10-22 21:06:58 1999-10-13 00:00:00 1999-10-13 00:00:00 2000-01-19 00:00:00 2000-01-19 00:00:00 2001-12-21 00:00:00 2001-12-21 00:00:00 2001-12-21 12:16:00 2001-12-21 12:16:00 1970-01-01 00:59:59 2001-10-22 21:19:58 2001-10-23 01:19:58 2001-10-23 01:32:58 2001-10-22 21:19:58 2001-10-22 21:06:58 ---- FAILED ================================================================================ 009- 1969-12-31 23:59:59 009+ 1970-01-01 00:59:59 011- 2001-10-22 23:19:58 011+ 2001-10-23 01:19:58 012- 2001-10-22 23:32:58 012+ 2001-10-23 01:32:58 013- 2001-10-22 19:19:58 013+ 2001-10-22 21:19:58 014- 2001-10-22 19:06:58 014+ 2001-10-22 21:06:58 ================================================================================ ================================================================================ /home/meunier/php4-STABLE-200303051030/ext/standard/tests/time/mktime.phpt ================================================================================ ---- EXPECTED OUTPUT int(1009843200) int(1009843200) int(1009843200) int(1009843200) int(1025481600) int(1025481600) int(1025481600) int(1025481600) int(1009839600) int(1009839600) int(1009839600) int(1009836000) int(1025474400) int(1025474400) int(1025478000) int(1025474400) ---- ACTUAL OUTPUT int(1009839600) int(1009839600) int(1009839600) int(1009836000) int(1025474400) int(1025474400) int(1025478000) int(1025474400) int(1009839600) int(1009839600) int(1009839600) int(1009836000) int(1025474400) int(1025474400) int(1025478000) int(1025474400) ---- FAILED ================================================================================ 001- int(1009843200) 001+ int(1009839600) 002- int(1009843200) 002+ int(1009839600) 003- int(1009843200) 003+ int(1009839600) 004- int(1009843200) 004+ int(1009836000) 005- int(1025481600) 005+ int(1025474400) 006- int(1025481600) 006+ int(1025474400) 007- int(1025481600) 007+ int(1025478000) 008- int(1025481600) 008+ int(1025474400) ================================================================================ ================================================================================ BUILD ENVIRONMENT ================================================================================ OS: OSF1 Automake: automake (GNU automake) 1.4 Copyright (C) 1999 Free Software Foundation, Inc. This is free software; see the source for copying conditions. There is NO warranty; not even for MERCHANTABILITY or FITNESS FOR A PARTICULAR PURPOSE. Written by Tom Tromey <tromey@cygnus.com> Autoconf: Autoconf version Libtool: ltmain.sh (GNU libtool) 1.4.3 (1.922.2.110 2002/10/23 01:39:54) Compiler: Compaq C V6.4-014 on Compaq Tru64 UNIX V5.1A (Rev. 1885) Compiler Driver V6.4-215 (sys) cc Driver Bison: bison (GNU Bison) 1.875 Written by Robert Corbett and Richard Stallman. Copyright (C) 2002 Free Software Foundation, Inc. This is free software; see the source for copying conditions. There is NO warranty; not even for MERCHANTABILITY or FITNESS FOR A PARTICULAR PURPOSE. User's E-mail: jean-charles dot meunier at oamp dot fr ================================================================================ PHPINFO ================================================================================ phpinfo() PHP Version => 4.3.2-dev System => OSF1 corots.astrsp-mrs.fr V5.1 1885 alpha Build Date => Mar 5 2003 16:31:08 Configure Command => './configure' '--prefix=/usr/local/php-4.3.1' '--with-apxs2=/usr/local/apache2/bin/apxs' '--with-oci8=/bdd/oracle/OraHome' '--with-mysql=/usr/local/mysql' '--enable-shared' '--with-mm=/opt/apps/Tru64' '--with-freetype-dir=/opt/apps/Tru64' '--enable-freetype-4bit-antialias-hack' '--with-jpeg-dir=/opt/apps/Tru64' '--with-png-dir=/opt/apps/Tru64' '--with-tiff-dir=/opt/apps/Tru64' '--with-zlib=/opt/apps/Tru64' '--with-pdflib=/opt/apps/Tru64' Server API => Command Line Interface Virtual Directory Support => disabled Configuration File (php.ini) Path => /usr/local/php-4.3.1/lib PHP API => 20020918 PHP Extension => 20020429 Zend Extension => 20021010 Debug Build => no Thread Safety => disabled Registered PHP Streams => php, http, ftp, compress.zlib This program makes use of the Zend Scripting Language Engine: Zend Engine v1.3.0, Copyright (c) 1998-2003 Zend Technologies<br /> _______________________________________________________________________ Configuration PHP Core Directive => Local Value => Master Value allow_call_time_pass_reference => On => On allow_url_fopen => On => On always_populate_raw_post_data => Off => Off arg_separator.input => &amp; => &amp; arg_separator.output => &amp; => &amp; asp_tags => Off => Off auto_append_file => no value => no value auto_prepend_file => no value => no value browscap => no value => no value default_charset => no value => no value default_mimetype => text/html => text/html define_syslog_variables => Off => Off disable_classes => no value => no value disable_functions => no value => no value display_errors => On => On display_startup_errors => Off => Off doc_root => no value => no value docref_ext => no value => no value docref_root => http://www.php.net/ => http://www.php.net/ enable_dl => On => On error_append_string => no value => no value error_log => no value => no value error_prepend_string => no value => no value error_reporting => no value => no value expose_php => On => On extension_dir => /usr/local/php-4.3.1/lib/php/extensions/no-debug-non-zts-20020429 => /usr/local/php-4.3.1/lib/php/extensions/no-debug-non-zts-20020429 file_uploads => On => On gpc_order => GPC => GPC highlight.bg => #FFFFFF => #FFFFFF highlight.comment => #FF8000 => #FF8000 highlight.default => #0000BB => #0000BB highlight.html => #000000 => #000000 highlight.keyword => #007700 => #007700 highlight.string => #DD0000 => #DD0000 html_errors => Off => On ignore_repeated_errors => Off => Off ignore_repeated_source => Off => Off ignore_user_abort => Off => Off implicit_flush => On => Off include_path => .:/usr/local/php-4.3.1/lib/php => .:/usr/local/php-4.3.1/lib/php log_errors => Off => Off log_errors_max_len => 1024 => 1024 magic_quotes_gpc => On => On magic_quotes_runtime => Off => Off magic_quotes_sybase => Off => Off max_execution_time => 0 => 30 max_input_time => -1 => -1 open_basedir => no value => no value output_buffering => 0 => 0 output_handler => no value => no value post_max_size => 8M => 8M precision => 14 => 14 register_argc_argv => On => On register_globals => Off => Off report_memleaks => On => On safe_mode => Off => Off safe_mode_exec_dir => no value => no value safe_mode_gid => Off => Off safe_mode_include_dir => no value => no value sendmail_from => no value => no value sendmail_path => /usr/sbin/sendmail -t -i => /usr/sbin/sendmail -t -i short_open_tag => On => On SMTP => localhost => localhost smtp_port => 25 => 25 sql.safe_mode => Off => Off track_errors => Off => Off unserialize_callback_func => no value => no value upload_max_filesize => 2M => 2M upload_tmp_dir => no value => no value user_dir => no value => no value variables_order => no value => no value xmlrpc_error_number => 0 => 0 xmlrpc_errors => Off => Off y2k_compliance => On => On ctype ctype functions => enabled mysql MySQL Support => enabled Active Persistent Links => 0 Active Links => 0 Client API version => 3.23.55 MYSQL_MODULE_TYPE => external MYSQL_SOCKET => /tmp/mysql.sock MYSQL_INCLUDE => -I/usr/local/mysql/include/mysql MYSQL_LIBS => -L/usr/local/mysql/lib/mysql -lmysqlclient Directive => Local Value => Master Value mysql.allow_persistent => On => On mysql.connect_timeout => -1 => -1 mysql.default_host => no value => no value mysql.default_password => no value => no value mysql.default_port => no value => no value mysql.default_socket => no value => no value mysql.default_user => no value => no value mysql.max_links => Unlimited => Unlimited mysql.max_persistent => Unlimited => Unlimited mysql.trace_mode => Off => Off oci8 OCI8 Support => enabled Revision => $Revision: 1.183.2.2 $ Oracle Version => 8.1 Compile-time ORACLE_HOME => /bdd/oracle/OraHome Libraries Used => overload User-Space Object Overloading Support => enabled pcre PCRE (Perl Compatible Regular Expressions) Support => enabled PCRE Library Version => 3.92 11-Sep-2002 pdf PDF Support => enabled PDFlib GmbH Version => 4.0.2 Revision => $Revision: 1.112.2.4 $ posix Revision => $Revision: 1.51.2.1 $ session Session Support => enabled Registered save handlers => files user mm Directive => Local Value => Master Value session.auto_start => Off => Off session.bug_compat_42 => On => On session.bug_compat_warn => On => On session.cache_expire => 180 => 180 session.cache_limiter => nocache => nocache session.cookie_domain => no value => no value session.cookie_lifetime => 0 => 0 session.cookie_path => / => / session.cookie_secure => Off => Off session.entropy_file => no value => no value session.entropy_length => 0 => 0 session.gc_dividend => 100 => 100 session.gc_maxlifetime => 1440 => 1440 session.gc_probability => 1 => 1 session.name => PHPSESSID => PHPSESSID session.referer_check => no value => no value session.save_handler => files => files session.save_path => /tmp => /tmp session.serialize_handler => php => php session.use_cookies => On => On session.use_only_cookies => Off => Off session.use_trans_sid => Off => Off standard Regex Library => Bundled library enabled Dynamic Library Support => enabled Path to sendmail => /usr/sbin/sendmail -t -i Directive => Local Value => Master Value assert.active => 1 => 1 assert.bail => 0 => 0 assert.callback => no value => no value assert.quiet_eval => 0 => 0 assert.warning => 1 => 1 auto_detect_line_endings => 0 => 0 default_socket_timeout => 60 => 60 safe_mode_allowed_env_vars => PHP_ => PHP_ safe_mode_protected_env_vars => LD_LIBRARY_PATH => LD_LIBRARY_PATH url_rewriter.tags => a=href,area=href,frame=src,form=,fieldset= => a=href,area=href,frame=src,form=,fieldset= user_agent => no value => no value tokenizer Tokenizer Support => enabled xml XML Support => active XML Namespace Support => active EXPAT Version => 1.95.2 zlib ZLib Support => enabled Compiled Version => 1.1.4 Linked Version => 1.1.4 Directive => Local Value => Master Value zlib.output_compression => Off => Off zlib.output_compression_level => -1 => -1 zlib.output_handler => no value => no value Additional Modules Module Name Environment Variable => Value MANPATH => /opt/apps/Tru64/man:/opt/apps/Tru64/teTeX/man:/usr/share/man:/usr/dt/share/man:/usr/local/man QUERY_STRING => VISUAL => emacs PATH => /opt/apps/Tru64/bin:/opt/apps/Tru64/bin/X11:/opt/apps/Tru64/teTeX/bin:/usr/bin:/usr/bin/X11:/usr/sbin:.:/bdd/oracle/OraHome/bin SCRIPT_FILENAME => CONTENT_TYPE => LM_LICENSE_FILE => /opt/apps/rsi/license/license.dat LOGNAME => meunier REDIRECT_STATUS => MAKEFLAGS => MIDASHOME => /opt/apps/midas ORACLE_SID => corot REQUEST_METHOD => USER => meunier PATH_TRANSLATED => MIDVERS => 01FEB-Tru64 CC => /usr/bin/cc CONTENT_LENGTH => DISPLAY => lasa49:0 MAKELEVEL => 1 TEST_PHP_EXECUTABLE => /home/meunier/php4-STABLE-200303051030/sapi/cli/php SHELL => /bin/ksh GS_LIB => /opt/apps/Tru64/lib/ghostscript/6.0/lib:/opt/apps/Tru64/lib/ghostscript/fonts IDL_DIR => /opt/apps/rsi/idl_5.6 HOME => /home/meunier RSI_DIR => /opt/apps/rsi TEST_PHP_SRCDIR => /home/meunier/php4-STABLE-200303051030 TERM => dtterm LD_LIBRARY_PATH => /bdd/oracle/OraHome/lib:/usr/local/mysql/lib/mysql:/opt/apps/Tru64/lib:/usr/shlib ORACLE_HOME => /bdd/oracle/OraHome MFLAGS => PWD => /home/meunier/php4-STABLE-200303051030 XFIGLIBDIR => /opt/apps/Tru64/lib/X11/xfig GS_FONTPATH => /opt/apps/Tru64/lib/ghostscript/fonts PHP Variables Variable => Value _SERVER["MANPATH"] => /opt/apps/Tru64/man:/opt/apps/Tru64/teTeX/man:/usr/share/man:/usr/dt/share/man:/usr/local/man _SERVER["QUERY_STRING"] => _SERVER["VISUAL"] => emacs _SERVER["PATH"] => /opt/apps/Tru64/bin:/opt/apps/Tru64/bin/X11:/opt/apps/Tru64/teTeX/bin:/usr/bin:/usr/bin/X11:/usr/sbin:.:/bdd/oracle/OraHome/bin _SERVER["SCRIPT_FILENAME"] => _SERVER["CONTENT_TYPE"] => _SERVER["LM_LICENSE_FILE"] => /opt/apps/rsi/license/license.dat _SERVER["LOGNAME"] => meunier _SERVER["REDIRECT_STATUS"] => _SERVER["MAKEFLAGS"] => _SERVER["MIDASHOME"] => /opt/apps/midas _SERVER["ORACLE_SID"] => corot _SERVER["REQUEST_METHOD"] => _SERVER["USER"] => meunier _SERVER["PATH_TRANSLATED"] => _SERVER["MIDVERS"] => 01FEB-Tru64 _SERVER["CC"] => /usr/bin/cc _SERVER["CONTENT_LENGTH"] => _SERVER["DISPLAY"] => lasa49:0 _SERVER["MAKELEVEL"] => 1 _SERVER["TEST_PHP_EXECUTABLE"] => /home/meunier/php4-STABLE-200303051030/sapi/cli/php _SERVER["SHELL"] => /bin/ksh _SERVER["GS_LIB"] => /opt/apps/Tru64/lib/ghostscript/6.0/lib:/opt/apps/Tru64/lib/ghostscript/fonts _SERVER["IDL_DIR"] => /opt/apps/rsi/idl_5.6 _SERVER["HOME"] => /home/meunier _SERVER["RSI_DIR"] => /opt/apps/rsi _SERVER["TEST_PHP_SRCDIR"] => /home/meunier/php4-STABLE-200303051030 _SERVER["TERM"] => dtterm _SERVER["LD_LIBRARY_PATH"] => /bdd/oracle/OraHome/lib:/usr/local/mysql/lib/mysql:/opt/apps/Tru64/lib:/usr/shlib _SERVER["ORACLE_HOME"] => /bdd/oracle/OraHome _SERVER["MFLAGS"] => _SERVER["PWD"] => /home/meunier/php4-STABLE-200303051030 _SERVER["XFIGLIBDIR"] => /opt/apps/Tru64/lib/X11/xfig _SERVER["GS_FONTPATH"] => /opt/apps/Tru64/lib/ghostscript/fonts _SERVER["PHP_SELF"] => _SERVER["SCRIPT_NAME"] => _SERVER["DOCUMENT_ROOT"] => _SERVER["argv"] => Array ( ) _SERVER["argc"] => 0 _ENV["MANPATH"] => /opt/apps/Tru64/man:/opt/apps/Tru64/teTeX/man:/usr/share/man:/usr/dt/share/man:/usr/local/man _ENV["QUERY_STRING"] => _ENV["VISUAL"] => emacs _ENV["PATH"] => /opt/apps/Tru64/bin:/opt/apps/Tru64/bin/X11:/opt/apps/Tru64/teTeX/bin:/usr/bin:/usr/bin/X11:/usr/sbin:.:/bdd/oracle/OraHome/bin _ENV["SCRIPT_FILENAME"] => _ENV["CONTENT_TYPE"] => _ENV["LM_LICENSE_FILE"] => /opt/apps/rsi/license/license.dat _ENV["LOGNAME"] => meunier _ENV["REDIRECT_STATUS"] => _ENV["MAKEFLAGS"] => _ENV["MIDASHOME"] => /opt/apps/midas _ENV["ORACLE_SID"] => corot _ENV["REQUEST_METHOD"] => _ENV["USER"] => meunier _ENV["PATH_TRANSLATED"] => _ENV["MIDVERS"] => 01FEB-Tru64 _ENV["CC"] => /usr/bin/cc _ENV["CONTENT_LENGTH"] => _ENV["DISPLAY"] => lasa49:0 _ENV["MAKELEVEL"] => 1 _ENV["TEST_PHP_EXECUTABLE"] => /home/meunier/php4-STABLE-200303051030/sapi/cli/php _ENV["SHELL"] => /bin/ksh _ENV["GS_LIB"] => /opt/apps/Tru64/lib/ghostscript/6.0/lib:/opt/apps/Tru64/lib/ghostscript/fonts _ENV["IDL_DIR"] => /opt/apps/rsi/idl_5.6 _ENV["HOME"] => /home/meunier _ENV["RSI_DIR"] => /opt/apps/rsi _ENV["TEST_PHP_SRCDIR"] => /home/meunier/php4-STABLE-200303051030 _ENV["TERM"] => dtterm _ENV["LD_LIBRARY_PATH"] => /bdd/oracle/OraHome/lib:/usr/local/mysql/lib/mysql:/opt/apps/Tru64/lib:/usr/shlib _ENV["ORACLE_HOME"] => /bdd/oracle/OraHome _ENV["MFLAGS"] => _ENV["PWD"] => /home/meunier/php4-STABLE-200303051030 _ENV["XFIGLIBDIR"] => /opt/apps/Tru64/lib/X11/xfig _ENV["GS_FONTPATH"] => /opt/apps/Tru64/lib/ghostscript/fonts PHP License This program is free software; you can redistribute it and/or modify it under the terms of the PHP License as published by the PHP Group and included in the distribution in the file: LICENSE This program is distributed in the hope that it will be useful, but WITHOUT ANY WARRANTY; without even the implied warranty of MERCHANTABILITY or FITNESS FOR A PARTICULAR PURPOSE. If you did not receive a copy of the PHP license, or have any questions about PHP licensing, please contact license@php.net.

« previous php.qa (#9763) next »