Test results [failed]

From: Date: Wed, 05 Mar 2003 16:27:58 +0000
Subject: Test results [failed]
Groups: php.qa 
Request: Send a blank email to php-qa+get-9765@lists.php.net to get a copy of this message
===================================================================== FAILED TEST SUMMARY --------------------------------------------------------------------- OpenSSL private key functions [ext/openssl/tests/001.phpt] Bug #21131: fopen($filename, "a+") has broken position [ext/standard/tests/file/bug21131.phpt] strtotime() function [ext/standard/tests/time/002.phpt] ===================================================================== ===================================================================== TEST RESULT SUMMARY --------------------------------------------------------------------- Exts skipped : 74 Exts tested : 14 --------------------------------------------------------------------- Number of tests : 443 Tests skipped : 222 (50.1%) Tests failed : 3 ( 0.7%) Tests passed : 218 (49.2%) --------------------------------------------------------------------- Time taken : 812 seconds ===================================================================== ================================================================================ /root/src/php-4.3.1/ext/openssl/tests/001.phpt ================================================================================ ---- EXPECTED OUTPUT Creating private key Export key to file Load key from file - array syntax Load key using direct syntax Load key manually and use string syntax OK! ---- ACTUAL OUTPUT Creating private key Warning: openssl_pkey_new() [/phpmanual/function.openssl-pkey-new.html]: unable to load random state; not enough random data! in /root/src/php-4.3.1/ext/openssl/tests/001.php on line 13 failed to create private key ---- FAILED ================================================================================ 002- Export key to file 002+ 003- Load key from file - array syntax 003+ Warning: openssl_pkey_new() [/phpmanual/function.openssl-pkey-new.html]: unable to load random state; not enough random data! in /root/src/php-4.3.1/ext/openssl/tests/001.php on line 13 004- Load key using direct syntax 004+ failed to create private key 005- Load key manually and use string syntax 006- OK! ================================================================================ ================================================================================ /root/src/php-4.3.1/ext/standard/tests/file/bug21131.phpt ================================================================================ ---- EXPECTED OUTPUT int(6) int(0) foobar ---- ACTUAL OUTPUT int(0) int(0) foobar ---- FAILED ================================================================================ 001- int(6) 001+ int(0) ================================================================================ ================================================================================ /root/src/php-4.3.1/ext/standard/tests/time/002.phpt ================================================================================ ---- EXPECTED OUTPUT 1999-10-13 00:00:00 1999-10-13 00:00:00 2000-01-19 00:00:00 2000-01-19 00:00:00 2001-12-21 00:00:00 2001-12-21 00:00:00 2001-12-21 12:16:00 2001-12-21 12:16:00 1969-12-31 23:59:59 2001-10-22 21:19:58 2001-10-22 23:19:58 2001-10-22 23:32:58 2001-10-22 19:19:58 2001-10-22 19:06:58 1999-10-13 00:00:00 1999-10-13 00:00:00 2000-01-19 00:00:00 2000-01-19 00:00:00 2001-12-21 00:00:00 2001-12-21 00:00:00 2001-12-21 12:16:00 2001-12-21 12:16:00 1970-01-01 00:59:59 2001-10-22 21:19:58 2001-10-23 01:19:58 2001-10-23 01:32:58 2001-10-22 21:19:58 2001-10-22 21:06:58 ---- ACTUAL OUTPUT 1999-10-13 00:00:00 1999-10-13 00:00:00 2000-01-19 00:00:00 2000-01-19 00:00:00 2001-12-21 00:00:00 2001-12-21 00:00:00 2001-12-21 12:16:00 2001-12-21 12:16:00 1969-12-31 23:59:59 2001-10-22 21:19:58 2001-10-22 23:19:58 2001-10-22 23:32:58 2001-10-22 19:19:58 2001-10-22 19:06:58 1999-10-13 00:00:00 1999-10-13 00:00:00 2000-01-19 00:00:00 2000-01-19 00:00:00 2001-12-21 00:00:00 2001-12-21 00:00:00 2001-12-21 12:16:00 2001-12-21 12:16:00 1969-12-31 23:59:59 2001-10-22 21:19:58 2001-10-22 23:19:58 2001-10-22 23:32:58 2001-10-22 19:19:58 2001-10-22 19:06:58 ---- FAILED ================================================================================ 023- 1970-01-01 00:59:59 023+ 1969-12-31 23:59:59 025- 2001-10-23 01:19:58 025+ 2001-10-22 23:19:58 026- 2001-10-23 01:32:58 026+ 2001-10-22 23:32:58 027- 2001-10-22 21:19:58 027+ 2001-10-22 19:19:58 028- 2001-10-22 21:06:58 028+ 2001-10-22 19:06:58 ================================================================================ ================================================================================ BUILD ENVIRONMENT ================================================================================ OS: SunOS Automake: automake (GNU automake) 1.4 Copyright (C) 1999 Free Software Foundation, Inc. This is free software; see the source for copying conditions. There is NO warranty; not even for MERCHANTABILITY or FITNESS FOR A PARTICULAR PURPOSE. Written by Tom Tromey <tromey@cygnus.com> Autoconf: Autoconf version 2.13 Libtool: ltmain.sh (GNU libtool) 1.4.2 (1.922.2.53 2001/09/11 03:18:52) Compiler: Reading specs from /opt/sfw/lib/gcc-lib/sparc-sun-solaris2.8/2.95.3/specs gcc version 2.95.3 20010315 (release) Bison: GNU Bison version 1.28 User's E-mail: dcours at scsnet dot csc dot com ================================================================================ PHPINFO ================================================================================ phpinfo() PHP Version => 4.3.1 System => SunOS d01web 5.8 Generic_108528-14 sun4u Build Date => Mar 5 2003 10:24:25 Configure Command => './configure' '--prefix=/opt/local' '--with-pear' '--with-apxs=/opt/local/apache/bin/apxs' '--with-openssl=/opt/local/openssl' '--with-zlib' '--with-oci8' '--enable-apc' '--enable-track-vars' '--with-gd=/opt/local/gd' '--enable-gd-native-ttf' '--with-jpeg-dir=/opt/sfw' '--with-png-dir=/opt/sfw' '--with-ttf' '--with-mcrypt=/opt/local/libmcrypt' '--with-mm=/opt/local/mm' '--enable-memory-limit' '--enable-shared' Server API => Command Line Interface Virtual Directory Support => disabled Configuration File (php.ini) Path => /opt/local/lib PHP API => 20020918 PHP Extension => 20020429 Zend Extension => 20021010 Debug Build => no Thread Safety => disabled Registered PHP Streams => php, http, ftp, https, ftps, compress.zlib This program makes use of the Zend Scripting Language Engine: Zend Engine v1.3.0, Copyright (c) 1998-2002 Zend Technologies _______________________________________________________________________ Configuration PHP Core Directive => Local Value => Master Value allow_call_time_pass_reference => On => On allow_url_fopen => On => On always_populate_raw_post_data => Off => Off arg_separator.input => &amp; => &amp; arg_separator.output => &amp; => &amp; asp_tags => Off => Off auto_append_file => no value => no value auto_prepend_file => no value => no value browscap => no value => no value default_charset => no value => no value default_mimetype => text/html => text/html define_syslog_variables => Off => Off disable_functions => no value => no value display_errors => On => On display_startup_errors => Off => Off doc_root => no value => no value docref_ext => no value => no value docref_root => http://www.php.net/ => http://www.php.net/ enable_dl => On => On error_append_string => no value => no value error_log => no value => no value error_prepend_string => no value => no value error_reporting => no value => no value expose_php => On => On extension_dir => /opt/local/lib/php/extensions/no-debug-non-zts-20020429 => /opt/local/lib/php/extensions/no-debug-non-zts-20020429 file_uploads => On => On gpc_order => GPC => GPC highlight.bg => #FFFFFF => #FFFFFF highlight.comment => #FF8000 => #FF8000 highlight.default => #0000BB => #0000BB highlight.html => #000000 => #000000 highlight.keyword => #007700 => #007700 highlight.string => #DD0000 => #DD0000 html_errors => Off => On ignore_repeated_errors => Off => Off ignore_repeated_source => Off => Off ignore_user_abort => Off => Off implicit_flush => On => Off include_path => .:/opt/local/lib/php => .:/opt/local/lib/php log_errors => Off => Off log_errors_max_len => 1024 => 1024 magic_quotes_gpc => On => On magic_quotes_runtime => Off => Off magic_quotes_sybase => Off => Off max_execution_time => 0 => 30 max_input_time => -1 => -1 memory_limit => 8M => 8M open_basedir => no value => no value output_buffering => 0 => 0 output_handler => no value => no value post_max_size => 8M => 8M precision => 14 => 14 register_argc_argv => On => On register_globals => Off => Off report_memleaks => On => On safe_mode => Off => Off safe_mode_exec_dir => 1 => 1 safe_mode_gid => Off => Off safe_mode_include_dir => no value => no value sendmail_from => no value => no value sendmail_path => /usr/lib/sendmail -t -i => /usr/lib/sendmail -t -i short_open_tag => On => On SMTP => localhost => localhost smtp_port => 25 => 25 sql.safe_mode => Off => Off track_errors => Off => Off unserialize_callback_func => no value => no value upload_max_filesize => 2M => 2M upload_tmp_dir => no value => no value user_dir => no value => no value variables_order => no value => no value xmlrpc_error_number => 0 => 0 xmlrpc_errors => Off => Off y2k_compliance => On => On ctype ctype functions => enabled gd GD Support => enabled GD Version => 1.6.2 or higher JPG Support => enabled PNG Support => enabled WBMP Support => enabled mcrypt mcrypt support => enabled version => >= 2.4.x Supported ciphers => twofish rijndael-128 rijndael-192 rijndael-256 saferplus rc2 xtea serpent safer-sk64 safer-sk128 cast-256 loki97 gost threeway cast-128 blowfish des blowfish-compat tripledes enigma arcfour panama wake Supported modes => ofb cfb nofb cbc ecb stream ncfb Directive => Local Value => Master Value mcrypt.algorithms_dir => no value => no value mcrypt.modes_dir => no value => no value mysql MySQL Support => enabled Active Persistent Links => 0 Active Links => 0 Client API version => 3.23.49 MYSQL_MODULE_TYPE => builtin MYSQL_SOCKET => /tmp/mysql.sock MYSQL_INCLUDE => MYSQL_LIBS => Directive => Local Value => Master Value mysql.allow_persistent => On => On mysql.connect_timeout => -1 => -1 mysql.default_host => no value => no value mysql.default_password => no value => no value mysql.default_port => no value => no value mysql.default_socket => no value => no value mysql.default_user => no value => no value mysql.max_links => Unlimited => Unlimited mysql.max_persistent => Unlimited => Unlimited mysql.trace_mode => Off => Off oci8 OCI8 Support => enabled Revision => $Revision: 1.183 $ Oracle Version => 8.1 Compile-time ORACLE_HOME => /opt/oracle/product/8.1.7 Libraries Used => openssl OpenSSL support => enabled OpenSSL Version => OpenSSL 0.9.7a Feb 19 2003 overload User-Space Object Overloading Support => enabled pcre PCRE (Perl Compatible Regular Expressions) Support => enabled PCRE Library Version => 3.92 11-Sep-2002 posix Revision => $Revision: 1.51 $ session Session Support => enabled Registered save handlers => files user mm Directive => Local Value => Master Value session.auto_start => Off => Off session.bug_compat_42 => On => On session.bug_compat_warn => On => On session.cache_expire => 180 => 180 session.cache_limiter => nocache => nocache session.cookie_domain => no value => no value session.cookie_lifetime => 0 => 0 session.cookie_path => / => / session.cookie_secure => Off => Off session.entropy_file => no value => no value session.entropy_length => 0 => 0 session.gc_dividend => 100 => 100 session.gc_maxlifetime => 1440 => 1440 session.gc_probability => 1 => 1 session.name => PHPSESSID => PHPSESSID session.referer_check => no value => no value session.save_handler => files => files session.save_path => /tmp => /tmp session.serialize_handler => php => php session.use_cookies => On => On session.use_only_cookies => Off => Off session.use_trans_sid => Off => Off standard Regex Library => Bundled library enabled Dynamic Library Support => enabled Path to sendmail => /usr/lib/sendmail -t -i Directive => Local Value => Master Value assert.active => 1 => 1 assert.bail => 0 => 0 assert.callback => no value => no value assert.quiet_eval => 0 => 0 assert.warning => 1 => 1 auto_detect_line_endings => 0 => 0 default_socket_timeout => 60 => 60 safe_mode_allowed_env_vars => PHP_ => PHP_ safe_mode_protected_env_vars => LD_LIBRARY_PATH => LD_LIBRARY_PATH url_rewriter.tags => a=href,area=href,frame=src,form=,fieldset= => a=href,area=href,frame=src,form=,fieldset= user_agent => no value => no value tokenizer Tokenizer Support => enabled xml XML Support => active XML Namespace Support => active EXPAT Version => 1.95.2 zlib ZLib Support => enabled Compiled Version => 1.1.3 Linked Version => 1.1.3 Directive => Local Value => Master Value zlib.output_compression => Off => Off zlib.output_compression_level => -1 => -1 zlib.output_handler => no value => no value Additional Modules Module Name Environment Variable => Value CC => gcc CONTENT_LENGTH => CONTENT_TYPE => CVSROOT => /cvsroot CVSUMASK => 007 HOME => / HOSTNAME => d01web HOSTTYPE => sparc HZ => 100 LD_LIBRARY_PATH => /usr/lib:/usr/local/lib:/opt/sfw/lib:/usr/ucb/lib:/usr/ccs/lib:/usr/dt/lib:/usr/openwin/lib:/opt/oracle/product/8.1.7/lib LOGNAME => root MACHTYPE => sparc-sun-solaris MAKEFLAGS => MAKELEVEL => 1 MANPATH => /usr/man:/usr/openwin/man:/usr/dt/man:/opt/sfw/man:/usr/java/man:/usr/perl/man:/usr/apache/man:/usr/j2se/man:/usr/local/man:/opt/local/man OLDPWD => /root/src ORACLE_BASE => /opt/oracle ORACLE_HOME => /opt/oracle/product/8.1.7 OSTYPE => solaris PATH => /bin:/usr/openwin/bin:/usr/dt/bin:/usr/ccs/bin:/opt/sfw/bin:/opt/local/bin:/usr/java/bin:/usr/java/jre/bin:/usr/j2se/bin:/opt/oracle/product/8.1.7/bin:/usr/xpg4/bin:/usr/ucb:/usr/local/bin:/sbin:/usr/sbin:/opt/sfw/sbin:/sbin:/usr/sbin:/opt/sfw/sbin PATH_TRANSLATED => PWD => /root/src/php-4.3.1 QUERY_STRING => REDIRECT_STATUS => REQUEST_METHOD => SCRIPT_FILENAME => SGS_SUPPORT => libmakestate.so.1 SHELL => /sbin/sh SHLVL => 1 TERM => xterm TEST_PHP_EXECUTABLE => /root/src/php-4.3.1/sapi/cli/php TEST_PHP_SRCDIR => /root/src/php-4.3.1 TZ => US/Eastern VIRTUAL_ROOT => / _ => /usr/ccs/bin/make PHP Variables Variable => Value _SERVER["CC"] => gcc _SERVER["CONTENT_LENGTH"] => _SERVER["CONTENT_TYPE"] => _SERVER["CVSROOT"] => /cvsroot _SERVER["CVSUMASK"] => 007 _SERVER["HOME"] => / _SERVER["HOSTNAME"] => d01web _SERVER["HOSTTYPE"] => sparc _SERVER["HZ"] => 100 _SERVER["LD_LIBRARY_PATH"] => /usr/lib:/usr/local/lib:/opt/sfw/lib:/usr/ucb/lib:/usr/ccs/lib:/usr/dt/lib:/usr/openwin/lib:/opt/oracle/product/8.1.7/lib _SERVER["LOGNAME"] => root _SERVER["MACHTYPE"] => sparc-sun-solaris _SERVER["MAKEFLAGS"] => _SERVER["MAKELEVEL"] => 1 _SERVER["MANPATH"] => /usr/man:/usr/openwin/man:/usr/dt/man:/opt/sfw/man:/usr/java/man:/usr/perl/man:/usr/apache/man:/usr/j2se/man:/usr/local/man:/opt/local/man _SERVER["OLDPWD"] => /root/src _SERVER["ORACLE_BASE"] => /opt/oracle _SERVER["ORACLE_HOME"] => /opt/oracle/product/8.1.7 _SERVER["OSTYPE"] => solaris _SERVER["PATH"] => /bin:/usr/openwin/bin:/usr/dt/bin:/usr/ccs/bin:/opt/sfw/bin:/opt/local/bin:/usr/java/bin:/usr/java/jre/bin:/usr/j2se/bin:/opt/oracle/product/8.1.7/bin:/usr/xpg4/bin:/usr/ucb:/usr/local/bin:/sbin:/usr/sbin:/opt/sfw/sbin:/sbin:/usr/sbin:/opt/sfw/sbin _SERVER["PATH_TRANSLATED"] => _SERVER["PWD"] => /root/src/php-4.3.1 _SERVER["QUERY_STRING"] => _SERVER["REDIRECT_STATUS"] => _SERVER["REQUEST_METHOD"] => _SERVER["SCRIPT_FILENAME"] => _SERVER["SGS_SUPPORT"] => libmakestate.so.1 _SERVER["SHELL"] => /sbin/sh _SERVER["SHLVL"] => 1 _SERVER["TERM"] => xterm _SERVER["TEST_PHP_EXECUTABLE"] => /root/src/php-4.3.1/sapi/cli/php _SERVER["TEST_PHP_SRCDIR"] => /root/src/php-4.3.1 _SERVER["TZ"] => US/Eastern _SERVER["VIRTUAL_ROOT"] => / _SERVER["_"] => /usr/ccs/bin/make _SERVER["PHP_SELF"] => _SERVER["SCRIPT_NAME"] => _SERVER["DOCUMENT_ROOT"] => _SERVER["argv"] => Array ( ) _SERVER["argc"] => 0 _ENV["CC"] => gcc _ENV["CONTENT_LENGTH"] => _ENV["CONTENT_TYPE"] => _ENV["CVSROOT"] => /cvsroot _ENV["CVSUMASK"] => 007 _ENV["HOME"] => / _ENV["HOSTNAME"] => d01web _ENV["HOSTTYPE"] => sparc _ENV["HZ"] => 100 _ENV["LD_LIBRARY_PATH"] => /usr/lib:/usr/local/lib:/opt/sfw/lib:/usr/ucb/lib:/usr/ccs/lib:/usr/dt/lib:/usr/openwin/lib:/opt/oracle/product/8.1.7/lib _ENV["LOGNAME"] => root _ENV["MACHTYPE"] => sparc-sun-solaris _ENV["MAKEFLAGS"] => _ENV["MAKELEVEL"] => 1 _ENV["MANPATH"] => /usr/man:/usr/openwin/man:/usr/dt/man:/opt/sfw/man:/usr/java/man:/usr/perl/man:/usr/apache/man:/usr/j2se/man:/usr/local/man:/opt/local/man _ENV["OLDPWD"] => /root/src _ENV["ORACLE_BASE"] => /opt/oracle _ENV["ORACLE_HOME"] => /opt/oracle/product/8.1.7 _ENV["OSTYPE"] => solaris _ENV["PATH"] => /bin:/usr/openwin/bin:/usr/dt/bin:/usr/ccs/bin:/opt/sfw/bin:/opt/local/bin:/usr/java/bin:/usr/java/jre/bin:/usr/j2se/bin:/opt/oracle/product/8.1.7/bin:/usr/xpg4/bin:/usr/ucb:/usr/local/bin:/sbin:/usr/sbin:/opt/sfw/sbin:/sbin:/usr/sbin:/opt/sfw/sbin _ENV["PATH_TRANSLATED"] => _ENV["PWD"] => /root/src/php-4.3.1 _ENV["QUERY_STRING"] => _ENV["REDIRECT_STATUS"] => _ENV["REQUEST_METHOD"] => _ENV["SCRIPT_FILENAME"] => _ENV["SGS_SUPPORT"] => libmakestate.so.1 _ENV["SHELL"] => /sbin/sh _ENV["SHLVL"] => 1 _ENV["TERM"] => xterm _ENV["TEST_PHP_EXECUTABLE"] => /root/src/php-4.3.1/sapi/cli/php _ENV["TEST_PHP_SRCDIR"] => /root/src/php-4.3.1 _ENV["TZ"] => US/Eastern _ENV["VIRTUAL_ROOT"] => / _ENV["_"] => /usr/ccs/bin/make PHP License This program is free software; you can redistribute it and/or modify it under the terms of the PHP License as published by the PHP Group and included in the distribution in the file: LICENSE This program is distributed in the hope that it will be useful, but WITHOUT ANY WARRANTY; without even the implied warranty of MERCHANTABILITY or FITNESS FOR A PARTICULAR PURPOSE. If you did not receive a copy of the PHP license, or have any questions about PHP licensing, please contact license@php.net.

« previous php.qa (#9765) next »