Test results [failed]

From: Date: Wed, 05 Mar 2003 19:47:44 +0000
Subject: Test results [failed]
Groups: php.qa 
Request: Send a blank email to php-qa+get-9769@lists.php.net to get a copy of this message
===================================================================== FAILED TEST SUMMARY --------------------------------------------------------------------- Testing $argc and $argv handling (cli) [tests/basic/012.phpt] $this in constructor test [tests/lang/030.phpt] Locale settings affecting float parsing [tests/lang/034.phpt] Bug #21094 (set_error_handler not accepting methods) [tests/lang/bug21094.phpt] Bug #21800 (Segfault under interactive mode) [tests/lang/bug21800.phpt] Bug #22367 (weird zval allocation problem) [tests/lang/bug22367.phpt] session object deserialization [ext/session/tests/003.phpt] session_set_save_handler test [ext/session/tests/004.phpt] custom save handler, multiple session_start()s, complex data structure test. [ext/session/tests/005.phpt] aggregating everything [ext/standard/tests/aggregation/aggregate.phpt] aggregating all methods [ext/standard/tests/aggregation/aggregate_methods.phpt] aggregating methods specified in the list [ext/standard/tests/aggregation/aggregate_methods_by_list.phpt] aggregating methods matching regular expression [ext/standard/tests/aggregation/aggregate_methods_by_regexp.phpt] User-space filters [ext/standard/tests/file/userfilters.phpt] User-space streams [ext/standard/tests/file/userstreams.phpt] basic stream filter tests [ext/standard/tests/filters/basic.phpt] getopt [ext/standard/tests/general_functions/getopt.phpt] date_sunrise() and date_sunset() functions [ext/standard/tests/general_functions/sunfuncts.phpt] serialize()/unserialize()/var_dump() [ext/standard/tests/serialize/001.phpt] Check for mktime with out-of-range parameters [ext/standard/tests/time/003.phpt] mktime() [ext/standard/tests/time/mktime.phpt] ===================================================================== ===================================================================== TEST RESULT SUMMARY --------------------------------------------------------------------- Exts skipped : 79 Exts tested : 8 --------------------------------------------------------------------- Number of tests : 604 Tests skipped : 302 (50.0%) Tests failed : 21 ( 3.5%) Tests passed : 281 (46.5%) --------------------------------------------------------------------- Time taken : 150 seconds ===================================================================== ================================================================================ /Users/jkburt/src/php/php5/tests/basic/012.phpt ================================================================================ ---- EXPECTED OUTPUT 0: ab 1: cd 2: ef 3: 123 4: test ---- ACTUAL OUTPUT Notice: Undefined variable: _SERVER in /Users/jkburt/src/php/php5/tests/basic/012.php on line 4 Notice: Undefined variable: _SERVER in /Users/jkburt/src/php/php5/tests/basic/012.php on line 5 ---- FAILED ================================================================================ 001- 0: ab 001+ Notice: Undefined variable: _SERVER in /Users/jkburt/src/php/php5/tests/basic/012.php on line 4 002- 1: cd 002+ 003- 2: ef 003+ Notice: Undefined variable: _SERVER in /Users/jkburt/src/php/php5/tests/basic/012.php on line 5 004- 3: 123 005- 4: test ================================================================================ ================================================================================ /Users/jkburt/src/php/php5/tests/lang/030.phpt ================================================================================ ---- EXPECTED OUTPUT success ---- ACTUAL OUTPUT Notice: Undefined variable: List in /Users/jkburt/src/php/php5/tests/lang/030.php on line 22 Fatal error: Call to a member function echoName() on a non-object in /Users/jkburt/src/php/php5/tests/lang/030.php on line 22 ---- FAILED ================================================================================ 001- success 001+ Notice: Undefined variable: List in /Users/jkburt/src/php/php5/tests/lang/030.php on line 22 002+ 003+ Fatal error: Call to a member function echoName() on a non-object in /Users/jkburt/src/php/php5/tests/lang/030.php on line 22 ================================================================================ ================================================================================ /Users/jkburt/src/php/php5/tests/lang/034.phpt ================================================================================ ---- EXPECTED OUTPUT 3,14 ---- ACTUAL OUTPUT 3.14 ---- FAILED ================================================================================ 001- 3,14 001+ 3.14 ================================================================================ ================================================================================ /Users/jkburt/src/php/php5/tests/lang/bug21094.phpt ================================================================================ ---- EXPECTED OUTPUT [1024] errstr: test, errfile: %s, errline: %d ---- ACTUAL OUTPUT Notice: Array to string conversion in /Users/jkburt/src/php/php5/tests/lang/bug21094.php on line 8 Notice: test in /Users/jkburt/src/php/php5/tests/lang/bug21094.php on line 10 ---- FAILED ================================================================================ 001- [1024] errstr: test, errfile: %s, errline: %d 001+ Notice: Array to string conversion in /Users/jkburt/src/php/php5/tests/lang/bug21094.php on line 8 002+ 003+ Notice: test in /Users/jkburt/src/php/php5/tests/lang/bug21094.php on line 10 ================================================================================ ================================================================================ /Users/jkburt/src/php/php5/tests/lang/bug21800.phpt ================================================================================ ---- EXPECTED OUTPUT Interactive mode enabled :test: ---- ACTUAL OUTPUT Notice: Undefined variable: _ENV in /Users/jkburt/src/php/php5/tests/lang/bug21800.php on line 2 sh: -a: command not found ---- FAILED ================================================================================ 001- Interactive mode enabled 001+ Notice: Undefined variable: _ENV in /Users/jkburt/src/php/php5/tests/lang/bug21800.php on line 2 002- 002+ sh: -a: command not found 003- :test: ================================================================================ ================================================================================ /Users/jkburt/src/php/php5/tests/lang/bug22367.phpt ================================================================================ ---- EXPECTED OUTPUT int(5) bool(false) bool(false) array(5) { [0]=> int(0) [1]=> int(1) [2]=> int(2) [3]=> int(3) [4]=> int(4) } array(5) { [0]=> int(0) [1]=> int(1) [2]=> int(2) [3]=> int(3) [4]=> int(4) } int(2) bool(true) bool(true) array(5) { [0]=> int(0) [1]=> int(1) [2]=> int(2) [3]=> int(3) [4]=> int(4) } array(5) { [0]=> int(0) [1]=> int(1) [2]=> int(2) [3]=> int(3) [4]=> int(4) } ---- ACTUAL OUTPUT int(5) bool(false) bool(false) array(5) { [0]=> int(4) [1]=> int(4) [2]=> int(4) [3]=> int(4) [4]=> int(4) } array(5) { [0]=> int(0) [1]=> int(1) [2]=> int(2) [3]=> int(3) [4]=> int(4) } int(2) bool(true) bool(true) array(5) { [0]=> int(0) [1]=> int(1) [2]=> int(2) [3]=> int(3) [4]=> int(4) } array(5) { [0]=> int(0) [1]=> int(1) [2]=> &int(2) [3]=> int(3) [4]=> int(4) } ---- FAILED ================================================================================ 006- int(0) 006+ int(4) 008- int(1) 008+ int(4) 010- int(2) 010+ int(4) 012- int(3) 012+ int(4) 049- int(2) 049+ &int(2) ================================================================================ ================================================================================ /Users/jkburt/src/php/php5/ext/session/tests/003.phpt ================================================================================ ---- EXPECTED OUTPUT object(foo)(2) { ["bar"]=> string(2) "ok" ["yes"]=> int(2) } array(1) { [3]=> &object(foo)(2) { ["bar"]=> string(2) "ok" ["yes"]=> int(2) } } ---- ACTUAL OUTPUT object(foo)(2) { ["bar"]=> string(2) "ok" ["yes"]=> int(2) } array(1) { [3]=> object(foo)(2) { ["bar"]=> string(2) "ok" ["yes"]=> int(2) } } ---- FAILED ================================================================================ 009- &object(foo)(2) { 009+ object(foo)(2) { ================================================================================ ================================================================================ /Users/jkburt/src/php/php5/ext/session/tests/004.phpt ================================================================================ ---- EXPECTED OUTPUT OPEN: PHPSESSID READ: abtest object(foo)(2) { ["bar"]=> string(2) "ok" ["yes"]=> int(2) } array(1) { [3]=> &object(foo)(2) { ["bar"]=> string(2) "ok" ["yes"]=> int(2) } } WRITE: abtest, baz|O:3:"foo":2:{s:3:"bar";s:2:"ok";s:3:"yes";i:2;}arr|a:1:{i:3;O:3:"foo":2:{s:3:"bar";s:2:"ok";s:3:"yes";i:2;}} OPEN: PHPSESSID READ: abtest object(foo)(2) { ["bar"]=> string(2) "ok" ["yes"]=> int(2) } array(1) { [3]=> object(foo)(2) { ["bar"]=> string(2) "ok" ["yes"]=> int(2) } } DESTROY: abtest ---- ACTUAL OUTPUT OPEN: PHPSESSID READ: abtest Notice: Undefined variable: GLOBALS in /Users/jkburt/src/php/php5/ext/session/tests/004.php on line 18 Notice: Trying to get property of non-object in /Users/jkburt/src/php/php5/ext/session/tests/004.php on line 18 Notice: Undefined variable: baz in /Users/jkburt/src/php/php5/ext/session/tests/004.php on line 48 Fatal error: Call to a member function method() on a non-object in /Users/jkburt/src/php/php5/ext/session/tests/004.php on line 48 WRITE: abtest, Notice: Creating default object from empty value in /Users/jkburt/src/php/php5/ext/session/tests/004.php on line 24 ---- FAILED ================================================================================ 003- object(foo)(2) { 003+ 004- ["bar"]=> 004+ Notice: Undefined variable: GLOBALS in /Users/jkburt/src/php/php5/ext/session/tests/004.php on line 18 005- string(2) "ok" 005+ 006- ["yes"]=> 006+ Notice: Trying to get property of non-object in /Users/jkburt/src/php/php5/ext/session/tests/004.php on line 18 007- int(2) 007+ 008- } 008+ Notice: Undefined variable: baz in /Users/jkburt/src/php/php5/ext/session/tests/004.php on line 48 009- array(1) { 009+ 010- [3]=> 010+ Fatal error: Call to a member function method() on a non-object in /Users/jkburt/src/php/php5/ext/session/tests/004.php on line 48 011- &object(foo)(2) { 011+ WRITE: abtest, 012- ["bar"]=> 012+ 013- string(2) "ok" 013+ Notice: Creating default object from empty value in /Users/jkburt/src/php/php5/ext/session/tests/004.php on line 24 014- ["yes"]=> 015- int(2) 016- } 017- } 018- WRITE: abtest, baz|O:3:"foo":2:{s:3:"bar";s:2:"ok";s:3:"yes";i:2;}arr|a:1:{i:3;O:3:"foo":2:{s:3:"bar";s:2:"ok";s:3:"yes";i:2;}} 019- OPEN: PHPSESSID 020- READ: abtest 021- object(foo)(2) { 022- ["bar"]=> 023- string(2) "ok" 024- ["yes"]=> 025- int(2) 026- } 027- array(1) { 028- [3]=> 029- object(foo)(2) { 030- ["bar"]=> 031- string(2) "ok" 032- ["yes"]=> 033- int(2) 034- } 035- } 036- DESTROY: abtest ================================================================================ ================================================================================ /Users/jkburt/src/php/php5/ext/session/tests/005.phpt ================================================================================ ---- EXPECTED OUTPUT OPEN: PHPSESSID READ: abtest object(foo)(2) { ["bar"]=> string(2) "ok" ["yes"]=> int(2) } array(1) { [3]=> &object(foo)(2) { ["bar"]=> string(2) "ok" ["yes"]=> int(2) } } WRITE: abtest, baz|O:3:"foo":2:{s:3:"bar";s:2:"ok";s:3:"yes";i:2;}arr|a:1:{i:3;O:3:"foo":2:{s:3:"bar";s:2:"ok";s:3:"yes";i:2;}} CLOSE OPEN: PHPSESSID READ: abtest object(foo)(2) { ["bar"]=> string(2) "ok" ["yes"]=> int(3) } array(1) { [3]=> &object(foo)(2) { ["bar"]=> string(2) "ok" ["yes"]=> int(3) } } int(123) WRITE: abtest, baz|O:3:"foo":2:{s:3:"bar";s:2:"ok";s:3:"yes";i:3;}arr|a:1:{i:3;O:3:"foo":2:{s:3:"bar";s:2:"ok";s:3:"yes";i:3;}}c|i:123; CLOSE OPEN: PHPSESSID READ: abtest object(foo)(2) { ["bar"]=> string(2) "ok" ["yes"]=> int(3) } array(1) { [3]=> object(foo)(2) { ["bar"]=> string(2) "ok" ["yes"]=> int(3) } } int(123) DESTROY: abtest CLOSE ---- ACTUAL OUTPUT OPEN: PHPSESSID READ: abtest Notice: Undefined variable: GLOBALS in /Users/jkburt/src/php/php5/ext/session/tests/005.php on line 20 Notice: Trying to get property of non-object in /Users/jkburt/src/php/php5/ext/session/tests/005.php on line 20 Notice: Undefined variable: baz in /Users/jkburt/src/php/php5/ext/session/tests/005.php on line 50 Fatal error: Call to a member function method() on a non-object in /Users/jkburt/src/php/php5/ext/session/tests/005.php on line 50 WRITE: abtest, Notice: Creating default object from empty value in /Users/jkburt/src/php/php5/ext/session/tests/005.php on line 26 CLOSE ---- FAILED ================================================================================ 003- object(foo)(2) { 003+ 004- ["bar"]=> 004+ Notice: Undefined variable: GLOBALS in /Users/jkburt/src/php/php5/ext/session/tests/005.php on line 20 005- string(2) "ok" 005+ 006- ["yes"]=> 006+ Notice: Trying to get property of non-object in /Users/jkburt/src/php/php5/ext/session/tests/005.php on line 20 007- int(2) 007+ 008- } 008+ Notice: Undefined variable: baz in /Users/jkburt/src/php/php5/ext/session/tests/005.php on line 50 009- array(1) { 009+ 010- [3]=> 010+ Fatal error: Call to a member function method() on a non-object in /Users/jkburt/src/php/php5/ext/session/tests/005.php on line 50 011- &object(foo)(2) { 011+ WRITE: abtest, 012- ["bar"]=> 012+ 013- string(2) "ok" 013+ Notice: Creating default object from empty value in /Users/jkburt/src/php/php5/ext/session/tests/005.php on line 26 014- ["yes"]=> 014+ CLOSE 015- int(2) 016- } 017- } 018- WRITE: abtest, baz|O:3:"foo":2:{s:3:"bar";s:2:"ok";s:3:"yes";i:2;}arr|a:1:{i:3;O:3:"foo":2:{s:3:"bar";s:2:"ok";s:3:"yes";i:2;}} 019- CLOSE 020- OPEN: PHPSESSID 021- READ: abtest 022- object(foo)(2) { 023- ["bar"]=> 024- string(2) "ok" 025- ["yes"]=> 026- int(3) 027- } 028- array(1) { 029- [3]=> 030- &object(foo)(2) { 031- ["bar"]=> 032- string(2) "ok" 033- ["yes"]=> 034- int(3) 035- } 036- } 037- int(123) 038- WRITE: abtest, baz|O:3:"foo":2:{s:3:"bar";s:2:"ok";s:3:"yes";i:3;}arr|a:1:{i:3;O:3:"foo":2:{s:3:"bar";s:2:"ok";s:3:"yes";i:3;}}c|i:123; 039- CLOSE 040- OPEN: PHPSESSID 041- READ: abtest 042- object(foo)(2) { 043- ["bar"]=> 044- string(2) "ok" 045- ["yes"]=> 046- int(3) 047- } 048- array(1) { 049- [3]=> 050- object(foo)(2) { 051- ["bar"]=> 052- string(2) "ok" 053- ["yes"]=> 054- int(3) 055- } 056- } 057- int(123) 058- DESTROY: abtest 059- CLOSE ================================================================================ ================================================================================ /Users/jkburt/src/php/php5/ext/standard/tests/aggregation/aggregate.phpt ================================================================================ ---- EXPECTED OUTPUT I'm alive! I'm helping! I'm aggregating! **** ---- ACTUAL OUTPUT I'm alive! Fatal error: Call to undefined method simple::do_this() in /Users/jkburt/src/php/php5/ext/standard/tests/aggregation/aggregate.php on line 7 ---- FAILED ================================================================================ 002- I'm helping! 002+ 003- I'm aggregating! 003+ Fatal error: Call to undefined method simple::do_this() in /Users/jkburt/src/php/php5/ext/standard/tests/aggregation/aggregate.php on line 7 004- **** ================================================================================ ================================================================================ /Users/jkburt/src/php/php5/ext/standard/tests/aggregation/aggregate_methods.phpt ================================================================================ ---- EXPECTED OUTPUT I'm alive! mixing 100 simple,mix_it simple_prop mixing ---- ACTUAL OUTPUT I'm alive! Fatal error: Call to undefined method simple::mix_it() in /Users/jkburt/src/php/php5/ext/standard/tests/aggregation/aggregate_methods.php on line 6 ---- FAILED ================================================================================ 002- mixing 002+ 003- 100 003+ Fatal error: Call to undefined method simple::mix_it() in /Users/jkburt/src/php/php5/ext/standard/tests/aggregation/aggregate_methods.php on line 6 004- simple,mix_it 005- simple_prop 006- mixing ================================================================================ ================================================================================ /Users/jkburt/src/php/php5/ext/standard/tests/aggregation/aggregate_methods_by_list.phpt ================================================================================ ---- EXPECTED OUTPUT I'm alive! simple,just_another_method I'm alive! simple,do_this,do_that yep, that's me ---- ACTUAL OUTPUT I'm alive! simple I'm alive! simple Fatal error: Call to undefined method simple::just_another_method() in /Users/jkburt/src/php/php5/ext/standard/tests/aggregation/aggregate_methods_by_list.php on line 10 ---- FAILED ================================================================================ 002- simple,just_another_method 002+ simple 004- simple,do_this,do_that 004+ simple 005- yep, that's me 005+ 006+ Fatal error: Call to undefined method simple::just_another_method() in /Users/jkburt/src/php/php5/ext/standard/tests/aggregation/aggregate_methods_by_list.php on line 10 ================================================================================ ================================================================================ /Users/jkburt/src/php/php5/ext/standard/tests/aggregation/aggregate_methods_by_regexp.phpt ================================================================================ ---- EXPECTED OUTPUT I'm alive! simple,do_this,do_that I'm alive! simple,just_another_method ---- ACTUAL OUTPUT I'm alive! simple I'm alive! simple ---- FAILED ================================================================================ 002- simple,do_this,do_that 002+ simple 004- simple,just_another_method 004+ simple ================================================================================ ================================================================================ /Users/jkburt/src/php/php5/ext/standard/tests/file/userfilters.phpt ================================================================================ ---- EXPECTED OUTPUT bool(true) oncreate: string(16) "string.uppercase" NULL bool(true) read: read: string(11) "HELLO THERE" flush: onclose: ---- ACTUAL OUTPUT bool(true) oncreate: string(16) "string.uppercase" NULL oncreate: string(16) "string.uppercase" NULL bool(true) bool(false) onclose: onclose: ---- FAILED ================================================================================ 005- bool(true) 005+ oncreate: 006- read: 006+ string(16) "string.uppercase" 007- read: 007+ NULL 008- string(11) "HELLO THERE" 008+ bool(true) 009- flush: 009+ bool(false) 011+ onclose: ================================================================================ ================================================================================ /Users/jkburt/src/php/php5/ext/standard/tests/file/userstreams.phpt ================================================================================ ---- EXPECTED OUTPUT Not Registered Registered Registered SEEK: OK FGETS: OK int(0) ...and the road becomes my bride ---- ACTUAL OUTPUT Not Registered Registered Registered Notice: Undefined variable: GLOBALS in /Users/jkburt/src/php/php5/ext/standard/tests/file/userstreams.php on line 127 Notice: Undefined variable: GLOBALS in /Users/jkburt/src/php/php5/ext/standard/tests/file/userstreams.php on line 127 Notice: Undefined variable: GLOBALS in /Users/jkburt/src/php/php5/ext/standard/tests/file/userstreams.php on line 108 Notice: Undefined variable: GLOBALS in /Users/jkburt/src/php/php5/ext/standard/tests/file/userstreams.php on line 120 Notice: Undefined variable: GLOBALS in /Users/jkburt/src/php/php5/ext/standard/tests/file/userstreams.php on line 127 --[0] whence=SEEK_SET offset=0 line_length=1024 position_should_be=0 -- REAL: pos=(0,0,0) ret=0 line[33]=`...naq gur ebnq orpbzrf zl oevqr ' USER: pos=(0,0,0) ret=0 line[0]=`' ###################################### FAIL! array(7) { ["wrapper_data"]=> &object(mystream)(5) { ["path"]=> string(11) "test://DATA" ["mode"]=> string(2) "rb" ["options"]=> int(4) ["position"]=> int(0) ["varname"]=> string(4) "DATA" } ["wrapper_type"]=> string(10) "user-space" ["stream_type"]=> string(10) "user-space" ["unread_bytes"]=> int(0) ["timed_out"]=> bool(false) ["blocked"]=> bool(true) ["eof"]=> bool(false) } SEEK: FAIL Notice: Undefined variable: GLOBALS in /Users/jkburt/src/php/php5/ext/standard/tests/file/userstreams.php on line 127 SEEK: positions do not match! Notice: Undefined variable: GLOBALS in /Users/jkburt/src/php/php5/ext/standard/tests/file/userstreams.php on line 108 Notice: Undefined variable: GLOBALS in /Users/jkburt/src/php/php5/ext/standard/tests/file/userstreams.php on line 120 FGETS: FAIL iter=0 user= [pos=0] real=...and the road becomes my bride [pos=16308] Notice: Undefined variable: GLOBALS in /Users/jkburt/src/php/php5/ext/standard/tests/file/userstreams.php on line 99 Notice: Undefined variable: GLOBALS in /Users/jkburt/src/php/php5/ext/standard/tests/file/userstreams.php on line 127 int(0) Notice: Undefined variable: GLOBALS in /Users/jkburt/src/php/php5/ext/standard/tests/file/userstreams.php on line 108 Notice: Undefined variable: GLOBALS in /Users/jkburt/src/php/php5/ext/standard/tests/file/userstreams.php on line 120 ---- FAILED ================================================================================ 004- SEEK: OK 004+ 005- FGETS: OK 005+ Notice: Undefined variable: GLOBALS in /Users/jkburt/src/php/php5/ext/standard/tests/file/userstreams.php on line 127 006- int(0) 006+ 007- ...and the road becomes my bride 007+ Notice: Undefined variable: GLOBALS in /Users/jkburt/src/php/php5/ext/standard/tests/file/userstreams.php on line 127 008+ 009+ Notice: Undefined variable: GLOBALS in /Users/jkburt/src/php/php5/ext/standard/tests/file/userstreams.php on line 108 010+ 011+ Notice: Undefined variable: GLOBALS in /Users/jkburt/src/php/php5/ext/standard/tests/file/userstreams.php on line 120 012+ 013+ Notice: Undefined variable: GLOBALS in /Users/jkburt/src/php/php5/ext/standard/tests/file/userstreams.php on line 127 014+ 015+ --[0] whence=SEEK_SET offset=0 line_length=1024 position_should_be=0 -- 016+ REAL: pos=(0,0,0) ret=0 line[33]=`...naq gur ebnq orpbzrf zl oevqr 017+ ' 018+ USER: pos=(0,0,0) ret=0 line[0]=`' 019+ ###################################### FAIL! 020+ array(7) { 021+ ["wrapper_data"]=> 022+ &object(mystream)(5) { 023+ ["path"]=> 024+ string(11) "test://DATA" 025+ ["mode"]=> 026+ string(2) "rb" 027+ ["options"]=> 028+ int(4) 029+ ["position"]=> 030+ int(0) 031+ ["varname"]=> 032+ string(4) "DATA" 033+ } 034+ ["wrapper_type"]=> 035+ string(10) "user-space" 036+ ["stream_type"]=> 037+ string(10) "user-space" 038+ ["unread_bytes"]=> 039+ int(0) 040+ ["timed_out"]=> 041+ bool(false) 042+ ["blocked"]=> 043+ bool(true) 044+ ["eof"]=> 045+ bool(false) 046+ } 047+ SEEK: FAIL 048+ 049+ Notice: Undefined variable: GLOBALS in /Users/jkburt/src/php/php5/ext/standard/tests/file/userstreams.php on line 127 050+ SEEK: positions do not match! 051+ 052+ Notice: Undefined variable: GLOBALS in /Users/jkburt/src/php/php5/ext/standard/tests/file/userstreams.php on line 108 053+ 054+ Notice: Undefined variable: GLOBALS in /Users/jkburt/src/php/php5/ext/standard/tests/file/userstreams.php on line 120 055+ FGETS: FAIL 056+ iter=0 user= [pos=0] 057+ real=...and the road becomes my bride 058+ [pos=16308] 059+ 060+ Notice: Undefined variable: GLOBALS in /Users/jkburt/src/php/php5/ext/standard/tests/file/userstreams.php on line 99 061+ 062+ Notice: Undefined variable: GLOBALS in /Users/jkburt/src/php/php5/ext/standard/tests/file/userstreams.php on line 127 063+ int(0) 064+ 065+ Notice: Undefined variable: GLOBALS in /Users/jkburt/src/php/php5/ext/standard/tests/file/userstreams.php on line 108 066+ 067+ Notice: Undefined variable: GLOBALS in /Users/jkburt/src/php/php5/ext/standard/tests/file/userstreams.php on line 120 ================================================================================ ================================================================================ /Users/jkburt/src/php/php5/ext/standard/tests/filters/basic.phpt ================================================================================ ---- EXPECTED OUTPUT filter: string.rot13 bool(true) string(12) "Uryyb Gurer!" filter: string.toupper bool(true) string(12) "HELLO THERE!" filter: string.tolower bool(true) string(12) "hello there!" filter: string.rot13 bool(true) filter: string.toupper bool(true) string(12) "URYYB GURER!" ---- ACTUAL OUTPUT Notice: Undefined variable: GLOBALS in /Users/jkburt/src/php/php5/ext/standard/tests/filters/basic.php on line 10 filter: string.rot13 bool(true) bool(false) Notice: Undefined variable: GLOBALS in /Users/jkburt/src/php/php5/ext/standard/tests/filters/basic.php on line 10 filter: string.toupper bool(true) bool(false) Notice: Undefined variable: GLOBALS in /Users/jkburt/src/php/php5/ext/standard/tests/filters/basic.php on line 10 filter: string.tolower bool(true) bool(false) Notice: Undefined variable: GLOBALS in /Users/jkburt/src/php/php5/ext/standard/tests/filters/basic.php on line 10 filter: string.rot13 bool(true) filter: string.toupper bool(true) bool(false) ---- FAILED ================================================================================ 001- filter: string.rot13 001+ Notice: Undefined variable: GLOBALS in /Users/jkburt/src/php/php5/ext/standard/tests/filters/basic.php on line 10 002- bool(true) 002+ filter: string.rot13 003- string(12) "Uryyb Gurer!" 003+ bool(true) 004- filter: string.toupper 004+ bool(false) 005- bool(true) 005+ 006- string(12) "HELLO THERE!" 006+ Notice: Undefined variable: GLOBALS in /Users/jkburt/src/php/php5/ext/standard/tests/filters/basic.php on line 10 007- filter: string.tolower 007+ filter: string.toupper 009- string(12) "hello there!" 009+ bool(false) 010- filter: string.rot13 010+ 011- bool(true) 011+ Notice: Undefined variable: GLOBALS in /Users/jkburt/src/php/php5/ext/standard/tests/filters/basic.php on line 10 012- filter: string.toupper 012+ filter: string.tolower 014- string(12) "URYYB GURER!" 014+ bool(false) 015+ 016+ Notice: Undefined variable: GLOBALS in /Users/jkburt/src/php/php5/ext/standard/tests/filters/basic.php on line 10 017+ filter: string.rot13 018+ bool(true) 019+ filter: string.toupper 020+ bool(true) 021+ bool(false) ================================================================================ ================================================================================ /Users/jkburt/src/php/php5/ext/standard/tests/general_functions/getopt.phpt ================================================================================ ---- EXPECTED OUTPUT array(5) { ["v"]=> bool(false) ["h"]=> bool(false) ["d"]=> string(4) "test" ["m"]=> string(4) "1234" ["t"]=> bool(false) } ---- ACTUAL OUTPUT ---- FAILED ================================================================================ 001- array(5) { 001+ 002- ["v"]=> 003- bool(false) 004- ["h"]=> 005- bool(false) 006- ["d"]=> 007- string(4) "test" 008- ["m"]=> 009- string(4) "1234" 010- ["t"]=> 011- bool(false) 012- } ================================================================================ ================================================================================ /Users/jkburt/src/php/php5/ext/standard/tests/general_functions/sunfuncts.phpt ================================================================================ ---- EXPECTED OUTPUT 1041293199 06:39 6.6524557618962 1041293806 16:46 16.769374867459 1043971592 06:32 6.5453702926602 1043972233 17:13 17.217524708736 1046390766 06:06 6.1156526756851 1046391456 17:36 17.6108549623 1049069128 05:28 5.4727420290691 1049069878 17:58 17.972552584375 1051661094 04:54 4.9012299828593 1051661898 18:18 18.313688769483 1054339474 04:34 4.5744292894498 1054340319 18:39 18.656400943241 1056931476 04:36 4.6161204505189 1056932328 18:48 18.808871657766 1059609894 04:54 4.9068825098365 1059610715 18:35 18.599286002028 1062288314 05:14 5.2368895570738 1062289083 18:03 18.060541787879 1064880332 05:32 5.542366581139 1064881044 17:24 17.411505614917 1067558754 05:54 5.9162088420581 1067559410 16:50 16.833698570628 1070150780 06:20 6.3462215520697 1070151395 16:35 16.583589055537 ---- ACTUAL OUTPUT 1041293199 06:39 6.6524557618962 1041293806 16:46 16.769374867459 1043971592 06:32 6.5453702926602 1043972233 17:13 17.217524708736 1046390766 06:06 6.1156526756851 1046391456 17:36 17.6108549623 1049069128 05:28 5.4727420290691 1049069878 17:58 17.972552584375 1051661094 04:54 4.9012299828593 1051661898 18:18 18.313688769483 1054339474 04:34 4.5744292894498 1054340319 18:39 18.656400943241 1056931476 04:36 4.6161204505189 1056932328 18:48 18.808871657766 1059609894 04:54 4.9068825098364 1059610715 18:35 18.599286002028 1062288314 05:14 5.2368895570738 1062289083 18:03 18.060541787879 1064880332 05:32 5.542366581139 1064881044 17:24 17.411505614917 1067558754 05:54 5.9162088420581 1067559410 16:50 16.833698570628 1070150780 06:20 6.3462215520697 1070151395 16:35 16.583589055537 ---- FAILED ================================================================================ 015- 1059609894 04:54 4.9068825098365 015+ 1059609894 04:54 4.9068825098364 ================================================================================ ================================================================================ /Users/jkburt/src/php/php5/ext/standard/tests/serialize/001.phpt ================================================================================ ---- EXPECTED OUTPUT N; b:1; b:0; i:1; i:0; i:-1; i:2147483647; i:-2147483647; d:1.123456789; d:1; d:0; d:-1; d:-1.123456789; s:5:"hallo"; a:6:{i:0;i:1;i:1;d:1.1;i:2;s:5:"hallo";i:3;N;i:4;b:1;i:5;a:0:{}} O:1:"t":1:{s:1:"a";s:5:"hallo";} object(t)(1) { ["a"]=> string(5) "hallo" } __sleep called O:1:"s":2:{s:1:"a";s:5:"hallo";s:1:"c";s:5:"world";} __wakeup called object(s)(2) { ["a"]=> string(5) "hallo" ["c"]=> string(5) "world" } array(2) { ["a"]=> &string(4) "test" ["b"]=> &string(4) "test" } a:2:{s:1:"a";s:4:"test";s:1:"b";R:2;} array(2) { ["a"]=> &string(4) "test" ["b"]=> &string(4) "test" } ---- ACTUAL OUTPUT N; b:1; b:0; i:1; i:0; i:-1; i:2147483647; i:-2147483647; d:1.123456789; d:1; d:0; d:-1; d:-1.123456789; s:5:"hallo"; a:6:{i:0;i:1;i:1;d:1.1;i:2;s:5:"hallo";i:3;N;i:4;b:1;i:5;a:0:{}} O:1:"t":1:{s:1:"a";s:5:"hallo";} object(t)(1) { ["a"]=> string(5) "hallo" } __sleep called O:1:"s":2:{s:1:"a";s:5:"hallo";s:1:"c";s:5:"world";} __wakeup called object(s)(3) { ["a"]=> string(5) "hallo" ["b"]=> NULL ["c"]=> string(5) "world" } array(2) { ["a"]=> &string(4) "test" ["b"]=> &string(4) "test" } a:2:{s:1:"a";s:4:"test";s:1:"b";R:2;} array(2) { ["a"]=> &string(4) "test" ["b"]=> &string(4) "test" } ---- FAILED ================================================================================ 024- object(s)(2) { 024+ object(s)(3) { 027- ["c"]=> 027+ ["b"]=> 028- string(5) "world" 028+ NULL 029- } 029+ ["c"]=> 030- array(2) { 030+ string(5) "world" 031- ["a"]=> 031+ } 032- &string(4) "test" 032+ array(2) { 033- ["b"]=> 033+ ["a"]=> 035- } 035+ ["b"]=> 036- a:2:{s:1:"a";s:4:"test";s:1:"b";R:2;} 036+ &string(4) "test" 037- array(2) { 037+ } 038- ["a"]=> 038+ a:2:{s:1:"a";s:4:"test";s:1:"b";R:2;} 039- &string(4) "test" 039+ array(2) { 040- ["b"]=> 040+ ["a"]=> 042- } 042+ ["b"]=> 043+ &string(4) "test" 044+ } ================================================================================ ================================================================================ /Users/jkburt/src/php/php5/ext/standard/tests/time/003.phpt ================================================================================ ---- EXPECTED OUTPUT 2000-02-29 2000-02-28 2000-02-29 2001-02-28 2001-03-01 1999-11-30 2000-05-29 12:00:00 2000-05-29 13:00:00 2000-05-29 12:00:00 2000-01-31 12:00:00 2000-01-31 12:00:00 2000-01-31 11:00:00 2000-04-29 12:00:00 2000-04-29 13:00:00 2000-04-29 12:00:00 ---- ACTUAL OUTPUT 2000-02-29 2000-02-28 2000-02-29 2001-02-28 2001-03-01 1999-11-30 2000-05-29 12:00:00 2000-05-29 12:00:00 1969-12-31 23:58:58 2000-01-31 12:00:00 2000-01-31 12:00:00 1969-10-01 23:58:58 2000-04-29 12:00:00 2000-04-29 12:00:00 1969-12-29 23:58:58 ---- FAILED ================================================================================ 008- 2000-05-29 13:00:00 008+ 2000-05-29 12:00:00 009- 2000-05-29 12:00:00 009+ 1969-12-31 23:58:58 012- 2000-01-31 11:00:00 012+ 1969-10-01 23:58:58 014- 2000-04-29 13:00:00 014+ 2000-04-29 12:00:00 015- 2000-04-29 12:00:00 015+ 1969-12-29 23:58:58 ================================================================================ ================================================================================ /Users/jkburt/src/php/php5/ext/standard/tests/time/mktime.phpt ================================================================================ ---- EXPECTED OUTPUT int(1009843200) int(1009843200) int(1009843200) int(1009843200) int(1025481600) int(1025481600) int(1025481600) int(1025481600) int(1009839600) int(1009839600) int(1009839600) int(1009836000) int(1025474400) int(1025474400) int(1025478000) int(1025474400) ---- ACTUAL OUTPUT int(1009843200) int(1009843200) int(1009843200) int(-3662) int(1025481600) int(1025481600) int(1025481600) int(-3662) int(1009843200) int(1009843200) int(1009843200) int(-3662) int(1025481600) int(1025481600) int(1025481600) int(-3662) ---- FAILED ================================================================================ 004- int(1009843200) 004+ int(-3662) 008- int(1025481600) 008+ int(-3662) 009- int(1009839600) 009+ int(1009843200) 010- int(1009839600) 010+ int(1009843200) 011- int(1009839600) 011+ int(1009843200) 012- int(1009836000) 012+ int(-3662) 013- int(1025474400) 013+ int(1025481600) 014- int(1025474400) 014+ int(1025481600) 015- int(1025478000) 015+ int(1025481600) 016- int(1025474400) 016+ int(-3662) ================================================================================ ================================================================================ BUILD ENVIRONMENT ================================================================================ OS: Darwin Automake: automake (GNU automake) 1.6.1 Written by Tom Tromey <tromey@redhat.com>. Copyright 2002 Free Software Foundation, Inc. This is free software; see the source for copying conditions. There is NO warranty; not even for MERCHANTABILITY or FITNESS FOR A PARTICULAR PURPOSE. Autoconf: autoconf (GNU Autoconf) 2.52 Written by David J. MacKenzie. Copyright 1992, 1993, 1994, 1996, 1999, 2000, 2001 Free Software Foundation, Inc. This is free software; see the source for copying conditions. There is NO warranty; not even for MERCHANTABILITY or FITNESS FOR A PARTICULAR PURPOSE. Libtool: ltmain.sh (GNU libtool) 1.4.3 (1.922.2.110 2002/10/23 01:39:54) Compiler: Reading specs from /usr/libexec/gcc/darwin/ppc/3.1/specs Thread model: posix Apple Computer, Inc. GCC version 1151, based on gcc version 3.1 20020420 (prerelease) Bison: GNU Bison version 1.28 User's E-mail: jkb4 at cornell dot edu ================================================================================ PHPINFO ================================================================================ phpinfo() PHP Version => 5.0.0-dev System => Darwin Wintermelon.local. 6.4 Darwin Kernel Version 6.4: Wed Jan 29 18:50:42 PST 2003; root:xnu/xnu-344.26.obj~1/RELEASE_PPC Power Macintosh Build Date => Mar 5 2003 13:29:03 Configure Command => './configure' '--enable-force-cgi-redirect' Server API => Command Line Interface Virtual Directory Support => disabled Configuration File (php.ini) Path => /usr/local/lib PHP API => 20020918 PHP Extension => 20020429 Zend Extension => 90021012 Debug Build => no Thread Safety => disabled Registered PHP Streams => php, http, ftp This program makes use of the Zend Scripting Language Engine: Zend Engine v2.0.0-dev, Copyright (c) 1998-2003 Zend Technologies<br /> _______________________________________________________________________ Configuration PHP Core Directive => Local Value => Master Value allow_call_time_pass_reference => On => On allow_url_fopen => On => On always_populate_raw_post_data => Off => Off arg_separator.input => &amp; => &amp; arg_separator.output => &amp; => &amp; asp_tags => Off => Off auto_append_file => no value => no value auto_prepend_file => no value => no value browscap => no value => no value default_charset => no value => no value default_mimetype => text/html => text/html define_syslog_variables => Off => Off disable_classes => no value => no value disable_functions => no value => no value display_errors => On => On display_startup_errors => Off => Off doc_root => no value => no value docref_ext => no value => no value docref_root => http://www.php.net/ => http://www.php.net/ enable_dl => On => On error_append_string => no value => no value error_log => no value => no value error_prepend_string => no value => no value error_reporting => no value => no value expose_php => On => On extension_dir => /usr/local/lib/php/extensions/no-debug-non-zts-20020429 => /usr/local/lib/php/extensions/no-debug-non-zts-20020429 file_uploads => On => On gpc_order => GPC => GPC highlight.bg => #FFFFFF => #FFFFFF highlight.comment => #FF8000 => #FF8000 highlight.default => #0000BB => #0000BB highlight.html => #000000 => #000000 highlight.keyword => #007700 => #007700 highlight.string => #DD0000 => #DD0000 html_errors => Off => On ignore_repeated_errors => Off => Off ignore_repeated_source => Off => Off ignore_user_abort => Off => Off implicit_flush => On => Off include_path => .:/usr/local/lib/php => .:/usr/local/lib/php log_errors => Off => Off log_errors_max_len => 1024 => 1024 magic_quotes_gpc => On => On magic_quotes_runtime => Off => Off magic_quotes_sybase => Off => Off mail_force_extra_parameters => no value => no value max_execution_time => 0 => 30 max_input_time => -1 => -1 open_basedir => no value => no value output_buffering => 0 => 0 output_handler => no value => no value post_max_size => 8M => 8M precision => 14 => 14 register_argc_argv => On => On register_globals => Off => Off register_long_arrays => Off => Off report_memleaks => On => On report_zend_debug => On => On safe_mode => Off => Off safe_mode_exec_dir => no value => no value safe_mode_gid => Off => Off safe_mode_include_dir => no value => no value sendmail_from => no value => no value sendmail_path => /usr/sbin/sendmail -t -i => /usr/sbin/sendmail -t -i short_open_tag => On => On SMTP => localhost => localhost smtp_port => 25 => 25 sql.safe_mode => Off => Off track_errors => Off => Off unserialize_callback_func => no value => no value upload_max_filesize => 2M => 2M upload_tmp_dir => no value => no value user_dir => no value => no value variables_order => no value => no value xmlrpc_error_number => 0 => 0 xmlrpc_errors => Off => Off y2k_compliance => On => On zend2.implicit_clone => no value => no value ctype ctype functions => enabled mysql MySQL Support => enabled Active Persistent Links => 0 Active Links => 0 Client API version => 3.23.49 MYSQL_MODULE_TYPE => builtin MYSQL_SOCKET => /tmp/mysql.sock MYSQL_INCLUDE => MYSQL_LIBS => Directive => Local Value => Master Value mysql.allow_persistent => On => On mysql.connect_timeout => -1 => -1 mysql.default_host => no value => no value mysql.default_password => no value => no value mysql.default_port => no value => no value mysql.default_socket => no value => no value mysql.default_user => no value => no value mysql.max_links => Unlimited => Unlimited mysql.max_persistent => Unlimited => Unlimited mysql.trace_mode => Off => Off pcre PCRE (Perl Compatible Regular Expressions) Support => enabled PCRE Library Version => 3.92 11-Sep-2002 posix Revision => $Revision: 1.54 $ session Session Support => enabled Registered save handlers => files user Directive => Local Value => Master Value session.auto_start => Off => Off session.bug_compat_42 => On => On session.bug_compat_warn => On => On session.cache_expire => 180 => 180 session.cache_limiter => nocache => nocache session.cookie_domain => no value => no value session.cookie_lifetime => 0 => 0 session.cookie_path => / => / session.cookie_secure => Off => Off session.entropy_file => no value => no value session.entropy_length => 0 => 0 session.gc_dividend => 100 => 100 session.gc_maxlifetime => 1440 => 1440 session.gc_probability => 1 => 1 session.hash_bits_per_character => 4 => 4 session.hash_function => 0 => 0 session.name => PHPSESSID => PHPSESSID session.referer_check => no value => no value session.save_handler => files => files session.save_path => /tmp => /tmp session.serialize_handler => php => php session.use_cookies => On => On session.use_only_cookies => Off => Off session.use_trans_sid => Off => Off standard Regex Library => Bundled library enabled Dynamic Library Support => enabled Path to sendmail => /usr/sbin/sendmail -t -i Directive => Local Value => Master Value assert.active => 1 => 1 assert.bail => 0 => 0 assert.callback => no value => no value assert.quiet_eval => 0 => 0 assert.warning => 1 => 1 auto_detect_line_endings => 0 => 0 date.default_latitude => 31.7667 => 31.7667 date.default_longitude => 35.2333 => 35.2333 date.sunrise_zenith => 90.83 => 90.83 date.sunset_zenith => 90.83 => 90.83 default_socket_timeout => 60 => 60 safe_mode_allowed_env_vars => PHP_ => PHP_ safe_mode_protected_env_vars => LD_LIBRARY_PATH => LD_LIBRARY_PATH url_rewriter.tags => a=href,area=href,frame=src,form=,fieldset= => a=href,area=href,frame=src,form=,fieldset= user_agent => no value => no value tokenizer Tokenizer Support => enabled xml XML Support => active XML Namespace Support => active EXPAT Version => 1.95.5 Additional Modules Module Name Environment Variable => Value PWD => /Users/jkburt/src/php/php5 MAKEFLAGS => STY => 3863.ttyq1.Wintermelon VENDOR => apple REMOTEHOST => 10.0.2.2 MFLAGS => REDIRECT_STATUS => TEST_PHP_EXECUTABLE => /Users/jkburt/src/php/php5/sapi/cli/php CC => gcc rsh_command => ssh USER => jkburt MACHTYPE => powerpc SCRIPT_FILENAME => MAIL => /var/mail/jkburt PATH_TRANSLATED => TERMCAP => SC|screen|VT 100/ANSI X3.64 virtual terminal:\ :DO=\E[%dB:LE=\E[%dD:RI=\E[%dC:UP=\E[%dA:bs:bt=\E[Z:\ :cd=\E[J:ce=\E[K:cl=\E[H\E[J:cm=\E[%i%d;%dH:ct=\E[3g:\ :do=^J:nd=\E[C:pt:rc=\E8:rs=\Ec:sc=\E7:st=\EH:up=\EM:\ :le=^H:bl=^G:cr=^M:it#8:ho=\E[H:nw=\EE:ta=^I:is=\E)0:\ :li#33:co#122:am:xn:xv:LP:sr=\EM:al=\E[L:AL=\E[%dL:\ :cs=\E[%i%d;%dr:dl=\E[M:DL=\E[%dM:ks=\E[?1h\E=:\ :ke=\E[?1l\E>:vi=\E[?25l:ve=\E[34h\E[?25h:vs=\E[34l:\ :us=\E[4m:ue=\E[24m:so=\E[3m:se=\E[23m:mb=\E[5m:\ :md=\E[1m:mr=\E[7m:me=\E[m:ms:\ :Co#8:pa#64:AF=\E[3%dm:AB=\E[4%dm:op=\E[39;49m:AX:G0:\ :as=\E(0:ae=\E(B:\ :ac=\140\140aaffggjjkkllmmnnooppqqrrssttuuvvwwxxyyzz{{||}}~~..--++,,hhII00:\ :k0=\E[10~:k1=\EOP:k2=\EOQ:k3=\EOR:k4=\EOS:k5=\E[15~:\ :k6=\E[17~:k7=\E[18~:k8=\E[19~:k9=\E[20~:k;=\E[21~:\ :F1=\E[23~:F2=\E[24~:kb=^H:K1=\EOq:K2=\EOr:K3=\EOs:\ :K4=\EOp:K5=\EOn:kh=\E[1~:kH=\E[4~:kN=\E[6~:kP=\E[5~:\ :kI=\E[2~:kD=\E[3~:ku=\EOA:kd=\EOB:kr=\EOC:kl=\EOD: QUERY_STRING => CONTENT_LENGTH => HOST => Wintermelon.local. MAKELEVEL => 1 SSH_CLIENT => deleted SHLVL => 4 LOGNAME => jkburt GROUP => staff _ => /Users/jkburt/src/php/php5/sapi/cli/php WINDOW => 0 REQUEST_METHOD => SHELL => /bin/sh HOSTTYPE => macintosh TEST_PHP_SRCDIR => /Users/jkburt/src/php/php5 OSTYPE => darwin6.0 TERM => screen HOME => /Users/jkburt SSH_AUTH_SOCK => deleted PATH => .:/usr/local/bin:/usr/bin:/bin:/usr/local/sbin:/usr/sbin:/sbin SSH_TTY => deleted CONTENT_TYPE => PHP Variables Variable => Value _SERVER["PWD"] => /Users/jkburt/src/php/php5 _SERVER["MAKEFLAGS"] => _SERVER["STY"] => 3863.ttyq1.Wintermelon _SERVER["VENDOR"] => apple _SERVER["REMOTEHOST"] => 10.0.2.2 _SERVER["MFLAGS"] => _SERVER["REDIRECT_STATUS"] => _SERVER["TEST_PHP_EXECUTABLE"] => /Users/jkburt/src/php/php5/sapi/cli/php _SERVER["CC"] => gcc _SERVER["rsh_command"] => ssh _SERVER["USER"] => jkburt _SERVER["MACHTYPE"] => powerpc _SERVER["SCRIPT_FILENAME"] => _SERVER["MAIL"] => /var/mail/jkburt _SERVER["PATH_TRANSLATED"] => _SERVER["TERMCAP"] => SC|screen|VT 100/ANSI X3.64 virtual terminal:\\ :DO=\\E[%dB:LE=\\E[%dD:RI=\\E[%dC:UP=\\E[%dA:bs:bt=\\E[Z:\\ :cd=\\E[J:ce=\\E[K:cl=\\E[H\\E[J:cm=\\E[%i%d;%dH:ct=\\E[3g:\\ :do=^J:nd=\\E[C:pt:rc=\\E8:rs=\\Ec:sc=\\E7:st=\\EH:up=\\EM:\\ :le=^H:bl=^G:cr=^M:it#8:ho=\\E[H:nw=\\EE:ta=^I:is=\\E)0:\\ :li#33:co#122:am:xn:xv:LP:sr=\\EM:al=\\E[L:AL=\\E[%dL:\\ :cs=\\E[%i%d;%dr:dl=\\E[M:DL=\\E[%dM:ks=\\E[?1h\\E=:\\ :ke=\\E[?1l\\E>:vi=\\E[?25l:ve=\\E[34h\\E[?25h:vs=\\E[34l:\\ :us=\\E[4m:ue=\\E[24m:so=\\E[3m:se=\\E[23m:mb=\\E[5m:\\ :md=\\E[1m:mr=\\E[7m:me=\\E[m:ms:\\ :Co#8:pa#64:AF=\\E[3%dm:AB=\\E[4%dm:op=\\E[39;49m:AX:G0:\\ :as=\\E(0:ae=\\E(B:\\ :ac=\\140\\140aaffggjjkkllmmnnooppqqrrssttuuvvwwxxyyzz{{||}}~~..--++,,hhII00:\\ :k0=\\E[10~:k1=\\EOP:k2=\\EOQ:k3=\\EOR:k4=\\EOS:k5=\\E[15~:\\ :k6=\\E[17~:k7=\\E[18~:k8=\\E[19~:k9=\\E[20~:k;=\\E[21~:\\ :F1=\\E[23~:F2=\\E[24~:kb=^H:K1=\\EOq:K2=\\EOr:K3=\\EOs:\\ :K4=\\EOp:K5=\\EOn:kh=\\E[1~:kH=\\E[4~:kN=\\E[6~:kP=\\E[5~:\\ :kI=\\E[2~:kD=\\E[3~:ku=\\EOA:kd=\\EOB:kr=\\EOC:kl=\\EOD: _SERVER["QUERY_STRING"] => _SERVER["CONTENT_LENGTH"] => _SERVER["HOST"] => Wintermelon.local. _SERVER["MAKELEVEL"] => 1 _SERVER["SSH_CLIENT"] => deleted _SERVER["SHLVL"] => 4 _SERVER["LOGNAME"] => jkburt _SERVER["GROUP"] => staff _SERVER["_"] => /Users/jkburt/src/php/php5/sapi/cli/php _SERVER["WINDOW"] => 0 _SERVER["REQUEST_METHOD"] => _SERVER["SHELL"] => /bin/sh _SERVER["HOSTTYPE"] => macintosh _SERVER["TEST_PHP_SRCDIR"] => /Users/jkburt/src/php/php5 _SERVER["OSTYPE"] => darwin6.0 _SERVER["TERM"] => screen _SERVER["HOME"] => /Users/jkburt _SERVER["SSH_AUTH_SOCK"] => deleted _SERVER["PATH"] => .:/usr/local/bin:/usr/bin:/bin:/usr/local/sbin:/usr/sbin:/sbin _SERVER["SSH_TTY"] => deleted _SERVER["CONTENT_TYPE"] => _SERVER["PHP_SELF"] => _SERVER["SCRIPT_NAME"] => _SERVER["DOCUMENT_ROOT"] => _SERVER["argv"] => Array ( ) _SERVER["argc"] => 0 _ENV["PWD"] => /Users/jkburt/src/php/php5 _ENV["MAKEFLAGS"] => _ENV["STY"] => 3863.ttyq1.Wintermelon _ENV["VENDOR"] => apple _ENV["REMOTEHOST"] => 10.0.2.2 _ENV["MFLAGS"] => _ENV["REDIRECT_STATUS"] => _ENV["TEST_PHP_EXECUTABLE"] => /Users/jkburt/src/php/php5/sapi/cli/php _ENV["CC"] => gcc _ENV["rsh_command"] => ssh _ENV["USER"] => jkburt _ENV["MACHTYPE"] => powerpc _ENV["SCRIPT_FILENAME"] => _ENV["MAIL"] => /var/mail/jkburt _ENV["PATH_TRANSLATED"] => _ENV["TERMCAP"] => SC|screen|VT 100/ANSI X3.64 virtual terminal:\\ :DO=\\E[%dB:LE=\\E[%dD:RI=\\E[%dC:UP=\\E[%dA:bs:bt=\\E[Z:\\ :cd=\\E[J:ce=\\E[K:cl=\\E[H\\E[J:cm=\\E[%i%d;%dH:ct=\\E[3g:\\ :do=^J:nd=\\E[C:pt:rc=\\E8:rs=\\Ec:sc=\\E7:st=\\EH:up=\\EM:\\ :le=^H:bl=^G:cr=^M:it#8:ho=\\E[H:nw=\\EE:ta=^I:is=\\E)0:\\ :li#33:co#122:am:xn:xv:LP:sr=\\EM:al=\\E[L:AL=\\E[%dL:\\ :cs=\\E[%i%d;%dr:dl=\\E[M:DL=\\E[%dM:ks=\\E[?1h\\E=:\\ :ke=\\E[?1l\\E>:vi=\\E[?25l:ve=\\E[34h\\E[?25h:vs=\\E[34l:\\ :us=\\E[4m:ue=\\E[24m:so=\\E[3m:se=\\E[23m:mb=\\E[5m:\\ :md=\\E[1m:mr=\\E[7m:me=\\E[m:ms:\\ :Co#8:pa#64:AF=\\E[3%dm:AB=\\E[4%dm:op=\\E[39;49m:AX:G0:\\ :as=\\E(0:ae=\\E(B:\\ :ac=\\140\\140aaffggjjkkllmmnnooppqqrrssttuuvvwwxxyyzz{{||}}~~..--++,,hhII00:\\ :k0=\\E[10~:k1=\\EOP:k2=\\EOQ:k3=\\EOR:k4=\\EOS:k5=\\E[15~:\\ :k6=\\E[17~:k7=\\E[18~:k8=\\E[19~:k9=\\E[20~:k;=\\E[21~:\\ :F1=\\E[23~:F2=\\E[24~:kb=^H:K1=\\EOq:K2=\\EOr:K3=\\EOs:\\ :K4=\\EOp:K5=\\EOn:kh=\\E[1~:kH=\\E[4~:kN=\\E[6~:kP=\\E[5~:\\ :kI=\\E[2~:kD=\\E[3~:ku=\\EOA:kd=\\EOB:kr=\\EOC:kl=\\EOD: _ENV["QUERY_STRING"] => _ENV["CONTENT_LENGTH"] => _ENV["HOST"] => Wintermelon.local. _ENV["MAKELEVEL"] => 1 _ENV["SSH_CLIENT"] => deleted _ENV["SHLVL"] => 4 _ENV["LOGNAME"] => jkburt _ENV["GROUP"] => staff _ENV["_"] => /Users/jkburt/src/php/php5/sapi/cli/php _ENV["WINDOW"] => 0 _ENV["REQUEST_METHOD"] => _ENV["SHELL"] => /bin/sh _ENV["HOSTTYPE"] => macintosh _ENV["TEST_PHP_SRCDIR"] => /Users/jkburt/src/php/php5 _ENV["OSTYPE"] => darwin6.0 _ENV["TERM"] => screen _ENV["HOME"] => /Users/jkburt _ENV["SSH_AUTH_SOCK"] => deleted _ENV["PATH"] => .:/usr/local/bin:/usr/bin:/bin:/usr/local/sbin:/usr/sbin:/sbin _ENV["SSH_TTY"] => deleted _ENV["CONTENT_TYPE"] => PHP License This program is free software; you can redistribute it and/or modify it under the terms of the PHP License as published by the PHP Group and included in the distribution in the file: LICENSE This program is distributed in the hope that it will be useful, but WITHOUT ANY WARRANTY; without even the implied warranty of MERCHANTABILITY or FITNESS FOR A PARTICULAR PURPOSE. If you did not receive a copy of the PHP license, or have any questions about PHP licensing, please contact license@php.net.

« previous php.qa (#9769) next »