Test results [failed]
| From: | noreply@php.net | Date: | Mon, 10 Mar 2003 05:50:08 +0000 |
| Subject: | Test results [failed] | ||
| Groups: | php.qa | ||
| Request: | Send a blank email to php-qa+get-9869@lists.php.net to get a copy of this message | ||
=====================================================================
FAILED TEST SUMMARY
---------------------------------------------------------------------
Simple math tests [ext/standard/tests/math/abs.phpt]
log() tests [ext/standard/tests/math/log.phpt]
Various pow() tests [ext/standard/tests/math/pow.phpt]
Simple math tests [ext/standard/tests/math/round.phpt]
=====================================================================
=====================================================================
TEST RESULT SUMMARY
---------------------------------------------------------------------
Exts skipped : 78
Exts tested : 10
---------------------------------------------------------------------
Number of tests : 443
Tests skipped : 226 (51.0%)
Tests failed : 4 ( 0.9%)
Tests passed : 213 (48.1%)
---------------------------------------------------------------------
Time taken : 42 seconds
=====================================================================
================================================================================
/root/src/php-4.3.1/ext/standard/tests/math/abs.phpt
================================================================================
---- EXPECTED OUTPUT
1,1,0,0
OK
---- ACTUAL OUTPUT
1,1,1,1
Assert failed:
-LONG_MIN+1 === abs(LONG_MIN-1)
Left: int(-9223372036854775807)
Right: int(9223372036854775807)
Assert failed:
-LONG_MIN === abs(LONG_MIN)
Left: int(-9223372036854775808)
Right: float(9.22337203685E+18)
---- FAILED
================================================================================
001- 1,1,0,0
001+ 1,1,1,1
002- OK
002+
003+ Assert failed:
004+ -LONG_MIN+1 === abs(LONG_MIN-1)
005+ Left: int(-9223372036854775807)
006+ Right: int(9223372036854775807)
007+
008+ Assert failed:
009+ -LONG_MIN === abs(LONG_MIN)
010+ Left: int(-9223372036854775808)
011+ Right: float(9.22337203685E+18)
================================================================================
================================================================================
/root/src/php-4.3.1/ext/standard/tests/math/log.phpt
================================================================================
---- EXPECTED OUTPUT
On failure, please mail result to php-dev@lists.php.net
200
50
50
50
50
50
50
50
50
50
---- ACTUAL OUTPUT
On failure, please mail result to php-dev@lists.php.net
200
---- FAILED
================================================================================
003- 50
004- 50
005- 50
006- 50
007- 50
008- 50
009- 50
010- 50
011- 50
================================================================================
================================================================================
/root/src/php-4.3.1/ext/standard/tests/math/pow.phpt
================================================================================
---- EXPECTED OUTPUT
1,1,0,0
On failure, please mail result to php-dev@lists.php.net
OK
---- ACTUAL OUTPUT
1,1,1,1
On failure, please mail result to php-dev@lists.php.net
Assert failed:
LONG_MAX-1 === pow(LONG_MAX-1,1)
Left: int(9223372036854775806)
Right: int(-9223372036854775808)
Assert failed:
LONG_MIN+1 === pow(LONG_MIN+1,1)
Left: int(-9223372036854775807)
Right: int(-9223372036854775808)
Assert failed:
LONG_MAX === pow(LONG_MAX,1)
Left: int(9223372036854775807)
Right: int(-9223372036854775808)
---- FAILED
================================================================================
001- 1,1,0,0
001+ 1,1,1,1
003- OK
003+
004+ Assert failed:
005+ LONG_MAX-1 === pow(LONG_MAX-1,1)
006+ Left: int(9223372036854775806)
007+ Right: int(-9223372036854775808)
008+
009+ Assert failed:
010+ LONG_MIN+1 === pow(LONG_MIN+1,1)
011+ Left: int(-9223372036854775807)
012+ Right: int(-9223372036854775808)
013+
014+ Assert failed:
015+ LONG_MAX === pow(LONG_MAX,1)
016+ Left: int(9223372036854775807)
017+ Right: int(-9223372036854775808)
================================================================================
================================================================================
/root/src/php-4.3.1/ext/standard/tests/math/round.phpt
================================================================================
---- EXPECTED OUTPUT
1,1,0,0
OK
---- ACTUAL OUTPUT
1,1,1,1
Assert failed:
LONG_MIN-1 ~== round(LONG_MIN - 0.6)
Left: int(9223372036854775807)
Right: float(-9.22337203685E+18)
Assert failed:
LONG_MIN-1 ~== floor(LONG_MIN - 0.5)
Left: int(9223372036854775807)
Right: float(-9.22337203685E+18)
Assert failed:
LONG_MAX+1 ~== ceil(LONG_MAX + 0.5)
Left: int(-9223372036854775808)
Right: float(9.22337203685E+18)
Assert failed:
LONG_MAX+1 ~== round(LONG_MAX + 0.6)
Left: int(-9223372036854775808)
Right: float(9.22337203685E+18)
---- FAILED
================================================================================
001- 1,1,0,0
001+ 1,1,1,1
002- OK
002+
003+ Assert failed:
004+ LONG_MIN-1 ~== round(LONG_MIN - 0.6)
005+ Left: int(9223372036854775807)
006+ Right: float(-9.22337203685E+18)
007+
008+ Assert failed:
009+ LONG_MIN-1 ~== floor(LONG_MIN - 0.5)
010+ Left: int(9223372036854775807)
011+ Right: float(-9.22337203685E+18)
012+
013+ Assert failed:
014+ LONG_MAX+1 ~== ceil(LONG_MAX + 0.5)
015+ Left: int(-9223372036854775808)
016+ Right: float(9.22337203685E+18)
017+
018+ Assert failed:
019+ LONG_MAX+1 ~== round(LONG_MAX + 0.6)
020+ Left: int(-9223372036854775808)
021+ Right: float(9.22337203685E+18)
================================================================================
================================================================================
BUILD ENVIRONMENT
================================================================================
OS:
Linux
Automake:
automake (GNU automake) 1.4-p4
Copyright (C) 1999, 2001 Free Software Foundation, Inc.
This is free software; see the source for copying conditions. There is NO
warranty; not even for MERCHANTABILITY or FITNESS FOR A PARTICULAR PURPOSE.
Written by Tom Tromey <tromey@cygnus.com>
Autoconf:
Autoconf version 2.13
Libtool:
ltmain.sh (GNU libtool) 1.4.2 (1.922.2.53 2001/09/11 03:18:52)
Compiler:
Reading specs from /usr/lib/gcc-lib/alpha-linux/2.95.4/specs
gcc version 2.95.4 20011002 (Debian prerelease)
Bison:
bison (GNU Bison) 1.35
Copyright 1984, 1986, 1989, 1992, 2000, 2001, 2002
Free Software Foundation, Inc.
This is free software; see the source for copying conditions. There is NO
warranty; not even for MERCHANTABILITY or FITNESS FOR A PARTICULAR PURPOSE.
User's E-mail: markvd at markvd dot net
================================================================================
PHPINFO
================================================================================
phpinfo()
PHP Version => 4.3.1
System => Linux babylon 2.2.20 #2 Wed Mar 20 19:57:28 EST 2002 alpha
Build Date => Mar 3 2003 15:40:43
Configure Command => './configure' '--with-apache2=/root/src/httpd-2.0.44'
'--with-xml' '--with-zlib-dir=/usr/local/lib' '--enable-track-vars'
Server API => Command Line Interface
Virtual Directory Support => disabled
Configuration File (php.ini) Path => /usr/local/lib/php.ini
PHP API => 20020918
PHP Extension => 20020429
Zend Extension => 20021010
Debug Build => no
Thread Safety => disabled
Registered PHP Streams => php, http, ftp, compress.zlib
This program makes use of the Zend Scripting Language Engine:
Zend Engine v1.3.0, Copyright (c) 1998-2002 Zend Technologies
_______________________________________________________________________
Configuration
PHP Core
Directive => Local Value => Master Value
allow_call_time_pass_reference => On => On
allow_url_fopen => On => On
always_populate_raw_post_data => Off => Off
arg_separator.input => & => &
arg_separator.output => & => &
asp_tags => Off => Off
auto_append_file => no value => no value
auto_prepend_file => no value => no value
browscap => no value => no value
default_charset => no value => no value
default_mimetype => text/html => text/html
define_syslog_variables => Off => Off
disable_functions => no value => no value
display_errors => On => On
display_startup_errors => Off => Off
doc_root => no value => no value
docref_ext => no value => no value
docref_root => http://www.php.net/ => http://www.php.net/
enable_dl => On => On
error_append_string => no value => no value
error_log => no value => no value
error_prepend_string => no value => no value
error_reporting => 2039 => 2039
expose_php => On => On
extension_dir => ./ => ./
file_uploads => On => On
gpc_order => GPC => GPC
highlight.bg => #FFFFFF => #FFFFFF
highlight.comment => #FF8000 => #FF8000
highlight.default => #0000BB => #0000BB
highlight.html => #000000 => #000000
highlight.keyword => #007700 => #007700
highlight.string => #DD0000 => #DD0000
html_errors => Off => On
ignore_repeated_errors => Off => Off
ignore_repeated_source => Off => Off
ignore_user_abort => Off => Off
implicit_flush => On => Off
include_path => .:/usr/local/lib/php => .:/usr/local/lib/php
log_errors => Off => Off
log_errors_max_len => 1024 => 1024
magic_quotes_gpc => On => On
magic_quotes_runtime => Off => Off
magic_quotes_sybase => Off => Off
max_execution_time => 0 => 30
max_input_time => 60 => 60
open_basedir => no value => no value
output_buffering => no value => no value
output_handler => no value => no value
post_max_size => 8M => 8M
precision => 12 => 12
register_argc_argv => On => On
register_globals => Off => Off
report_memleaks => On => On
safe_mode => Off => Off
safe_mode_exec_dir => no value => no value
safe_mode_gid => Off => Off
safe_mode_include_dir => no value => no value
sendmail_from => me@localhost.com => me@localhost.com
sendmail_path => /usr/sbin/sendmail -t -i => /usr/sbin/sendmail -t -i
short_open_tag => On => On
SMTP => localhost => localhost
smtp_port => 25 => 25
sql.safe_mode => Off => Off
track_errors => Off => Off
unserialize_callback_func => no value => no value
upload_max_filesize => 2M => 2M
upload_tmp_dir => no value => no value
user_dir => no value => no value
variables_order => EGPCS => EGPCS
xmlrpc_error_number => 0 => 0
xmlrpc_errors => Off => Off
y2k_compliance => On => On
ctype
ctype functions => enabled
mysql
MySQL Support => enabled
Active Persistent Links => 0
Active Links => 0
Client API version => 3.23.49
MYSQL_MODULE_TYPE => builtin
MYSQL_SOCKET => /tmp/mysql.sock
MYSQL_INCLUDE => MYSQL_LIBS =>
Directive => Local Value => Master Value
mysql.allow_persistent => On => On
mysql.connect_timeout => -1 => -1
mysql.default_host => no value => no value
mysql.default_password => no value => no value
mysql.default_port => no value => no value
mysql.default_socket => no value => no value
mysql.default_user => no value => no value
mysql.max_links => Unlimited => Unlimited
mysql.max_persistent => Unlimited => Unlimited
mysql.trace_mode => Off => Off
overload
User-Space Object Overloading Support => enabled
pcre
PCRE (Perl Compatible Regular Expressions) Support => enabled
PCRE Library Version => 3.92 11-Sep-2002
posix
Revision => $Revision: 1.51 $
session
Session Support => enabled
Registered save handlers => files user
Directive => Local Value => Master Value
session.auto_start => Off => Off
session.bug_compat_42 => On => On
session.bug_compat_warn => On => On
session.cache_expire => 180 => 180
session.cache_limiter => nocache => nocache
session.cookie_domain => no value => no value
session.cookie_lifetime => 0 => 0
session.cookie_path => / => /
session.cookie_secure => Off => Off
session.entropy_file => no value => no value
session.entropy_length => 0 => 0
session.gc_dividend => 100 => 100
session.gc_maxlifetime => 1440 => 1440
session.gc_probability => 1 => 1
session.name => PHPSESSID => PHPSESSID
session.referer_check => no value => no value
session.save_handler => files => files
session.save_path => /tmp => /tmp
session.serialize_handler => php => php
session.use_cookies => On => On
session.use_only_cookies => Off => Off
session.use_trans_sid => Off => Off
standard
Regex Library => Bundled library enabled
Dynamic Library Support => enabled
Path to sendmail => /usr/sbin/sendmail -t -i
Directive => Local Value => Master Value
assert.active => 1 => 1
assert.bail => 0 => 0
assert.callback => no value => no value
assert.quiet_eval => 0 => 0
assert.warning => 1 => 1
auto_detect_line_endings => 0 => 0
default_socket_timeout => 60 => 60
safe_mode_allowed_env_vars => PHP_ => PHP_
safe_mode_protected_env_vars => LD_LIBRARY_PATH => LD_LIBRARY_PATH
url_rewriter.tags => a=href,area=href,frame=src,input=src,form=,fieldset= =>
a=href,area=href,frame=src,input=src,form=,fieldset=
user_agent => no value => no value
tokenizer
Tokenizer Support => enabled
xml
XML Support => active
XML Namespace Support => active
EXPAT Version => 1.95.2
zlib
ZLib Support => enabled
Compiled Version => 1.1.4
Linked Version => 1.1.4
Directive => Local Value => Master Value
zlib.output_compression => Off => Off
zlib.output_compression_level => -1 => -1
zlib.output_handler => no value => no value
Additional Modules
Module Name
Environment
Variable => Value
PWD => /root/src/php-4.3.1
MAKEFLAGS => MFLAGS => REDIRECT_STATUS => TEST_PHP_EXECUTABLE =>
/root/src/php-4.3.1/sapi/cli/php
CC => gcc
USER => root
SCRIPT_FILENAME => MAIL => /var/mail/root
PATH_TRANSLATED => QUERY_STRING => CONTENT_LENGTH => MAKELEVEL => 1
SSH_CLIENT => 67.36.169.115 2160 22
SHLVL => 3
LOGNAME => root
_ => /root/src/php-4.3.1/sapi/cli/php
REQUEST_METHOD => SHELL => /bin/sh
TEST_PHP_SRCDIR => /root/src/php-4.3.1
TERM => xterm
HOME => /root
PATH => /usr/local/sbin:/usr/local/bin:/usr/sbin:/usr/bin:/sbin:/bin:/usr/bin/X11
SSH_TTY => /dev/pts/0
CONTENT_TYPE =>
PHP Variables
Variable => Value
_SERVER["PWD"] => /root/src/php-4.3.1
_SERVER["MAKEFLAGS"] =>
_SERVER["MFLAGS"] =>
_SERVER["REDIRECT_STATUS"] =>
_SERVER["TEST_PHP_EXECUTABLE"] => /root/src/php-4.3.1/sapi/cli/php
_SERVER["CC"] => gcc
_SERVER["USER"] => root
_SERVER["SCRIPT_FILENAME"] =>
_SERVER["MAIL"] => /var/mail/root
_SERVER["PATH_TRANSLATED"] =>
_SERVER["QUERY_STRING"] =>
_SERVER["CONTENT_LENGTH"] =>
_SERVER["MAKELEVEL"] => 1
_SERVER["SSH_CLIENT"] => 67.36.169.115 2160 22
_SERVER["SHLVL"] => 3
_SERVER["LOGNAME"] => root
_SERVER["_"] => /root/src/php-4.3.1/sapi/cli/php
_SERVER["REQUEST_METHOD"] =>
_SERVER["SHELL"] => /bin/sh
_SERVER["TEST_PHP_SRCDIR"] => /root/src/php-4.3.1
_SERVER["TERM"] => xterm
_SERVER["HOME"] => /root
_SERVER["PATH"] =>
/usr/local/sbin:/usr/local/bin:/usr/sbin:/usr/bin:/sbin:/bin:/usr/bin/X11
_SERVER["SSH_TTY"] => /dev/pts/0
_SERVER["CONTENT_TYPE"] =>
_SERVER["PHP_SELF"] =>
_SERVER["SCRIPT_NAME"] =>
_SERVER["DOCUMENT_ROOT"] =>
_SERVER["argv"] => Array
(
)
_SERVER["argc"] => 0
_ENV["PWD"] => /root/src/php-4.3.1
_ENV["MAKEFLAGS"] =>
_ENV["MFLAGS"] =>
_ENV["REDIRECT_STATUS"] =>
_ENV["TEST_PHP_EXECUTABLE"] => /root/src/php-4.3.1/sapi/cli/php
_ENV["CC"] => gcc
_ENV["USER"] => root
_ENV["SCRIPT_FILENAME"] =>
_ENV["MAIL"] => /var/mail/root
_ENV["PATH_TRANSLATED"] =>
_ENV["QUERY_STRING"] =>
_ENV["CONTENT_LENGTH"] =>
_ENV["MAKELEVEL"] => 1
_ENV["SSH_CLIENT"] => 67.36.169.115 2160 22
_ENV["SHLVL"] => 3
_ENV["LOGNAME"] => root
_ENV["_"] => /root/src/php-4.3.1/sapi/cli/php
_ENV["REQUEST_METHOD"] =>
_ENV["SHELL"] => /bin/sh
_ENV["TEST_PHP_SRCDIR"] => /root/src/php-4.3.1
_ENV["TERM"] => xterm
_ENV["HOME"] => /root
_ENV["PATH"] =>
/usr/local/sbin:/usr/local/bin:/usr/sbin:/usr/bin:/sbin:/bin:/usr/bin/X11
_ENV["SSH_TTY"] => /dev/pts/0
_ENV["CONTENT_TYPE"] =>
PHP License
This program is free software; you can redistribute it and/or modify
it under the terms of the PHP License as published by the PHP Group
and included in the distribution in the file: LICENSE
This program is distributed in the hope that it will be useful,
but WITHOUT ANY WARRANTY; without even the implied warranty of
MERCHANTABILITY or FITNESS FOR A PARTICULAR PURPOSE.
If you did not receive a copy of the PHP license, or have any
questions about PHP licensing, please contact license@php.net.