Test results [failed]
| From: | noreply@php.net | Date: | Mon, 10 Mar 2003 18:52:11 +0000 |
| Subject: | Test results [failed] | ||
| Groups: | php.qa | ||
| Request: | Send a blank email to php-qa+get-9886@lists.php.net to get a copy of this message | ||
=====================================================================
FAILED TEST SUMMARY
---------------------------------------------------------------------
Bug #22367 (weird zval allocation problem) [tests/lang/bug22367.phpt]
Bug #22510 (segfault among complex references) [tests/lang/bug22510.phpt]
fopencookie detected and working (or cast mechanism works)
[ext/standard/tests/file/fopencookie.phpt]
Simple math tests [ext/standard/tests/math/abs.phpt]
log() tests [ext/standard/tests/math/log.phpt]
Various pow() tests [ext/standard/tests/math/pow.phpt]
Simple math tests [ext/standard/tests/math/round.phpt]
microtime() function [ext/standard/tests/time/001.phpt]
strtotime() function [ext/standard/tests/time/002.phpt]
mktime() [ext/standard/tests/time/mktime.phpt]
=====================================================================
=====================================================================
TEST RESULT SUMMARY
---------------------------------------------------------------------
Exts skipped : 81
Exts tested : 6
---------------------------------------------------------------------
Number of tests : 469
Tests skipped : 263 (56.1%)
Tests failed : 10 ( 2.1%)
Tests passed : 196 (41.8%)
---------------------------------------------------------------------
Time taken : 170 seconds
=====================================================================
================================================================================
/php/php4/tests/lang/bug22367.phpt
================================================================================
---- EXPECTED OUTPUT
int(5)
bool(false)
bool(false)
array(5) {
[0]=>
int(0)
[1]=>
int(1)
[2]=>
int(2)
[3]=>
int(3)
[4]=>
int(4)
}
array(5) {
[0]=>
int(0)
[1]=>
int(1)
[2]=>
int(2)
[3]=>
int(3)
[4]=>
int(4)
}
int(2)
bool(true)
bool(true)
array(5) {
[0]=>
int(0)
[1]=>
int(1)
[2]=>
int(2)
[3]=>
int(3)
[4]=>
int(4)
}
array(5) {
[0]=>
int(0)
[1]=>
int(1)
[2]=>
int(2)
[3]=>
int(3)
[4]=>
int(4)
}
---- ACTUAL OUTPUT
int(5)
bool(false)
bool(false)
array(5) {
[0]=>
int(4)
[1]=>
int(4)
[2]=>
int(4)
[3]=>
int(4)
[4]=>
int(4)
}
array(5) {
[0]=>
int(0)
[1]=>
int(1)
[2]=>
int(2)
[3]=>
int(3)
[4]=>
int(4)
}
int(2)
bool(true)
bool(true)
array(5) {
[0]=>
int(0)
[1]=>
int(1)
[2]=>
int(2)
[3]=>
int(3)
[4]=>
int(4)
}
array(5) {
[0]=>
int(0)
[1]=>
int(1)
[2]=>
&int(2)
[3]=>
int(3)
[4]=>
int(4)
}
/php/php4/Zend/zend_execute.c(1702) : Freeing 0x1400B30C0 (24 bytes),
script=/php/php4/tests/lang/bug22367.php
Last leak repeated 1 time
---- FAILED
================================================================================
006- int(0)
006+ int(4)
008- int(1)
008+ int(4)
010- int(2)
010+ int(4)
012- int(3)
012+ int(4)
049- int(2)
049+ &int(2)
055+ /php/php4/Zend/zend_execute.c(1702) : Freeing 0x1400B30C0 (24 bytes),
script=/php/php4/tests/lang/bug22367.php
056+ Last leak repeated 1 time
================================================================================
================================================================================
/php/php4/tests/lang/bug22510.phpt
================================================================================
---- EXPECTED OUTPUT
ok1
bar::run1
foo::method1
foo::method1
foo::finalize
done!
ok2
bar::run2
foo::method2
foo::method2
foo::finalize
done!
ok3
bar::run3
foo::method3
foo::method3
foo::finalize
done!
ouch
bar::run1
foo::method1
foo::method1
foo::finalize
I'm alive!
---- ACTUAL OUTPUT
ok1
bar::run1
foo::method1
foo::method1
foo::finalize
done!
ok2
bar::run2
foo::method2
foo::method2
foo::finalize
done!
ok3
bar::run3
foo::method3
foo::method3
foo::finalize
done!
ouch
bar::run1
foo::method1
foo::method1
foo::finalize
[Mon Mar 10 19:49:25 2003] Script: '/php/php4/tests/lang/bug22510.php'
---------------------------------------
/php/php4/Zend/zend_execute.c(271) : Block 0x14003E560 status:
Beginning: Overrun (magic=0x00000000, expected=0x7312F8DC)
---- FAILED
================================================================================
024- I'm alive!
024+ [Mon Mar 10 19:49:25 2003] Script: '/php/php4/tests/lang/bug22510.php'
025+ ---------------------------------------
026+ /php/php4/Zend/zend_execute.c(271) : Block 0x14003E560 status:
027+ Beginning: Overrun (magic=0x00000000, expected=0x7312F8DC)
================================================================================
================================================================================
/php/php4/ext/standard/tests/file/fopencookie.phpt
================================================================================
---- EXPECTED OUTPUT
If you can read this, it worked
---- ACTUAL OUTPUT
If you can read this, it worked/php/php4/main/php_open_temporary_file.c(121) : Freeing 0x1400B2F40
(1024 bytes), script=/php/php4/ext/standard/tests/file/fopencookie.php
---- FAILED
================================================================================
001- If you can read this, it worked
001+ If you can read this, it worked/php/php4/main/php_open_temporary_file.c(121) : Freeing
0x1400B2F40 (1024 bytes), script=/php/php4/ext/standard/tests/file/fopencookie.php
================================================================================
================================================================================
/php/php4/ext/standard/tests/math/abs.phpt
================================================================================
---- EXPECTED OUTPUT
1,1,0,0
OK
---- ACTUAL OUTPUT
1,1,1,1
Assert failed:
-LONG_MIN+1 === abs(LONG_MIN-1)
Left: int(-9223372036854775807)
Right: int(9223372036854775807)
Assert failed:
-LONG_MIN === abs(LONG_MIN)
Left: int(-9223372036854775808)
Right: float(9.2233720368548E+18)
---- FAILED
================================================================================
001- 1,1,0,0
001+ 1,1,1,1
002- OK
002+
003+ Assert failed:
004+ -LONG_MIN+1 === abs(LONG_MIN-1)
005+ Left: int(-9223372036854775807)
006+ Right: int(9223372036854775807)
007+
008+ Assert failed:
009+ -LONG_MIN === abs(LONG_MIN)
010+ Left: int(-9223372036854775808)
011+ Right: float(9.2233720368548E+18)
================================================================================
================================================================================
/php/php4/ext/standard/tests/math/log.phpt
================================================================================
---- EXPECTED OUTPUT
On failure, please mail result to php-dev@lists.php.net
200
50
50
50
50
50
50
50
50
50
---- ACTUAL OUTPUT
On failure, please mail result to php-dev@lists.php.net
200
---- FAILED
================================================================================
003- 50
004- 50
005- 50
006- 50
007- 50
008- 50
009- 50
010- 50
011- 50
================================================================================
================================================================================
/php/php4/ext/standard/tests/math/pow.phpt
================================================================================
---- EXPECTED OUTPUT
1,1,0,0
On failure, please mail result to php-dev@lists.php.net
OK
---- ACTUAL OUTPUT
1,1,1,1
On failure, please mail result to php-dev@lists.php.net
Assert failed:
TRUE === is_infinite(pow(0,-2))
Left: bool(true)
Right: bool(false)
Assert failed:
TRUE === is_infinite(pow(0,-1))
Left: bool(true)
Right: bool(false)
Assert failed:
TRUE === is_infinite(pow(0,-2.0))
Left: bool(true)
Right: bool(false)
Assert failed:
TRUE === is_infinite(pow(0,-1.0))
Left: bool(true)
Right: bool(false)
Assert failed:
TRUE === is_infinite(pow(0.0,-2.0))
Left: bool(true)
Right: bool(false)
Assert failed:
TRUE === is_infinite(pow(0.0,-1.0))
Left: bool(true)
Right: bool(false)
Assert failed:
TRUE === is_infinite(pow( 0.0,-2))
Left: bool(true)
Right: bool(false)
Assert failed:
TRUE === is_infinite(pow( 0.0,-1))
Left: bool(true)
Right: bool(false)
Assert failed:
LONG_MAX-1 === pow(LONG_MAX-1,1)
Left: int(9223372036854775806)
Right: int(-9223372036854775808)
Assert failed:
LONG_MIN+1 === pow(LONG_MIN+1,1)
Left: int(-9223372036854775807)
Right: int(-9223372036854775808)
Assert failed:
LONG_MAX === pow(LONG_MAX,1)
Left: int(9223372036854775807)
Right: int(-9223372036854775808)
---- FAILED
================================================================================
001- 1,1,0,0
001+ 1,1,1,1
003- OK
003+
004+ Assert failed:
005+ TRUE === is_infinite(pow(0,-2))
006+ Left: bool(true)
007+ Right: bool(false)
008+
009+ Assert failed:
010+ TRUE === is_infinite(pow(0,-1))
011+ Left: bool(true)
012+ Right: bool(false)
013+
014+ Assert failed:
015+ TRUE === is_infinite(pow(0,-2.0))
016+ Left: bool(true)
017+ Right: bool(false)
018+
019+ Assert failed:
020+ TRUE === is_infinite(pow(0,-1.0))
021+ Left: bool(true)
022+ Right: bool(false)
023+
024+ Assert failed:
025+ TRUE === is_infinite(pow(0.0,-2.0))
026+ Left: bool(true)
027+ Right: bool(false)
028+
029+ Assert failed:
030+ TRUE === is_infinite(pow(0.0,-1.0))
031+ Left: bool(true)
032+ Right: bool(false)
033+
034+ Assert failed:
035+ TRUE === is_infinite(pow( 0.0,-2))
036+ Left: bool(true)
037+ Right: bool(false)
038+
039+ Assert failed:
040+ TRUE === is_infinite(pow( 0.0,-1))
041+ Left: bool(true)
042+ Right: bool(false)
043+
044+ Assert failed:
045+ LONG_MAX-1 === pow(LONG_MAX-1,1)
046+ Left: int(9223372036854775806)
047+ Right: int(-9223372036854775808)
048+
049+ Assert failed:
050+ LONG_MIN+1 === pow(LONG_MIN+1,1)
051+ Left: int(-9223372036854775807)
052+ Right: int(-9223372036854775808)
053+
054+ Assert failed:
055+ LONG_MAX === pow(LONG_MAX,1)
056+ Left: int(9223372036854775807)
057+ Right: int(-9223372036854775808)
================================================================================
================================================================================
/php/php4/ext/standard/tests/math/round.phpt
================================================================================
---- EXPECTED OUTPUT
1,1,0,0
OK
---- ACTUAL OUTPUT
1,1,1,1
Assert failed:
LONG_MIN-1 ~== round(LONG_MIN - 0.6)
Left: int(9223372036854775807)
Right: float(-9.2233720368548E+18)
Assert failed:
LONG_MIN-1 ~== floor(LONG_MIN - 0.5)
Left: int(9223372036854775807)
Right: float(-9.2233720368548E+18)
Assert failed:
LONG_MAX+1 ~== ceil(LONG_MAX + 0.5)
Left: int(-9223372036854775808)
Right: float(9.2233720368548E+18)
Assert failed:
LONG_MAX+1 ~== round(LONG_MAX + 0.6)
Left: int(-9223372036854775808)
Right: float(9.2233720368548E+18)
---- FAILED
================================================================================
001- 1,1,0,0
001+ 1,1,1,1
002- OK
002+
003+ Assert failed:
004+ LONG_MIN-1 ~== round(LONG_MIN - 0.6)
005+ Left: int(9223372036854775807)
006+ Right: float(-9.2233720368548E+18)
007+
008+ Assert failed:
009+ LONG_MIN-1 ~== floor(LONG_MIN - 0.5)
010+ Left: int(9223372036854775807)
011+ Right: float(-9.2233720368548E+18)
012+
013+ Assert failed:
014+ LONG_MAX+1 ~== ceil(LONG_MAX + 0.5)
015+ Left: int(-9223372036854775808)
016+ Right: float(9.2233720368548E+18)
017+
018+ Assert failed:
019+ LONG_MAX+1 ~== round(LONG_MAX + 0.6)
020+ Left: int(-9223372036854775808)
021+ Right: float(9.2233720368548E+18)
================================================================================
================================================================================
/php/php4/ext/standard/tests/time/001.phpt
================================================================================
---- EXPECTED OUTPUT
Passed: 100000
Failed: 0
---- ACTUAL OUTPUT
Passed: 25050
Failed: 74950
000003: 1047322276 0.17283900 < 1047322276 0.17283900
000004: 1047322276 0.17283900 < 1047322276 0.17283900
000006: 1047322276 0.17381600 < 1047322276 0.17381600
000007: 1047322276 0.17381600 < 1047322276 0.17381600
000009: 1047322276 0.17479200 < 1047322276 0.17479200
000010: 1047322276 0.17479200 < 1047322276 0.17479200
000012: 1047322276 0.17576900 < 1047322276 0.17576900
000014: 1047322276 0.17674500 < 1047322276 0.17674500
000016: 1047322276 0.17772200 < 1047322276 0.17772200
000017: 1047322276 0.17772200 < 1047322276 0.17772200
000019: 1047322276 0.17869900 < 1047322276 0.17869900
---- FAILED
================================================================================
001- Passed: 100000
001+ Passed: 25050
002- Failed: 0
002+ Failed: 74950
003+ 000003: 1047322276 0.17283900 < 1047322276 0.17283900
004+ 000004: 1047322276 0.17283900 < 1047322276 0.17283900
005+ 000006: 1047322276 0.17381600 < 1047322276 0.17381600
006+ 000007: 1047322276 0.17381600 < 1047322276 0.17381600
007+ 000009: 1047322276 0.17479200 < 1047322276 0.17479200
008+ 000010: 1047322276 0.17479200 < 1047322276 0.17479200
009+ 000012: 1047322276 0.17576900 < 1047322276 0.17576900
010+ 000014: 1047322276 0.17674500 < 1047322276 0.17674500
011+ 000016: 1047322276 0.17772200 < 1047322276 0.17772200
012+ 000017: 1047322276 0.17772200 < 1047322276 0.17772200
013+ 000019: 1047322276 0.17869900 < 1047322276 0.17869900
================================================================================
================================================================================
/php/php4/ext/standard/tests/time/002.phpt
================================================================================
---- EXPECTED OUTPUT
1999-10-13 00:00:00
1999-10-13 00:00:00
2000-01-19 00:00:00
2000-01-19 00:00:00
2001-12-21 00:00:00
2001-12-21 00:00:00
2001-12-21 12:16:00
2001-12-21 12:16:00
1969-12-31 23:59:59
2001-10-22 21:19:58
2001-10-22 23:19:58
2001-10-22 23:32:58
2001-10-22 19:19:58
2001-10-22 19:06:58
1999-10-13 00:00:00
1999-10-13 00:00:00
2000-01-19 00:00:00
2000-01-19 00:00:00
2001-12-21 00:00:00
2001-12-21 00:00:00
2001-12-21 12:16:00
2001-12-21 12:16:00
1970-01-01 00:59:59
2001-10-22 21:19:58
2001-10-23 01:19:58
2001-10-23 01:32:58
2001-10-22 21:19:58
2001-10-22 21:06:58
---- ACTUAL OUTPUT
1999-10-13 00:00:00
1999-10-13 00:00:00
2000-01-19 00:00:00
2000-01-19 00:00:00
2001-12-21 00:00:00
2001-12-21 00:00:00
2001-12-21 12:16:00
2001-12-21 12:16:00
1970-01-01 00:59:59
2001-10-22 21:19:58
2001-10-23 01:19:58
2001-10-23 01:32:58
2001-10-22 21:19:58
2001-10-22 21:06:58
1999-10-13 00:00:00
1999-10-13 00:00:00
2000-01-19 00:00:00
2000-01-19 00:00:00
2001-12-21 00:00:00
2001-12-21 00:00:00
2001-12-21 12:16:00
2001-12-21 12:16:00
1970-01-01 00:59:59
2001-10-22 21:19:58
2001-10-23 01:19:58
2001-10-23 01:32:58
2001-10-22 21:19:58
2001-10-22 21:06:58
---- FAILED
================================================================================
009- 1969-12-31 23:59:59
009+ 1970-01-01 00:59:59
011- 2001-10-22 23:19:58
011+ 2001-10-23 01:19:58
012- 2001-10-22 23:32:58
012+ 2001-10-23 01:32:58
013- 2001-10-22 19:19:58
013+ 2001-10-22 21:19:58
014- 2001-10-22 19:06:58
014+ 2001-10-22 21:06:58
================================================================================
================================================================================
/php/php4/ext/standard/tests/time/mktime.phpt
================================================================================
---- EXPECTED OUTPUT
int(1009843200)
int(1009843200)
int(1009843200)
int(1009843200)
int(1025481600)
int(1025481600)
int(1025481600)
int(1025481600)
int(1009839600)
int(1009839600)
int(1009839600)
int(1009836000)
int(1025474400)
int(1025474400)
int(1025478000)
int(1025474400)
---- ACTUAL OUTPUT
int(1009839600)
int(1009839600)
int(1009839600)
int(1009836000)
int(1025474400)
int(1025474400)
int(1025478000)
int(1025474400)
int(1009839600)
int(1009839600)
int(1009839600)
int(1009836000)
int(1025474400)
int(1025474400)
int(1025478000)
int(1025474400)
---- FAILED
================================================================================
001- int(1009843200)
001+ int(1009839600)
002- int(1009843200)
002+ int(1009839600)
003- int(1009843200)
003+ int(1009839600)
004- int(1009843200)
004+ int(1009836000)
005- int(1025481600)
005+ int(1025474400)
006- int(1025481600)
006+ int(1025474400)
007- int(1025481600)
007+ int(1025478000)
008- int(1025481600)
008+ int(1025474400)
================================================================================
================================================================================
BUILD ENVIRONMENT
================================================================================
OS:
OSF1
Automake:
automake (GNU automake) 1.5
Written by Tom Tromey <tromey@cygnus.com>.
Copyright 1994, 1995, 1996, 1997, 1998, 1999, 2000, 2001
Free Software Foundation, Inc.
This is free software; see the source for copying conditions. There is NO
warranty; not even for MERCHANTABILITY or FITNESS FOR A PARTICULAR PURPOSE.
Autoconf:
Autoconf version 2.13
Libtool:
ltmain.sh (GNU libtool) 1.4.3 (1.922.2.110 2002/10/23 01:39:54)
Compiler:
Reading specs from /usr/local/lib/gcc-lib/alphaev5-dec-osf5.1/3.2.1/specs
Configured with: ./configure
Thread model: single
gcc version 3.2.1
Bison:
GNU Bison version 1.28
User's E-mail: novell at kiruna dot se
================================================================================
PHPINFO
================================================================================
phpinfo()
PHP Version => 4.3.2-dev
System => OSF1 netsrv5.netiic.com V5.1 732 alpha
Build Date => Mar 10 2003 19:44:46
Configure Command => './configure' '--disable-all'
'--enable-debug' '--enable-cli' '--disable-cgi'
'--enable-sysvsem' '--enable-sysvshm' '--enable-sysvmsg'
'--prefix=/usr/local/www/php_4_3' '--with-pcre-regex'
'--enable-sockets' '--disable-ipv6'
Server API => Command Line Interface
Virtual Directory Support => disabled
Configuration File (php.ini) Path => /usr/local/www/php_4_3/lib
PHP API => 20020918
PHP Extension => 20020429
Zend Extension => 20021010
Debug Build => yes
Thread Safety => disabled
Registered PHP Streams => php, http, ftp
This program makes use of the Zend Scripting Language Engine:
Zend Engine v1.3.0, Copyright (c) 1998-2003 Zend Technologies<br />
_______________________________________________________________________
Configuration
PHP Core
Directive => Local Value => Master Value
allow_call_time_pass_reference => On => On
allow_url_fopen => On => On
always_populate_raw_post_data => Off => Off
arg_separator.input => & => &
arg_separator.output => & => &
asp_tags => Off => Off
auto_append_file => no value => no value
auto_prepend_file => no value => no value
browscap => no value => no value
default_charset => no value => no value
default_mimetype => text/html => text/html
define_syslog_variables => Off => Off
disable_classes => no value => no value
disable_functions => no value => no value
display_errors => On => On
display_startup_errors => Off => Off
doc_root => no value => no value
docref_ext => no value => no value
docref_root => http://www.php.net/ => http://www.php.net/
enable_dl => On => On
error_append_string => no value => no value
error_log => no value => no value
error_prepend_string => no value => no value
error_reporting => no value => no value
expose_php => On => On
extension_dir => /usr/local/www/php_4_3/lib/php/extensions/debug-non-zts-20020429 =>
/usr/local/www/php_4_3/lib/php/extensions/debug-non-zts-20020429
file_uploads => On => On
gpc_order => GPC => GPC
highlight.bg => #FFFFFF => #FFFFFF
highlight.comment => #FF8000 => #FF8000
highlight.default => #0000BB => #0000BB
highlight.html => #000000 => #000000
highlight.keyword => #007700 => #007700
highlight.string => #DD0000 => #DD0000
html_errors => Off => On
ignore_repeated_errors => Off => Off
ignore_repeated_source => Off => Off
ignore_user_abort => Off => Off
implicit_flush => On => Off
include_path => .:/usr/local/www/php_4_3/lib/php => .:/usr/local/www/php_4_3/lib/php
log_errors => Off => Off
log_errors_max_len => 1024 => 1024
magic_quotes_gpc => On => On
magic_quotes_runtime => Off => Off
magic_quotes_sybase => Off => Off
max_execution_time => 0 => 30
max_input_time => -1 => -1
open_basedir => no value => no value
output_buffering => 0 => 0
output_handler => no value => no value
post_max_size => 8M => 8M
precision => 14 => 14
register_argc_argv => On => On
register_globals => Off => Off
report_memleaks => On => On
safe_mode => Off => Off
safe_mode_exec_dir => no value => no value
safe_mode_gid => Off => Off
safe_mode_include_dir => no value => no value
sendmail_from => no value => no value
sendmail_path => /usr/sbin/sendmail -t -i => /usr/sbin/sendmail -t -i
short_open_tag => On => On
SMTP => localhost => localhost
smtp_port => 25 => 25
sql.safe_mode => Off => Off
track_errors => Off => Off
unserialize_callback_func => no value => no value
upload_max_filesize => 2M => 2M
upload_tmp_dir => no value => no value
user_dir => no value => no value
variables_order => no value => no value
xmlrpc_error_number => 0 => 0
xmlrpc_errors => Off => Off
y2k_compliance => On => On
pcre
PCRE (Perl Compatible Regular Expressions) Support => enabled
PCRE Library Version => 3.92 11-Sep-2002
sockets
Sockets Support => enabled
standard
Regex Library => Bundled library enabled
Dynamic Library Support => enabled
Path to sendmail => /usr/sbin/sendmail -t -i
Directive => Local Value => Master Value
assert.active => 1 => 1
assert.bail => 0 => 0
assert.callback => no value => no value
assert.quiet_eval => 0 => 0
assert.warning => 1 => 1
auto_detect_line_endings => 0 => 0
default_socket_timeout => 60 => 60
safe_mode_allowed_env_vars => PHP_ => PHP_
safe_mode_protected_env_vars => LD_LIBRARY_PATH => LD_LIBRARY_PATH
url_rewriter.tags => a=href,area=href,frame=src,form=,fieldset= =>
a=href,area=href,frame=src,form=,fieldset=
user_agent => no value => no value
sysvmsg
sysvmsg support => enabled
Revision => $Revision: 1.4.2.2 $
Additional Modules
Module Name
sysvsem
sysvshm
Environment
Variable => Value
QUERY_STRING =>
PATH =>
/usr/local/bin:/usr/local/sbin:/sbin:/usr/sbin:/usr/bin:/usr/ccs/bin:/usr/bin/X11:/usr/local/php/bin
OLDPWD => /php/TEST
SCRIPT_FILENAME =>
CONTENT_TYPE =>
SSH2_TTY => /dev/pts/1
MAKE => gmake
LOGNAME => root
REDIRECT_STATUS =>
MAKEFLAGS =>
MAIL => /var/spool/mail/root
HOSTNAME => netsrv5.netiic.com
REQUEST_METHOD =>
USER => root
PATH_TRANSLATED =>
SHLVL => 1
CC => gcc
CONTENT_LENGTH =>
MAKELEVEL => 1
TEST_PHP_EXECUTABLE => /php/php4/sapi/cli/php
SHELL => /bin/sh
HOSTTYPE => alpha
SSH2_CLIENT => 10.0.1.2 41107 10.0.1.5 22
OSTYPE => osf5.1
HOME => /root
TEST_PHP_SRCDIR => /php/php4
TERM => xterm
MFLAGS =>
PWD => /php/php4
MACHTYPE => alpha-dec-osf5.1
PHP Variables
Variable => Value
_SERVER["QUERY_STRING"] =>
_SERVER["PATH"] =>
/usr/local/bin:/usr/local/sbin:/sbin:/usr/sbin:/usr/bin:/usr/ccs/bin:/usr/bin/X11:/usr/local/php/bin
_SERVER["OLDPWD"] => /php/TEST
_SERVER["SCRIPT_FILENAME"] =>
_SERVER["CONTENT_TYPE"] =>
_SERVER["SSH2_TTY"] => /dev/pts/1
_SERVER["MAKE"] => gmake
_SERVER["LOGNAME"] => root
_SERVER["REDIRECT_STATUS"] =>
_SERVER["MAKEFLAGS"] =>
_SERVER["MAIL"] => /var/spool/mail/root
_SERVER["HOSTNAME"] => netsrv5.netiic.com
_SERVER["REQUEST_METHOD"] =>
_SERVER["USER"] => root
_SERVER["PATH_TRANSLATED"] =>
_SERVER["SHLVL"] => 1
_SERVER["CC"] => gcc
_SERVER["CONTENT_LENGTH"] =>
_SERVER["MAKELEVEL"] => 1
_SERVER["TEST_PHP_EXECUTABLE"] => /php/php4/sapi/cli/php
_SERVER["SHELL"] => /bin/sh
_SERVER["HOSTTYPE"] => alpha
_SERVER["SSH2_CLIENT"] => 10.0.1.2 41107 10.0.1.5 22
_SERVER["OSTYPE"] => osf5.1
_SERVER["HOME"] => /root
_SERVER["TEST_PHP_SRCDIR"] => /php/php4
_SERVER["TERM"] => xterm
_SERVER["MFLAGS"] =>
_SERVER["PWD"] => /php/php4
_SERVER["MACHTYPE"] => alpha-dec-osf5.1
_SERVER["PHP_SELF"] =>
_SERVER["SCRIPT_NAME"] =>
_SERVER["DOCUMENT_ROOT"] =>
_SERVER["argv"] => Array
(
)
_SERVER["argc"] => 0
_ENV["QUERY_STRING"] =>
_ENV["PATH"] =>
/usr/local/bin:/usr/local/sbin:/sbin:/usr/sbin:/usr/bin:/usr/ccs/bin:/usr/bin/X11:/usr/local/php/bin
_ENV["OLDPWD"] => /php/TEST
_ENV["SCRIPT_FILENAME"] =>
_ENV["CONTENT_TYPE"] =>
_ENV["SSH2_TTY"] => /dev/pts/1
_ENV["MAKE"] => gmake
_ENV["LOGNAME"] => root
_ENV["REDIRECT_STATUS"] =>
_ENV["MAKEFLAGS"] =>
_ENV["MAIL"] => /var/spool/mail/root
_ENV["HOSTNAME"] => netsrv5.netiic.com
_ENV["REQUEST_METHOD"] =>
_ENV["USER"] => root
_ENV["PATH_TRANSLATED"] =>
_ENV["SHLVL"] => 1
_ENV["CC"] => gcc
_ENV["CONTENT_LENGTH"] =>
_ENV["MAKELEVEL"] => 1
_ENV["TEST_PHP_EXECUTABLE"] => /php/php4/sapi/cli/php
_ENV["SHELL"] => /bin/sh
_ENV["HOSTTYPE"] => alpha
_ENV["SSH2_CLIENT"] => 10.0.1.2 41107 10.0.1.5 22
_ENV["OSTYPE"] => osf5.1
_ENV["HOME"] => /root
_ENV["TEST_PHP_SRCDIR"] => /php/php4
_ENV["TERM"] => xterm
_ENV["MFLAGS"] =>
_ENV["PWD"] => /php/php4
_ENV["MACHTYPE"] => alpha-dec-osf5.1
PHP License
This program is free software; you can redistribute it and/or modify
it under the terms of the PHP License as published by the PHP Group
and included in the distribution in the file: LICENSE
This program is distributed in the hope that it will be useful,
but WITHOUT ANY WARRANTY; without even the implied warranty of
MERCHANTABILITY or FITNESS FOR A PARTICULAR PURPOSE.
If you did not receive a copy of the PHP license, or have any
questions about PHP licensing, please contact license@php.net.