Compile error on Suse 6.2 - Linux 2.2.10

From: Date: Fri, 11 Feb 2000 07:58:05 +0000
Subject: Compile error on Suse 6.2 - Linux 2.2.10
Groups: php.version4 
Request: Send a blank email to php-version4+get-10089@lists.php.net to get a copy of this message
Hi all, after doing the following i get a compile failure. ************************************** ./configure --with-apxs=/var/httpd/bin/apxs \ --with-sybase-ct=/opt/sybase \ --with-gd=/usr \ --with-ttf=/usr \ --with-mysql=/usr \ --with-dbase=yes \ --with-filepro=yes \ --with-jpeg-dir=/usr \ --with-tiff-dir=/usr \ --with-ldap=/usr \ --with-pdflib=/usr \ --with-imap=/usr/src/wwwdev/contrib/imap \ --with-xml=/usr /bin/sh ../../libtool --silent --mode=compile gcc -DHAVE_CONFIG_H -I. -I/usr/src/cvstree/php4/ext/standard -I../.. -I../../Zend -I/usr/src/cvstree/php4 -I/var/httpd/include -I/usr/src/wwwdev/contrib/imap/include -I/usr/include/mysql -I/opt/sybase/include -I/var/httpd/include/xml -D_REENTRANT -g -O2 -Wall -c base64.c /bin/sh ../../libtool --silent --mode=compile gcc -DHAVE_CONFIG_H -I. -I/usr/src/cvstree/php4/ext/standard -I../.. -I../../Zend -I/usr/src/cvstree/php4 -I/var/httpd/include -I/usr/src/wwwdev/contrib/imap/include -I/usr/include/mysql -I/opt/sybase/include -I/var/httpd/include/xml -D_REENTRANT -g -O2 -Wall -c basic_functions.c /bin/sh ../../libtool --silent --mode=compile gcc -DHAVE_CONFIG_H -I. -I/usr/src/cvstree/php4/ext/standard -I../.. -I../../Zend -I/usr/src/cvstree/php4 -I/var/httpd/include -I/usr/src/wwwdev/contrib/imap/include -I/usr/include/mysql -I/opt/sybase/include -I/var/httpd/include/xml -D_REENTRANT -g -O2 -Wall -c browscap.c /bin/sh ../../libtool --silent --mode=compile gcc -DHAVE_CONFIG_H -I. -I/usr/src/cvstree/php4/ext/standard -I../.. -I../../Zend -I/usr/src/cvstree/php4 -I/var/httpd/include -I/usr/src/wwwdev/contrib/imap/include -I/usr/include/mysql -I/opt/sybase/include -I/var/httpd/include/xml -D_REENTRANT -g -O2 -Wall -c crypt.c crypt.c: In function php_if_crypt': crypt.c:122: PHP3_MAX_SALT_LEN' undeclared (first use in this function) crypt.c:122: (Each undeclared identifier is reported only once crypt.c:122: for each function it appears in.) crypt.c:122: size of array `salt' has non-integer type crypt.c: At top level: crypt.c:113: warning: `php_to64' defined but not used make[3]: *** [crypt.lo] Error 1 make[3]: Leaving directory `/usr/src/cvstree/php4/ext/standard' make[2]: *** [all-recursive] Error 1 make[2]: Leaving directory `/usr/src/cvstree/php4/ext/standard' make[1]: *** [all] Error 1 make[1]: Leaving directory `/usr/src/cvstree/php4/ext' make: *** [all-recursive] Error 1 -- -------------------------------* GKS I-NetPartner GmbH Hans-Peter Straub Seewiesenstrasse 12 D-73054 Eislingen -- Phone: +49 7161 9849955 Fax: +49 7161 9849956 -- eMail: straub@i-netpartner.de Web: http://www.i-netpartner.de -------------------------------*

« previous php.version4 (#10089) next »