'make' problems with latest snaps
| From: | Damien Mc Kenna | Date: | Fri, 18 Feb 2000 19:24:27 +0000 |
| Subject: | 'make' problems with latest snaps | ||
| Groups: | php.version4 | ||
| Request: | Send a blank email to php-version4+get-10462@lists.php.net to get a copy of this message | ||
Over the last 10 days I've grabbed a snapshot almost daily, but I haven't
had any success with them in the last few days. Here's what I got:
php4-200002100745
php4-200002140745
php4-200002150545
php4-200002160445
php4-200002170745
php4-200002180445
php4-200002180845
The first one (10th feb, 0745) 'make's ok, but 'make install' fails like so:
Making install in .
make[1]: Entering directory `/usr/src/php4-200002100745'
/usr/sbin/apxs -i -a -n php4 libs/libphp4.so
cp libs/libphp4.so /usr/lib/apache/libphp4.so
chmod 755 /usr/lib/apache/libphp4.so
[activating module `php4' in /etc/httpd/conf/httpd.conf]
make[1]: Leaving directory `/usr/src/php4-200002100745'
Making install in pear
make[1]: Entering directory `/usr/src/php4-200002100745/pear'
make[2]: Entering directory `/usr/src/php4-200002100745/pear'
creating header file hierarchy
/bin/sh: -c: line 2: syntax error: unexpected end of file
make[2]: [install-build] Error 2 (ignored)
make[2]: Leaving directory `/usr/src/php4-200002100745/pear'
make[1]: Leaving directory `/usr/src/php4-200002100745/pear'
The ones dated the 14th through the 18th 0445 all fail with this error on 'make':
make[3]: Leaving directory `/usr/src/php4-200002170745/ext/standard'
make[2]: Leaving directory `/usr/src/php4-200002170745/ext/standard'
Making all in xml
make[2]: Entering directory `/usr/src/php4-200002170745/ext/xml'
Making all in expat
make[3]: Entering directory `/usr/src/php4-200002170745/ext/xml/expat'
/usr/src/php4-200002170745/build/rules.mk:120: /usr/src/php4-200002170745/ext/xm
l/expat/.deps: No such file or directory
make[3]: *** No rule to make target `/usr/src/php4-200002170745/ext/xml/expat/.d
eps'. Stop.
make[3]: Leaving directory `/usr/src/php4-200002170745/ext/xml/expat'
make[2]: *** [all-recursive] Error 1
make[2]: Leaving directory `/usr/src/php4-200002170745/ext/xml'
Then the 18th 0745 does even worse:
[root@biology php4-200002180845]# make
Making all in Zend
make[1]: Entering directory `/usr/src/php4-200002180845/Zend'
/bin/sh ../libtool --silent --mode=compile gcc -DHAVE_CONFIG_H -I. -I. -I.. -D
XML_BYTE_ORDER=12 -D_REENTRANT -g -O2 -Wall -c zend-scanner.c
In file included from zend.h:118,
from ./zend-scanner.l:42:
zend_llist.h:42: redefinition of `compare_func_t'
zend_hash.h:37: `compare_func_t' previously declared here
zend-scanner.c:5728: warning: `yy_fatal_error' defined but not used
zend-scanner.c:5713: warning: `yy_top_state' defined but not used
make[1]: *** [zend-scanner.lo] Error 1
make[1]: Leaving directory `/usr/src/php4-200002180845/Zend'
make: *** [all-recursive] Error
As you can see, there be problems.
Some info on the system:
Distro: Mandrake 6.1
Kernel: 2.2.13-22mdk
Compiler: gcc.colorgcc 2.95.2
Apache: Apache/1.3.9 (Unix) (NetRevolution Advanced Server/Linux-Mandrake)
PHP/4.0b4-dev PHP/3.0.15-dev
Config line: ./configure --with-xml --with-mysql --with-apxs=/usr/sbin/apxs
--enable-versioning --enable-track-vars
Ah yes, as you can see I currently have the older snap installed and running ok
and also a snap of PHP3.0.15.
Damien Mc Kenna Keene State College student mckenna@crosswinds.net
Married to Jen http://www.crosswinds.net/~mckenna ICQ:17066133