Compile error in Beta 4 with sybase 11.9.2

From: Date: Mon, 21 Feb 2000 23:27:05 +0000
Subject: Compile error in Beta 4 with sybase 11.9.2
Groups: php.version4 
Request: Send a blank email to php-version4+get-10617@lists.php.net to get a copy of this message
The ./configure line ./configure --with-sybase=/opt/sybase-11.9.2 and it dies at the following part of the make (this library compiled works with php4 beta 3) ----------start copy-------- gcc -DHAVE_CONFIG_H -I. -I/usr/local/src/php-4.0b4pl1/ext/sybase -I../.. -I../../Zend -I/usr/local/src/php-4.0b4pl1 -I/opt/sybase-11.9.2/include -D_REENTRANT -g -O2 -Wall -c sybase.c && touch sybase.lo sybase.c: In function `php_sybase_do_connect': sybase.c:260: `list' undeclared (first use in this function) sybase.c:260: (Each undeclared identifier is reported only once sybase.c:260: for each function it appears in.) sybase.c:261: `plist' undeclared (first use in this function) sybase.c: In function `php_if_sybase_fetch_object': sybase.c:952: warning: implicit declaration of function `php_sybase_fetch_hash' sybase.c: At top level: sybase.c:907: warning: `php_if_sybase_fetch_hash' defined but not used make[3]: *** [sybase.lo] Error 1 make[3]: Leaving directory `/usr/local/src/php-4.0b4pl1/ext/sybase' make[2]: *** [all-recursive] Error 1 make[2]: Leaving directory `/usr/local/src/php-4.0b4pl1/ext/sybase' make[1]: *** [all] Error 1 make[1]: Leaving directory `/usr/local/src/php-4.0b4pl1/ext' make: *** `[all-recursive] Error 1

« previous php.version4 (#10617) next »