compile problem with latest cvs
| From: | php at home dot uh dot nu | Date: | Thu, 24 Feb 2000 02:08:46 +0000 |
| Subject: | compile problem with latest cvs | ||
| Groups: | php.version4 | ||
| Request: | Send a blank email to php-version4+get-10780@lists.php.net to get a copy of this message | ||
Howdy folks,
I'm getting a compile problem with today's latest cvs and the oci8 extension.
Here is my config
./configure --with-oracle=$ORACLE_HOME --with-oci8=$ORACLE_HOME
--with-apache=$RC_PROJ_ROOT/apache_1.3.9 --with-ftp --with-gd --enable-xml --enable-wddx
--enable-sysvshm --enable-sysvsem --enable-experimental-zts --enable-inline-optimization
--with-zlib--enable-track-vars --enable-magic-quotes --disable-debug
here is the compile error
make[3]: Entering directory `/home/waltb/rocketcash/php4/ext/oci8'
gcc -DHAVE_CONFIG_H -I. -I/home/waltb/rocketcash/php4/ext/oci8 -I../.. -I../../Zend
-I/home/waltb/rocketcash/php4 -I/home/waltb/apollo/rocketcash/apache_1.3.9/src/include
-I/home/waltb/apollo/rocketcash/apache_1.3.9/src/os/unix -I/home/oracle/rdbms/public
-I/home/oracle/network/public -I/home/oracle/plsql/public -I/home/oracle/rdbms/public
-I/home/oracle/network/public -I/home/oracle/plsql/public -I/home/oracle/rdbms/public
-I/home/oracle/network/public -I/home/oracle/plsql/public
-I/home/waltb/rocketcash/php4/ext/xml/expat/xmltok
-I/home/waltb/rocketcash/php4/ext/xml/expat/xmlparse -I../../TSRM -DXML_BYTE_ORDER=12 -D_REENTRANT
-I../TSRM -g -O2 -pthread -c oci8.c && touch oci8.lo
oci8.c: In function `php_minit_oci':
oci8.c:335: warning: declaration of `executor_globals' shadows a parameter
oci8.c:337: `oci_globals' undeclared (first use in this function)
oci8.c:337: (Each undeclared identifier is reported only once
oci8.c:337: for each function it appears in.)
make[3]: *** [oci8.lo] Error 1
make[3]: Leaving directory `/home/waltb/rocketcash/php4/ext/oci8'
make[2]: *** [all-recursive] Error 1
make[2]: Leaving directory `/home/waltb/rocketcash/php4/ext/oci8'
make[1]: *** [all] Error 1
make[1]: Leaving directory `/home/waltb/rocketcash/php4/ext'
make: *** [all-recursive] Error 1
Walt