Re: [PHP4BETA] Apache build error when including pdflib
| From: | Uwe Steinmann | Date: | Fri, 10 Mar 2000 10:19:43 +0000 |
| Subject: | Re: [PHP4BETA] Apache build error when including pdflib | ||
| References: | 1 | Groups: | php.version4 |
| Request: | Send a blank email to php-version4+get-11855@lists.php.net to get a copy of this message | ||
On Thu, Mar 09, 2000 at 12:20:11PM -0500, Chris King wrote:
> I am trying to compile PHP4 with pdflib support, currently have pdflib
> 3.0 installed. Configuring apache with:
>
> ./configure --with-mysql --with-pdflib --with-apache=../apache_1.3.12
>
> Builds OK, with errors that are explained in the manual (unsupported
> functions)
>
> However, when I go to build apache I get the following errors:
>
> gcc -DLINUX=2 -I/usr/src/redhat/SOURCES/php-4.0b4pl1
> -I/usr/src/redhat/SOURCES/php-4.0b4pl1/Zend
> -I/usr/src/redhat/SOURCES/php-4.0b4pl1/Zend
> -I/usr/src/redhat/SOURCES/php-4.0b4pl1 -DUSE_EXPAT -I./lib/expat-lite
> -DNO_DL_NEEDED
>
./apaci \
> -o httpd buildmark.o modules.o modules/standard/libstandard.a
> modules/php4/libphp4.a main/libmain.a ./os/unix/libos.a ap/libap.a
> lib/expat-lite/libexpat.a -Wl,-rpath,/usr/lib/mysql -rdynamic
> -L/usr/lib/mysql
> -Lmodules/php4 -L../modules/php4 -L../../modules/php4 -lmodphp4
> -lgdbm -lpam -ldl
> -ldl -lz -ljpeg -lpng -ltiff -lpdf -lmysqlclient -lgd -lresolv -lm
> -lcrypt -lnsl
> -lresolv -lm -lcrypt
> modules/php4/libphp4.a(pdf.o): In function
> `php_if_pdf_open_memory_image':
> /usr/src/redhat/SOURCES/php-4.0b4pl1/ext/pdf/pdf.c:2256: undefined
> reference to
> `PDF_open_memory_image'
> modules/php4/libphp4.a(pdf.o): In function `php_if_pdf_put_image':
> /usr/src/redhat/SOURCES/php-4.0b4pl1/ext/pdf/pdf.c:2383: undefined
> reference to
> `PDF_put_image'modules/php4/libphp4.a(pdf.o): In function
> `php_if_pdf_execute_image':
> /usr/src/redhat/SOURCES/php-4.0b4pl1/ext/pdf/pdf.c:2429: undefined
> reference to
> `PDF_execute_image'
> collect2: ld returned 1 exit status
> make[2]: *** [target_static] Error 1
> make[2]: Leaving directory `/usr/src/redhat/SOURCES/apache_1.3.12/src'
> make[1]: *** [build-std] Error 2
> make[1]: Leaving directory `/usr/src/redhat/SOURCES/apache_1.3.12'
> make: *** [build] Error 2
>
> Any help would be appreciated! Thanks,
Is this the latest version from CVS?
Uwe
--
Uwe.Steinmann@fernuni-hagen.de
Tel: +2331 987 4528 Fax: +2331 987 375