4.0RC1 Fails on PDFLIB 3.0

From: Date: Mon, 27 Mar 2000 23:34:39 +0000
Subject: 4.0RC1 Fails on PDFLIB 3.0
Groups: php.version4 
Request: Send a blank email to php-version4+get-12702@lists.php.net to get a copy of this message
gcc -DHAVE_CONFIG_H -I. -I/usr/src/php-4.0RC1/ext/pdf -I../.. -I../../Zend -I/usr/src/php-4.0RC1 -I/usr/src/apache_1.3.12/src/include -I/usr/src/apache_1.3.12/src/os/unix -I/usr/local/include/freetype -I/usr/src/php-4.0RC1/ext/mysql/libmysql -I/usr/local/pdflib//include -I/usr/local/pgsql/include -I/usr/src/php-4.0RC1/ext/xml/expat/xmltok -I/usr/src/php-4.0RC1/ext/xml/expat/xmlparse -DXML_BYTE_ORDER=12 -D_REENTRANT -g -O2 -c pdf.c && touch pdf.lo pdf.c:96: `php_if_pdf_show_boxed' undeclared here (not in a function) pdf.c:96: initializer element for `pdf_functions[11].handler' is not constant pdf.c:97: `php_if_pdf_skew' undeclared here (not in a function) pdf.c:97: initializer element for `pdf_functions[12].handler' is not constant make[3]: *** [pdf.lo] Error 1 make[3]: Leaving directory `/usr/src/php-4.0RC1/ext/pdf' make[2]: *** [all-recursive] Error 1 make[2]: Leaving directory `/usr/src/php-4.0RC1/ext/pdf' make[1]: *** [all] Error 1 make[1]: Leaving directory `/usr/src/php-4.0RC1/ext' make: *** [all-recursive] Error 1 any ideas? PHPLIB 3.0 compiled no problem. Gavin -- Gavin M. Roy, Director of Technology, C.O.O. Ready Set Net (formerly PathFinders) ---------------------------------------------------------------- The information transmitted is intended only for the person or entity to which it is addressed and may contain confidential and/or privileged material. Any review, retransmission, dissemination or other use of, or taking of any action in reliance upon, this information by persons or entities other than the intended recipient is prohibited. If you received this in error, please contact the sender and delete the material from any computer.

« previous php.version4 (#12702) next »