Install Error1

From: Date: Wed, 05 Apr 2000 20:11:56 +0000
Subject: Install Error1
Groups: php.version4 
Request: Send a blank email to php-version4+get-13181@lists.php.net to get a copy of this message
Hello All. I have tried to install Apache1.3.X +php4.RC1+Mysql+SSL and IMAP,LDAP,Mcrypt. Everything was looking good until php4 "make" processing. During php4 "make" processing I got the following error message. What kind of configure error contributes to this error? I'll appreciate for your assistance. Thank you very much Install processing....good....good...ok...ok....and then ......... basic_functions.c:324: `php_if_dl' undeclared here (not in a function) basic_functions.c:324: initializer element for basic_functions[201].handler' is not constant basic_functions.c: In function php_info_basic': basic_functions.c:708: warning: implicit declaration of function php_info_dl' make[3]: *** [basic_functions.lo] Error 1 make[3]: Leaving directory /usr/local/php4/ext/standard' make[2]: *** [all-recursive] Error 1 make[2]: Leaving directory /usr/local/php4/ext/standard' make[1]: *** [all] Error 1 make[1]: Leaving directory /usr/local/php4/ext' make: *** [all-recursive] Error 1

« previous php.version4 (#13181) next »