problems installing php4rc1
| From: | juancho at maeztro dot dhis dot net | Date: | Sun, 09 Apr 2000 02:38:32 +0000 |
| Subject: | problems installing php4rc1 | ||
| Groups: | php.version4 | ||
| Request: | Send a blank email to php-version4+get-13339@lists.php.net to get a copy of this message | ||
Hi, I'm having the following error when I do make:
In file included from libmysql.c:11:
global.h:194: warning: redefinition of `uint'
/usr/include/sys/types.h:130: warning: `uint' previously declared here
global.h:195: warning: redefinition of `ushort'
/usr/include/sys/types.h:129: warning: `ushort' previously declared here
In file included from libmysql.c:14:
m_string.h:165: parse error before `__extension__'
m_string.h:165: parse error before `&&'
libmysql.c: In function `net_safe_read':
libmysql.c:260: warning: `old_signal_handler' might be used uninitialized
in this function
libmysql.c: In function `simple_command':
libmysql.c:389: warning: `old_signal_handler' might be used uninitialized
in this function
libmysql.c: In function `read_user_name':
libmysql.c:487: warning: implicit declaration of function `cuserid'
libmysql.c: In function `end_server':
libmysql.c:612: warning: `old_signal_handler' might be used uninitialized
in this function
libmysql.c: In function `mysql_real_connect':
libmysql.c:1116: warning: `old_signal_handler' might be used uninitialized
in this function
gmake[4]: *** [libmysql.lo] Error 1
gmake[4]: Leaving directory `/home/juancho/php-4.0RC1/ext/mysql/libmysql'
gmake[3]: *** [all-recursive] Error 1
gmake[3]: Leaving directory `/home/juancho/php-4.0RC1/ext/mysql/libmysql'
gmake[2]: *** [all-recursive] Error 1
gmake[2]: Leaving directory `/home/juancho/php-4.0RC1/ext/mysql'
gmake[1]: *** [all] Error 1
gmake[1]: Leaving directory `/home/juancho/php-4.0RC1/ext'
gmake: *** [all-recursive] Error 1
This is the line of configure options:
./configure --with-xml --enable-track-vars --enable-dmalloc
--with-apache=../apache_1.3.12 --with-ftp --enable-sysvsem
--enable-sysvshm
I tried the latest cvs version but I got the same error.
THanks for your help.