Re: [PHP4BETA] Compile Error
| From: | Victor | Date: | Wed, 12 Apr 2000 18:43:45 +0000 |
| Subject: | Re: [PHP4BETA] Compile Error | ||
| References: | 1 | Groups: | php.version4 |
| Request: | Send a blank email to php-version4+get-13465@lists.php.net to get a copy of this message | ||
Is CVS as stable as the RC1. I want to fix this problem but I still want to
have a stable version. How stable is CVS? Are the changes tested in CVS?
Thanks
Joey wrote:
> Fixed in CVS.
>
> --Joey Smith
>
> Please forgive the long sig:
>
> *** Notice To Bulk Emailers: Attention! Pursuant to US Code, Title 47,
> Chapter 5, Subchapter II, 227, any & all unsolicited commercial e-mail
> sent to this address is subject to a download and archival fee in the
> amount of the $1500 US and copies will be forwarded to domain
> administrators. Emailing denotes acceptance of said terms!
>
> On Wed, 12 Apr 2000, Victor wrote:
>
> > Anyone know what would cause this error ?
> >
> > -D_POSIX_PTHREAD_SEMANTICS -D_REENTRANT -g -O2 -c base64.c && touch
> > base64.lo
> > gcc -DHAVE_CONFIG_H -I. -I/export/download/php-4.0RC1/ext/standard
> > -I../.. -I../../Zend -I/export/download/php-4.0RC1 -I
> > /export/download/apache_1.3.12/src/include
> > -I/export/download/apache_1.3.12/src/os/unix -I/usr/local/mysql/include
> > -I/ex
> > port/download/php-4.0RC1/ext/xml/expat/xmltok
> > -I/export/download/php-4.0RC1/ext/xml/expat/xmlparse
> > -DXML_BYTE_ORDER=21
> > -D_POSIX_PTHREAD_SEMANTICS -D_REENTRANT -g -O2 -c basic_functions.c &&
> > touch basic_functions.lo
> > basic_functions.c:324: `php_if_dl' undeclared here (not in a function)
> > basic_functions.c:324: initializer element for
> > `basic_functions[201].handler' is not constant
> > make[3]: *** [basic_functions.lo] Error 1
> > make[3]: Leaving directory `/export/download/php-4.0RC1/ext/standard'
> > make[2]: *** [all-recursive] Error 1
> > make[2]: Leaving directory `/export/download/php-4.0RC1/ext/standard'
> > make[1]: *** [all] Error 1
> > make[1]: Leaving directory `/export/download/php-4.0RC1/ext'
> > make: *** [all-recursive] Error 1
> >
> > ----------------------------------------------
> > Compile Settings
> > ./configure --with-apache=/export/download/apache_1.3.12
> > --with-mysql=/usr/local/mysql --enable-safe-mode --
> > enable-track-vars --enable-url-includes --enable-trans-sid
> > --disable-debug
> >
> > Solaris 7 (sparc)
> >
> > Thanks
> >
> >
> > --
> > PHP 4.0 Beta Mailing List
> > <http://www.php.net/version4/>
> > To unsubscribe, e-mail: php4beta-unsubscribe@lists.php.net
> > For additional commands, e-mail: php4beta-help@lists.php.net
> > To contact the list administrators, e-mail: php4beta-admin@lists.php.net
> >
> >