Current CVS fails to compile

From: Date: Sat, 15 Apr 2000 13:35:47 +0000
Subject: Current CVS fails to compile
Groups: php.version4 
Request: Send a blank email to php-version4+get-13580@lists.php.net to get a copy of this message
Platform Linux 2.2.12/Redhat 6.0 Here's the config file ../php4/configure \ --with-apache=/usr/local/src/apache_1.3.12 \ --enable-track-vars \ --enable-magic-quotes \ --with-db2=/usr/local/site/BerkeleyDB \ --with-ldap=/usr/local/site/ldap \ --disable-debug \ --with-config-file-path=/usr/local/site/ \ --prefix=/usr/local/site/php Here's the error /usr/local/src/php4/ext/db/db.c: In function `php_find_dbm': /usr/local/src/php4/ext/db/db.c:167: `list_entry' undeclared (first use in this function) /usr/local/src/php4/ext/db/db.c:167: (Each undeclared identifier is reported only once /usr/local/src/php4/ext/db/db.c:167: for each function it appears in.) /usr/local/src/php4/ext/db/db.c:167: `le' undeclared (first use in this function) /usr/local/src/php4/ext/db/db.c:168: parse error before `*' /usr/local/src/php4/ext/db/db.c:174: `numitems' undeclared (first use in this function) /usr/local/src/php4/ext/db/db.c:175: `i' undeclared (first use in this function) /usr/local/src/php4/ext/db/db.c:180: `info' undeclared (first use in this function) /usr/local/src/php4/ext/db/db.c:190: `info_type' undeclared (first use in this function) make[3]: *** [db.lo] Error 1 make[2]: *** [all-recursive] Error 1 make[1]: *** [all] Error 1 make: *** [all-recursive] Error 1 -- Yusuf Goolamabbas yusufg@outblaze.com

« previous php.version4 (#13580) next »