Instalation Error

From: Date: Tue, 18 Apr 2000 18:05:23 +0000
Subject: Instalation Error
Groups: php.version4 
Request: Send a blank email to php-version4+get-13680@lists.php.net to get a copy of this message
Hello, I'm Mario Flores from Mèxico, I have some trobbles compiling the php-4.0RC1. I'm trying to install it in a Solaris v7.0 -intel based pc-, I downloaded the software, then decompress and try to configure it. I follow the instuctions in the instalation file, I try the two types of instalation (active and static) and the same error comes when I give the make or make install commands. The probles is this: (well I try to compile it with apache 1.3.6). crypt.c: In function `php_if_crypt': crypt.c:110: `PHP_MAX_SALT_LEN' undeclared (first use in this function) crypt.c:110: (Each undeclared identifier is reported only once crypt.c:110: for each function it appears in.) crypt.c:110: size of array `salt' has non-integer type crypt.c: At top level: crypt.c:101: warning: `php_to64' defined but not used make[3]: *** [crypt.lo] Error 1 make[3]: Leaving directory `/opt/install/php-4.0RC1/ext/standard' make[2]: *** [all-recursive] Error 1 make[2]: Leaving directory `/opt/install/php-4.0RC1/ext/standard' make[1]: *** [all] Error 1 make[1]: Leaving directory `/opt/install/php-4.0RC1/ext' make: *** [all-recursive] Error 1 I dont know whats the matter whit this problem, please if some1 know something to solve this problem let me know. Thanks. -- Atte: Mario Flores Rodríguez e-mail: mflores@citi.com.mx

« previous php.version4 (#13680) next »