Re: [PHP4BETA] Testing ... PHP 4.0RC2 tarball

From: Date: Sat, 06 May 2000 12:24:54 +0000
Subject: Re: [PHP4BETA] Testing ... PHP 4.0RC2 tarball
References: 1  Groups: php.version4 
Request: Send a blank email to php-version4+get-14582@lists.php.net to get a copy of this message
Hello again Sascha, > > we are planning to release PHP 4.0 Release Candidate 2 on Monday. > > > > Let us know whether it works for you: configure still putting 0 in SIZEOF_INT & LONG in php_config.h If I change them to 4 it then breaks further on as before :-( Using ./configure --without-mysql --enable track-vars at the moment util it compiles. /bin/sh /usr/src/php-4.0RC2/libtool --silent --mode=link c -g -O2 -Wall -o php -export-dynamic stub.lo libphp4.la Undefined first referenced symbol in file php_minit_syslog .libs/libphp4.a(basic_functions.o) php_rshutdown_syslog .libs/libphp4.a(basic_functions.o) php_rinit_syslog .libs/libphp4.a(basic_functions.o) php_if_syslog .libs/libphp4.a(basic_functions.o) php: fatal error: Symbol referencing errors. No output written to php collect2: ld returned 1 exit status gmake[1]: *** [php] Error 1 gmake[1]: Leaving directory `/usr/src/php-4.0RC2' gmake: *** [all-recursive] Error 1 I'll send you a complete list of the make and config.log off list - should be with you soon. Best regards, Paul

« previous php.version4 (#14582) next »