Compile Errors with Apache
| From: | Michael Stearne | Date: | Tue, 20 Jul 1999 22:51:02 +0000 |
| Subject: | Compile Errors with Apache | ||
| Groups: | php.version4 | ||
| Request: | Send a blank email to php-version4+get-2373@lists.php.net to get a copy of this message | ||
Redhat 6.0 (2.2.5-15) 96MB, PII266 (Mobile).
I am getting compile errors when I get to the compiling Apache part of
the installation. I can compile PHP4B1 fine using:
./configure --with-mysql --without-gd --with-apache=../apache_1.3.6
--enable-track-vars
(I had to take gd out because of the gd 1.6 issue or whatever, it
couldn't fine gettext.c or something)
Then:
./configure --prefix=/www --activate-module=src/modules/php4/libphp4.a
Works fine but when I make it, it's ok for a while then I get:
.
.
.
gcc -c -I../../os/unix -I../../include -DLINUX=2 -DUSE_HSREGEX
../../apaci mod_auth.c
gcc -c -I../../os/unix -I../../include -DLINUX=2 -DUSE_HSREGEX
../../apaci mod_setenvif.crm -f libstandard.a
ar cr libstandard.a mod_env.o mod_log_config.o mod_mime.o
mod_negotiation.o mod_status.o mod_include.o mod_autoindex.o mod_dir.o
mod_cgi.o mod_asis.o mod_imap.o mod_actions.o mod_userdir.o mod_alias.o
mod_access.o mod_auth.o mod_setenvif.o
ranlib libstandard.a
<=== src/modules/standard
===> src/modules/php4
make[4]: *** No rule to make target `all'. Stop.
make[3]: *** [all] Error 1
make[2]: *** [subdirs] Error 1
make[2]: Leaving directory `/root/apache_1.3.6/src'
make[1]: *** [build-std] Error 2
make[1]: Leaving directory `/root/apache_1.3.6'
make: *** [build] Error 2
Then it stops. Is this a know issue? Also, is there a way to browse
the PHP4 bugs DB?
Thanks,
Michael