Compile Problems

From: Date: Wed, 28 Jul 1999 11:04:22 +0000
Subject: Compile Problems
Groups: php.version4 
Request: Send a blank email to php-version4+get-2896@lists.php.net to get a copy of this message
Hello all, after several problems with sybase-ct I've updated my CVS-Tree. After a new "buildconf" and "configure" i get the following Compiler message, and the build fails. ############################ gcc -DHAVE_CONFIG_H -I. -I. -I../.. -I../../libzend -I../../TSRM -I/usr/src/apache/src/include -I/usr/src/apache/src/os/unix -I/home/sybase/include -I../.. -I../../libzend -g -O2 -g -O2 -c soundex.c soundex.c: In function `php3_soundex': soundex.c:80: `code' undeclared (first use this function) soundex.c:80: (Each undeclared identifier is reported only once soundex.c:80: for each function it appears in.) soundex.c:85: `last' undeclared (first use this function) make[2]: *** [soundex.o] Error 1 make[2]: Leaving directory `/usr/src/php4/ext/standard' make[1]: *** [all-recursive] Error 1 make[1]: Leaving directory `/usr/src/php4/ext' make: *** [all-recursive] Error 1 ############################ Yours Hans-Peter Straub -- -------------------------------* GKS I-NetPartner GmbH Hans-Peter Straub Seewiesenstrasse 12 D-73054 Eislingen -- Phone: +49 7161 9849955 Fax: +49 7161 9849956 -- eMail: straub@i-netpartner.de Web: http://www.i-netpartner.de -------------------------------*

« previous php.version4 (#2896) next »