Error in compiling

From: Date: Sat, 23 Oct 1999 12:12:22 +0000
Subject: Error in compiling
Groups: php.version4 
Request: Send a blank email to php-version4+get-5656@lists.php.net to get a copy of this message
Hi, today (23/10) I have downlad php4 and libzend.TRSM from cvs. but after buildconf and configure when I go to compile the program I get: make all-recursive make[1]: Entering directory `/src/php4-cvs/php4' Making all in libzend make[2]: Entering directory `/src/php4-cvs/php4/libzend' /bin/sh ./libtool --silent --mode=compile gcc -DHAVE_CONFIG_H -I. -I/src/php4-cvs/php4/./libzend -I. -I../TSRM -g -O2 -g -c zend-parser.c /usr/lib/bison.simple:153: conflicting types for `zendparse' /src/php4-cvs/php4/./libzend/zend_globals_macros.h:39: previous declaration of `zendparse' /usr/lib/bison.simple: In function `zendparse': /usr/lib/bison.simple:219: number of arguments doesn't match prototype /usr/lib/bison.simple:153: prototype declaration make[2]: *** [zend-parser.lo] Error 1 make[2]: Leaving directory `/src/php4-cvs/php4/libzend' make[1]: *** [all-recursive] Error 1 make[1]: Leaving directory `/src/php4-cvs/php4' make: *** [all-recursive-am] Error 2 Why this? thnx... "Te riempo de botte, che il tuo cellulare da Family diventa Orfany". -- Michel <ZioBudda> Morelli michel@enter.it http://ziobudda.enter.it Italian Linux FAQ http://ziobudda.enter.it/FAQ/ Italian Linux Press http://ziobudda.enter.it/ILP/

« previous php.version4 (#5656) next »