PHP4b3 Compile Error on Solaris 7 x86
| From: | chris at delpreston dot com | Date: | Thu, 18 Nov 1999 05:58:40 +0000 |
| Subject: | PHP4b3 Compile Error on Solaris 7 x86 | ||
| Groups: | php.version4 | ||
| Request: | Send a blank email to php-version4+get-6424@lists.php.net to get a copy of this message | ||
I am getting the following error when trying to build apache 1.3.9 with
php4b3 - not sure really where to begin..
thanks
gcc -c -I../os/unix -I../include -DSOLARIS2=270
-I/export/work/soft/php-4.0b3
-I/export/work/soft/php-4.0b3/libzend
-I/export/work/soft/php-4.0b3/libzend -I/
export/work/soft/php-4.0b3 -DUSE_HSREGEX -DUSE_EXPAT -I../lib/expat-lite
`../apa
ci` util_uri.c
util_uri.c: In function `ap_parse_uri_components':
util_uri.c:468: `uri_delims' undeclared (first use in this function)
util_uri.c:468: (Each undeclared identifier is reported only once
util_uri.c:468: for each function it appears in.)
make[3]: *** [util_uri.o] Error 1
make[2]: *** [subdirs] Error 1
make[2]: Leaving directory `/export/work/soft/apache_1.3.9/src'
make[1]: *** [build-std] Error 2
make[1]: Leaving directory `/export/work/soft/apache_1.3.9'
make: *** [build] Error 2