I get error on array.c

From: Date: Fri, 19 Nov 1999 23:07:10 +0000
Subject: I get error on array.c
Groups: php.version4 
Request: Send a blank email to php-version4+get-6543@lists.php.net to get a copy of this message
Hi, i am trying to compile php4b3 on Linux Debian and get the following errors: array.c: In function `php3_reset': array.c:582: `return_value_used' undeclared (first use this function) array.c:582: (Each undeclared identifier is reported only once array.c:582: for each function it appears in.) make[3]: *** [array.lo] Error 1 make[3]: Leaving directory `/www-data/software/php-4.0b3/ext/standard' make[2]: *** [all-recursive] Error 1 make[2]: Leaving directory `/www-data/software/php-4.0b3/ext' make[1]: *** [all-recursive] Error 1 make[1]: Leaving directory `/www-data/software/php-4.0b3' make: *** [all-recursive-am] Error 2 I am trying to configure only with apache 1.3.9 and mysql ./configure --with-mysql --with-apache=../apache_1.3.9 --enable-track-vars any ide? -- Danilo Hernandez

« previous php.version4 (#6543) next »