re: Details of Linux / PHP4B3 compile error

From: Date: Thu, 02 Dec 1999 21:30:14 +0000
Subject: re: Details of Linux / PHP4B3 compile error
Groups: php.version4 
Request: Send a blank email to php-version4+get-7275@lists.php.net to get a copy of this message
Dec 2, 1999 Hello, I had gotten somewhat similar behavior when 'gmake' got to the same file mentioned below, 'zend_execute.c'. The compilation eventually aborted on that file, with an error message to the effect that there was no more memory left (!). I compiled the file by hand, mimicking what was in the Makefile, but leaving out, more or less arbitrarily, the flag '-O2'. Anyway, the compile then worked fine, but I sure wasn't very comfortable with what had happened. This was on a Sun Solaris 2.6 machine, with the Netscape Enterprise 4.0 server. Bob Boeninger, boe@slac.stanford.edu ======================== > Thanks to all that have replied so far - here is the output that is >generated from the Make process: > gcc: Internal compiler error : program cc1 got fatal signal 7 > make[2]: *** [zend_execute.lo] Error 1 > make[1]: *** [all_recursive] Error 1 > make: *** [all_recursive-am] Error 2 > [root@lx_server php-4.0b3]# > Done on RedHat 6.0 with Apache 1.3.9 and MySQL 3.22.27 - I did not do > anything out of the ordinary. Extracted the source for Apache, MySQL > and PHP4B3 into /tmp. The ./Configure on PHP4 worked fine - the > process completed without any errors but the above error came up >after doing the Make (it was busy for a while before it stopped with > the error. > Thanks in advance.... > Xander ...

« previous php.version4 (#7275) next »