Another Compilation Error...

From: Date: Thu, 02 Dec 1999 23:23:23 +0000
Subject: Another Compilation Error...
Groups: php.version4 
Request: Send a blank email to php-version4+get-7294@lists.php.net to get a copy of this message
Hi I've got a Slackware 7.0 system here, trying to compile PHP 4.0b3 with Apache 1.3.9, LDAP (latest version) and MySQL (latest beta version) support, but it fails mysteriously: --- Making all in standard make[3]: Entering directory `/usr/local/src/web/php- 4.0b3/ext/standard' /bin/sh ../../libtool --silent --mode=compile gcc -DHAVE_CONFIG_H -I. -I. -I../.. -I../../libzend -I../.. -I../../libzend - I/usr/local/src/web/apache_1.3.9/src/include - I/usr/local/src/web/apache_1.3.9/src/os/unix - I/usr/local/ldap/include -I/usr/local/mysql/include/mysql -g -O2 -g -O2 -c -o array.lo array.c array.c: In function `php3_reset': array.c:582: `return_value_used' undeclared (first use in this function) array.c:582: (Each undeclared identifier is reported only once array.c:582: for each function it appears in.) make[3]: *** [array.lo] Error 1 make[3]: Leaving directory `/usr/local/src/web/php- 4.0b3/ext/standard' make[2]: *** [all-recursive] Error 1 make[2]: Leaving directory `/usr/local/src/web/php-4.0b3/ext' make[1]: *** [all-recursive] Error 1 make[1]: Leaving directory `/usr/local/src/web/php-4.0b3' make: *** [all-recursive-am] Error 2 --- I can't work out what's wrong... can anyone help? This happens with PHP 4.0b2 on the same box too. Peter. --- Peter Hicks Network Engineer peter <DOT> hicks (AT) poggs.co.uk

« previous php.version4 (#7294) next »