Current CVS does not compile

From: Date: Sun, 19 Dec 1999 22:25:29 +0000
Subject: Current CVS does not compile
Groups: php.version4 
Request: Send a blank email to php-version4+get-8184@lists.php.net to get a copy of this message
I checked a fresh CVS of php4/Zend/TSRM and as per Sascha's suggestion have a separate build dir (phpbuild). The directory layout is like this /usr/local/src php4 Zend TSRM phpbuild I did a buildconf in php4 and the configure command in phpbuild. When I do a make. I get the following errors in internal_functions.c BTW, The instructions to compile out of CVS should change on the web-page given recent changes to the build system If I don't have a separte build dir, then I can't even compile Zend. It complains about not finding libtool Regards, Yusuf -- Yusuf Goolamabbas yusufg@outblaze.com

internal_functions.c:43: `phpext_regex_ptr' undeclared here (not in a function) internal_functions.c:43: initializer element for `php_builtin_extensions[0]' is not constant internal_functions.c:44: `phpext_dl_ptr' undeclared here (not in a function) internal_functions.c:44: initializer element for `php_builtin_extensions[1]' is not constant internal_functions.c:45: `phpext_file_ptr' undeclared here (not in a function) internal_functions.c:45: initializer element for `php_builtin_extensions[2]' is not constant internal_functions.c:46: `phpext_fsock_ptr' undeclared here (not in a function) internal_functions.c:46: initializer element for `php_builtin_extensions[3]' is not constant internal_functions.c:47: `phpext_head_ptr' undeclared here (not in a function) internal_functions.c:47: initializer element for `php_builtin_extensions[4]' is not constant internal_functions.c:48: `phpext_pack_ptr' undeclared here (not in a function) internal_functions.c:48: initializer element for `php_builtin_extensions[5]' is not constant internal_functions.c:49: `phpext_browscap_ptr' undeclared here (not in a function) internal_functions.c:49: initializer element for `php_builtin_extensions[6]' is not constant internal_functions.c:50: `phpext_crypt_ptr' undeclared here (not in a function) internal_functions.c:50: initializer element for `php_builtin_extensions[7]' is not constant internal_functions.c:51: `phpext_dir_ptr' undeclared here (not in a function) internal_functions.c:51: initializer element for `php_builtin_extensions[8]' is not constant internal_functions.c:52: `phpext_filestat_ptr' undeclared here (not in a function) internal_functions.c:52: initializer element for `php_builtin_extensions[9]' is not constant internal_functions.c:53: `phpext_mail_ptr' undeclared here (not in a function) internal_functions.c:53: initializer element for `php_builtin_extensions[10]' is not constant internal_functions.c:54: `phpext_syslog_ptr' undeclared here (not in a function) internal_functions.c:54: initializer element for `php_builtin_extensions[11]' is not constant internal_functions.c:55: `phpext_lcg_ptr' undeclared here (not in a function) internal_functions.c:55: initializer element for `php_builtin_extensions[12]' is not constant internal_functions.c:56: `phpext_metaphone_ptr' undeclared here (not in a function) internal_functions.c:56: initializer element for `php_builtin_extensions[13]' is not constant internal_functions.c:58: `phpext_array_ptr' undeclared here (not in a function) internal_functions.c:58: initializer element for `php_builtin_extensions[15]' is not constant internal_functions.c:59: `phpext_assert_ptr' undeclared here (not in a function) internal_functions.c:59: initializer element for `php_builtin_extensions[16]' is not constant make[2]: *** [internal_functions.lo] Error 1 make[1]: *** [all-recursive] Error 1 make: *** [all-recursive-am] Error 2
« previous php.version4 (#8184) next »