Apache & PHP4b3 problem

From: Date: Tue, 21 Dec 1999 17:32:24 +0000
Subject: Apache & PHP4b3 problem
Groups: php.version4 
Request: Send a blank email to php-version4+get-8322@lists.php.net to get a copy of this message
This message was sent from Geocrawler.com by "Stefan Filipiuk" <s.filipiuk@deutschland.de> Be sure to reply to that address. Hello, I've a problem and I hope U can help me. I've compiled PHP4b3 with MyQSL and SYBASE support with- out problems. The I'll compile Apache 1.3.9. But there I've become some errors. SYSTEM: SUN-Solaris Sparc 2.8 apache error: -------------------------------------------------- [...] gcc -DSOLARIS2=280 -I/export/home/stefan/php-4.0b3 -I/export/home/stefan/php-4.0b3/libzend -I/export/home/stefan/php-4.0b3/libzend -I/export/home/stefan/php-4.0b3 -DUSE_HSREGEX -DUSE_EXPAT -I./lib/expat-lite ./apaci \ -o httpd buildmark.o modules.o modules/php4/libphp4.a modules/standard/libstandard.a main/libmain.a ./os/unix/libos.a ap/libap.a regex/libregex.a lib/expat-lite/libexpat.a -R/usr/local/mysql/lib/mysql -R/usr/local/sybase/lib -Lmodules/php4 -L../modules/php4 -L../../modules/php4 -lmodphp4 -ldl -lm -lresolv -L/usr/local/mysql/lib/mysql -lpam -L/usr/local/sybase/lib -lsocket -lnsl Undefined first referenced symbol in file dbsqlexec modules/php4/libphp4.a(sybase.o) dbdata modules/php4/libphp4.a(sybase.o) mysql_get_client_info modules/php4/libphp4.a(php_mysql.o) dbdatlen modules/php4/libphp4.a(sybase.o) mysql_drop_db modules/php4/libphp4.a(php_mysql.o) dbloginfree modules/php4/libphp4.a(sybase.o) mysql_close modules/php4/libphp4.a(php_mysql.o) mysql_fetch_lengths modules/php4/libphp4.a(php_mysql.o) dblastrow modules/php4/libphp4.a(sybase.o) mysql_free_result modules/php4/libphp4.a(php_mysql.o) dbmsghandle modules/php4/libphp4.a(sybase.o) dbopen modules/php4/libphp4.a(sybase.o) mysql_create_db modules/php4/libphp4.a(php_mysql.o) dblogin modules/php4/libphp4.a(sybase.o) dberrhandle modules/php4/libphp4.a(sybase.o) mysql_field_seek modules/php4/libphp4.a(php_mysql.o) mysql_list_fields modules/php4/libphp4.a(php_mysql.o) mysql_fetch_row modules/php4/libphp4.a(php_mysql.o) dbwillconvert modules/php4/libphp4.a(sybase.o) mysql_real_query modules/php4/libphp4.a(php_mysql.o) mysql_real_connect modules/php4/libphp4.a(php_mysql.o) dbsetopt modules/php4/libphp4.a(sybase.o) mysql_stat modules/php4/libphp4.a(php_mysql.o) dbcount modules/php4/libphp4.a(sybase.o) dbcoltype modules/php4/libphp4.a(sybase.o) dbinit modules/php4/libphp4.a(sybase.o) dbnumcols modules/php4/libphp4.a(sybase.o) mysql_fetch_field modules/php4/libphp4.a(php_mysql.o) dbuse modules/php4/libphp4.a(sybase.o) mysql_list_dbs modules/php4/libphp4.a(php_mysql.o) dbversion modules/php4/libphp4.a(sybase.o) dbcolsource modules/php4/libphp4.a(sybase.o) dbcollen modules/php4/libphp4.a(sybase.o) dbcolname modules/php4/libphp4.a(sybase.o) mysql_select_db modules/php4/libphp4.a(php_mysql.o) dbdead modules/php4/libphp4.a(sybase.o) mysql_store_result modules/php4/libphp4.a(php_mysql.o) dbexit modules/php4/libphp4.a(sybase.o) mysql_list_tables modules/php4/libphp4.a(php_mysql.o) dbsetlname modules/php4/libphp4.a(sybase.o) mysql_data_seek modules/php4/libphp4.a(php_mysql.o) dbresults modules/php4/libphp4.a(sybase.o) dbconvert modules/php4/libphp4.a(sybase.o) dbcmd modules/php4/libphp4.a(sybase.o) dbsetifile modules/php4/libphp4.a(sybase.o) dbclose modules/php4/libphp4.a(sybase.o) dbclrbuf modules/php4/libphp4.a(sybase.o) mysql_init modules/php4/libphp4.a(php_mysql.o) dbnextrow modules/php4/libphp4.a(sybase.o) ld: fatal: Symbol referencing errors. No output written to httpd collect2: ld returned 1 exit status make[2]: *** [target_static] Error 1 make[2]: Leaving directory `/export/home/stefan/apache_1.3.9/src' make[1]: *** [build-std] Error 2 make[1]: Leaving directory `/export/home/stefan/apache_1.3.9' make: *** [build] Error 2 -------------------------------------------------- Can everyone help me plz THX PS: sorry for the long text -Stefan- Geocrawler.com - The Knowledge Archive

« previous php.version4 (#8322) next »