Test results for 5.2.7RC3 [failed]
| From: | noreply@php.net | Date: | Sat, 08 Nov 2008 23:04:39 +0000 |
| Subject: | Test results for 5.2.7RC3 [failed] | ||
| Groups: | php.qa.reports | ||
| Request: | Send a blank email to php-qa-reports+get-13141@lists.php.net to get a copy of this message | ||
=====================================================================
FAILED TEST SUMMARY
---------------------------------------------------------------------
Bug #45392 (ob_start()/ob_end_clean() and memory_limit) [tests/lang/bug45392.phpt]
Bug #43128 (Very long class name causes segfault) [Zend/tests/bug43128.phpt]
Bug #16069 (ICONV transliteration failure) [ext/iconv/tests/bug16069.phpt]
iconv stream filter [ext/iconv/tests/iconv_stream_filter.phpt]
ob_iconv_handler() charset parameter length checks (CVE-2007-4840)
[ext/iconv/tests/ob_iconv_handler-charset-length-cve-2007-4840.phpt]
Bug #41125 (PDO mysql + quote() + prepare() can result in seg fault)
[ext/pdo_mysql/tests/bug41125.phpt]
Bug #44327 (PDORow::queryString property & numeric offsets / Crash)
[ext/pdo_mysql/tests/bug44327.phpt]
Test session_decode() function : variation [ext/session/tests/session_decode_variation3.phpt]
Test session_encode() function : variation [ext/session/tests/session_encode_variation8.phpt]
Test array_slice() function : usage variations - Pass different data types as $offset arg
[ext/standard/tests/array/array_slice_variation2.phpt]
Test array_slice() function : usage variations - Pass different data types as $length arg
[ext/standard/tests/array/array_slice_variation3.phpt]
htmlentities() test 2 (setlocale / fr_FR.ISO-8859-15)
[ext/standard/tests/strings/htmlentities02.phpt] (warn: possibly braindead libc)
htmlentities() test 4 (setlocale / ja_JP.EUC-JP) [ext/standard/tests/strings/htmlentities04.phpt]
(warn: possibly braindead libc)
htmlentities() test 15 (setlocale / KOI8-R) [ext/standard/tests/strings/htmlentities15.phpt] (warn:
possibly braindead libc)
Bug #40576 (double values are truncated to 6 decimal digits when encoding)
[ext/xmlrpc/tests/bug40576.phpt]
=====================================================================
=====================================================================
EXPECTED FAILED TEST SUMMARY
---------------------------------------------------------------------
SPL: ArrayObject::__construct basic usage with ArrayObject::ARRAY_AS_PROPS.
[ext/spl/tests/arrayObject___construct_basic4.phpt]
SPL: ArrayObject::__construct basic usage with
ArrayObject::STD_PROP_LIST|ArrayObject::ARRAY_AS_PROPS.
[ext/spl/tests/arrayObject___construct_basic5.phpt]
SPL: ArrayObject::exchangeArray() basic usage with object as underlying data store.
[ext/spl/tests/arrayObject_exchangeArray_basic3.phpt]
SPL: ArrayObject::setFlags basic usage with ArrayObject::ARRAY_AS_PROPS.
[ext/spl/tests/arrayObject_setFlags_basic1.phpt]
=====================================================================
=====================================================================
TEST RESULT SUMMARY
---------------------------------------------------------------------
Exts skipped : 48
Exts tested : 31
---------------------------------------------------------------------
Number of tests : 6110 4554
Tests skipped : 1556 ( 25.5%) --------
Tests warned : 3 ( 0.0%) ( 0.1%)
Tests failed : 12 ( 0.2%) ( 0.3%)
Expected fail : 4 ( 0.1%) ( 0.1%)
Tests passed : 4535 ( 74.2%) ( 99.6%)
---------------------------------------------------------------------
Time taken : 254 seconds
=====================================================================
=====================================================================
FAILED TEST SUMMARY
---------------------------------------------------------------------
Bug #45392 (ob_start()/ob_end_clean() and memory_limit) [tests/lang/bug45392.phpt]
Bug #43128 (Very long class name causes segfault) [Zend/tests/bug43128.phpt]
Bug #16069 (ICONV transliteration failure) [ext/iconv/tests/bug16069.phpt]
iconv stream filter [ext/iconv/tests/iconv_stream_filter.phpt]
ob_iconv_handler() charset parameter length checks (CVE-2007-4840)
[ext/iconv/tests/ob_iconv_handler-charset-length-cve-2007-4840.phpt]
Bug #41125 (PDO mysql + quote() + prepare() can result in seg fault)
[ext/pdo_mysql/tests/bug41125.phpt]
Bug #44327 (PDORow::queryString property & numeric offsets / Crash)
[ext/pdo_mysql/tests/bug44327.phpt]
Test session_decode() function : variation [ext/session/tests/session_decode_variation3.phpt]
Test session_encode() function : variation [ext/session/tests/session_encode_variation8.phpt]
Test array_slice() function : usage variations - Pass different data types as $offset arg
[ext/standard/tests/array/array_slice_variation2.phpt]
Test array_slice() function : usage variations - Pass different data types as $length arg
[ext/standard/tests/array/array_slice_variation3.phpt]
htmlentities() test 2 (setlocale / fr_FR.ISO-8859-15)
[ext/standard/tests/strings/htmlentities02.phpt] (warn: possibly braindead libc)
htmlentities() test 4 (setlocale / ja_JP.EUC-JP) [ext/standard/tests/strings/htmlentities04.phpt]
(warn: possibly braindead libc)
htmlentities() test 15 (setlocale / KOI8-R) [ext/standard/tests/strings/htmlentities15.phpt] (warn:
possibly braindead libc)
Bug #40576 (double values are truncated to 6 decimal digits when encoding)
[ext/xmlrpc/tests/bug40576.phpt]
=====================================================================
=====================================================================
EXPECTED FAILED TEST SUMMARY
---------------------------------------------------------------------
SPL: ArrayObject::__construct basic usage with ArrayObject::ARRAY_AS_PROPS.
[ext/spl/tests/arrayObject___construct_basic4.phpt]
SPL: ArrayObject::__construct basic usage with
ArrayObject::STD_PROP_LIST|ArrayObject::ARRAY_AS_PROPS.
[ext/spl/tests/arrayObject___construct_basic5.phpt]
SPL: ArrayObject::exchangeArray() basic usage with object as underlying data store.
[ext/spl/tests/arrayObject_exchangeArray_basic3.phpt]
SPL: ArrayObject::setFlags basic usage with ArrayObject::ARRAY_AS_PROPS.
[ext/spl/tests/arrayObject_setFlags_basic1.phpt]
=====================================================================
================================================================================
/home/siouxsports/php-5.2.7RC3/tests/lang/bug45392.phpt
================================================================================
2
Fatal error: Allowed memory size of 262144 bytes exhausted (tried to allocate 225281 bytes) in
/home/siouxsports/php-5.2.7RC3/tests/lang/bug45392.php on line 9
================================================================================
003- 5
================================================================================
================================================================================
/home/siouxsports/php-5.2.7RC3/Zend/tests/bug43128.phpt
================================================================================
Fatal error: Allowed memory size of 16777216 bytes exhausted (tried to allocate 10485767 bytes) in
/home/siouxsports/php-5.2.7RC3/Zend/tests/bug43128.php on line 5
================================================================================
001+ Fatal error: Allowed memory size of 16777216 bytes exhausted (tried to allocate 10485767 bytes)
in /home/siouxsports/php-5.2.7RC3/Zend/tests/bug43128.php on line 5
001- ok
================================================================================
================================================================================
/home/siouxsports/php-5.2.7RC3/ext/iconv/tests/bug16069.phpt
================================================================================
????????????????????????????????????????(¡ë§¥¡ë)
================================================================================
001+ ????????????????????????????????????????(¡ë§¥¡ë)
001-
¥ß¥ê¥Ð¡¼¥ë¥ß¥ê¥Ð¡¼¥ë¥ß¥ê¥Ð¡¼¥ë¥ß¥ê¥Ð¡¼¥ë¥ß¥ê¥Ð¡¼¥ë¥ß¥ê¥Ð¡¼¥ë¥ß¥ê¥Ð¡¼¥ë¥ß¥ê¥Ð¡¼¥ë¥ß¥ê¥Ð¡¼¥ë¥ß¥ê¥Ð¡¼¥ë¥ß¥ê¥Ð¡¼¥ë¥ß¥ê¥Ð¡¼¥ë¥ß¥ê¥Ð¡¼¥ë¥ß¥ê¥Ð¡¼¥ë¥ß¥ê¥Ð¡¼¥ë¥ß¥ê¥Ð¡¼¥ë¥ß¥ê¥Ð¡¼¥ë¥ß¥ê¥Ð¡¼¥ë¥ß¥ê¥Ð¡¼¥ë¥ß¥ê¥Ð¡¼¥ë¥ß¥ê¥Ð¡¼¥ë¥ß¥ê¥Ð¡¼¥ë¥ß¥ê¥Ð¡¼¥ë¥ß¥ê¥Ð¡¼¥ë¥ß¥ê¥Ð¡¼¥ë¥ß¥ê¥Ð¡¼¥ë¥ß¥ê¥Ð¡¼¥ë¥ß¥ê¥Ð¡¼¥ë¥ß¥ê¥Ð¡¼¥ë¥ß¥ê¥Ð¡¼¥ë¥ß¥ê¥Ð¡¼¥ë¥ß¥ê¥Ð¡¼¥ë¥ß¥ê¥Ð¡¼¥ë¥ß¥ê¥Ð¡¼¥ë¥ß¥ê¥Ð¡¼¥ë¥ß¥ê¥Ð¡¼¥ë¥ß¥ê¥Ð¡¼¥ë¥ß¥ê¥Ð¡¼¥ë¥ß¥ê¥Ð¡¼¥ë¥ß¥ê¥Ð¡¼¥ë(¡ë§¥¡ë)
================================================================================
================================================================================
/home/siouxsports/php-5.2.7RC3/ext/iconv/tests/iconv_stream_filter.phpt
================================================================================
string(20) "1b244224332473244b24"
string(10) "41244f1b28"
string(2) "42"
string(20) "a4b3a4f3a4cba4c1a4cf"
string(10) "69636f6e76"
string(2) "0a"
string(20) "1b244f24332466245824"
string(10) "4e24421b28"
string(2) "4f"
================================================================================
007+ string(20) "1b244f24332466245824"
008+ string(10) "4e24421b28"
009+ string(2) "4f"
007-
008- Warning: fread(): iconv stream filter ("ISO-2022-JP"=>"EUC-JP"): invalid
multibyte sequence in %s on line %d
009- string(0) ""
010- string(0) ""
011- string(0) ""
================================================================================
================================================================================
/home/siouxsports/php-5.2.7RC3/ext/iconv/tests/ob_iconv_handler-charset-length-cve-2007-4840.phpt
================================================================================
Fatal error: Allowed memory size of 16777216 bytes exhausted (tried to allocate 9000001 bytes) in
/home/siouxsports/php-5.2.7RC3/ext/iconv/tests/ob_iconv_handler-charset-length-cve-2007-4840.php on
line 2
================================================================================
001+ Fatal error: Allowed memory size of 16777216 bytes exhausted (tried to allocate 9000001 bytes)
in /home/siouxsports/php-5.2.7RC3/ext/iconv/tests/ob_iconv_handler-charset-length-cve-2007-4840.php
on line 2
001- done
================================================================================
================================================================================
/home/siouxsports/php-5.2.7RC3/ext/pdo_mysql/tests/bug41125.phpt
================================================================================
Fatal error: Uncaught exception 'PDOException' with message 'SQLSTATE[HY000] [2002]
Can't connect to local MySQL server through socket '/var/lib/mysql/mysql.sock'
(2)' in /home/siouxsports/php-5.2.7RC3/ext/pdo/tests/pdo_test.inc:36
Stack trace:
#0 /home/siouxsports/php-5.2.7RC3/ext/pdo/tests/pdo_test.inc(36):
PDO->__construct('mysql:host=loca...', 'root', '', NULL)
#1 /home/siouxsports/php-5.2.7RC3/ext/pdo/tests/pdo_test.inc(83): PDOTest::factory()
#2 /home/siouxsports/php-5.2.7RC3/ext/pdo_mysql/tests/bug41125.php(5):
PDOTest::test_factory('/home/siouxspor...')
#3 {main}
thrown in /home/siouxsports/php-5.2.7RC3/ext/pdo/tests/pdo_test.inc on line 36
================================================================================
001+ Fatal error: Uncaught exception 'PDOException' with message 'SQLSTATE[HY000]
[2002] Can't connect to local MySQL server through socket '/var/lib/mysql/mysql.sock'
(2)' in /home/siouxsports/php-5.2.7RC3/ext/pdo/tests/pdo_test.inc:36
002+ Stack trace:
003+ #0 /home/siouxsports/php-5.2.7RC3/ext/pdo/tests/pdo_test.inc(36):
PDO->__construct('mysql:host=loca...', 'root', '', NULL)
004+ #1 /home/siouxsports/php-5.2.7RC3/ext/pdo/tests/pdo_test.inc(83): PDOTest::factory()
005+ #2 /home/siouxsports/php-5.2.7RC3/ext/pdo_mysql/tests/bug41125.php(5):
PDOTest::test_factory('/home/siouxspor...')
006+ #3 {main}
007+ thrown in /home/siouxsports/php-5.2.7RC3/ext/pdo/tests/pdo_test.inc on line 36
001- 1
002- 00000
003- -------------------------------------------------------
004- [1] Query: [[SELECT 1 FROM DUAL WHERE 1 = '?\'\'']]
005-
006- 00000
007- --------
008- [2] Query: [[SELECT 'a\'0' FROM DUAL WHERE 1 = ?]]
009- a'0
010- 00000
011- --------
012- [3] Query: [[SELECT 'a', 'b\'' FROM DUAL WHERE
'''' LIKE '\'' AND ?]]
013- a - b'
014- 00000
015- --------
016- [4] Query: [[SELECT 'foo?bar', '', '''' FROM DUAL WHERE
?]]
017- foo?bar - - '
018- 00000
019- --------
020- Query: [[SELECT upper(:id) FROM DUAL WHERE '1']]
021- O'\0
022- 00000
023- -------------------------------------------------------
024- [1] Query: [[SELECT 1, 'foo' FROM DUAL WHERE 1 = :id AND '\0' IS NULL AND
2 <> :id]]
025-
026- 00000
027- --------
028- [2] Query: [[SELECT 1 FROM DUAL WHERE 1 = :id AND '' AND 2 <> :id]]
029-
030- 00000
031- --------
032- [3] Query: [[SELECT 1 FROM DUAL WHERE 1 = :id AND '\'\'' =
'''' AND 2 <> :id]]
033-
034- 00000
035- --------
036- [4] Query: [[SELECT 1 FROM DUAL WHERE 1 = :id AND '\'' =
'''' AND 2 <> :id]]
037- 1
038- 00000
039- --------
040- [5] Query: [[SELECT 'a', 'b\'' FROM DUAL WHERE
'''' LIKE '\'' AND 1]]
041- a - b'
042- 00000
043- --------
044- [6] Query: [[SELECT 'a''', '\'b\'' FROM DUAL WHERE
'''' LIKE '\'' AND 1]]
045- a' - 'b'
046- 00000
047- --------
048- [7] Query: [[SELECT UPPER(:id) FROM DUAL WHERE '1']]
049- 1
050- 00000
051- --------
052- [8] Query: [[SELECT 1 FROM DUAL WHERE '\'']]
053-
054- 00000
055- --------
056- [9] Query: [[SELECT 1 FROM DUAL WHERE :id AND '\0' OR :id]]
057- 1
058- 00000
059- --------
060- [10] Query: [[SELECT 1 FROM DUAL WHERE 'a\f\n\0' AND 1 >= :id]]
061-
062- 00000
063- --------
064- [11] Query: [[SELECT 1 FROM DUAL WHERE '\'' = '''']]
065- 1
066- 00000
067- --------
068- [12] Query: [[SELECT '\n' '1 FROM DUAL WHERE '''' and
:id']]
069-
070- 1 FROM DUAL WHERE '' and :id
071- 00000
072- --------
073- [13] Query: [[SELECT 1 'FROM DUAL WHERE :id AND '''' =
'''' OR 1 = 1 AND ':id]]
074- 1
075- 00000
076- --------
================================================================================
================================================================================
/home/siouxsports/php-5.2.7RC3/ext/pdo_mysql/tests/bug44327.phpt
================================================================================
Fatal error: Uncaught exception 'PDOException' with message 'SQLSTATE[HY000] [2002]
Can't connect to local MySQL server through socket '/var/lib/mysql/mysql.sock'
(2)' in /home/siouxsports/php-5.2.7RC3/ext/pdo/tests/pdo_test.inc:36
Stack trace:
#0 /home/siouxsports/php-5.2.7RC3/ext/pdo/tests/pdo_test.inc(36):
PDO->__construct('mysql:host=loca...', 'root', '', NULL)
#1 /home/siouxsports/php-5.2.7RC3/ext/pdo/tests/pdo_test.inc(83): PDOTest::factory()
#2 /home/siouxsports/php-5.2.7RC3/ext/pdo_mysql/tests/bug44327.php(4):
PDOTest::test_factory('/home/siouxspor...')
#3 {main}
thrown in /home/siouxsports/php-5.2.7RC3/ext/pdo/tests/pdo_test.inc on line 36
================================================================================
001+ Fatal error: Uncaught exception 'PDOException' with message 'SQLSTATE[HY000]
[2002] Can't connect to local MySQL server through socket '/var/lib/mysql/mysql.sock'
(2)' in /home/siouxsports/php-5.2.7RC3/ext/pdo/tests/pdo_test.inc:36
002+ Stack trace:
003+ #0 /home/siouxsports/php-5.2.7RC3/ext/pdo/tests/pdo_test.inc(36):
PDO->__construct('mysql:host=loca...', 'root', '', NULL)
004+ #1 /home/siouxsports/php-5.2.7RC3/ext/pdo/tests/pdo_test.inc(83): PDOTest::factory()
005+ #2 /home/siouxsports/php-5.2.7RC3/ext/pdo_mysql/tests/bug44327.php(4):
PDOTest::test_factory('/home/siouxspor...')
006+ #3 {main}
007+ thrown in /home/siouxsports/php-5.2.7RC3/ext/pdo/tests/pdo_test.inc on line 36
001- object(PDORow)#%d (2) {
002- ["queryString"]=>
003- string(17) "SELECT 1 AS "one""
004- ["one"]=>
005- string(1) "1"
006- }
007- string(1) "1"
008- string(1) "1"
009- string(17) "SELECT 1 AS "one""
010- ----------------------------------
011- object(PDORow)#%d (2) {
012- ["queryString"]=>
013- string(19) "SELECT id FROM test"
014- ["id"]=>
015- string(1) "1"
016- }
017- string(19) "SELECT id FROM test"
018- ----------------------------------
019-
020- Notice: Trying to get property of non-object in %s on line %d
021- NULL
================================================================================
================================================================================
/home/siouxsports/php-5.2.7RC3/ext/session/tests/session_decode_variation3.phpt
================================================================================
*** Testing session_decode() : variation ***
Warning: session_start(): Cannot find save handler files in
/home/siouxsports/php-5.2.7RC3/ext/session/tests/session_decode_variation3.php on line 13
bool(true)
Notice: Undefined variable: _SESSION in
/home/siouxsports/php-5.2.7RC3/ext/session/tests/session_decode_variation3.php on line 14
NULL
array(3) {
["foo"]=>
int(1234567890)
["bar"]=>
string(5) "Blah!"
["guff"]=>
float(123.456)
}
Warning: session_decode(): Unknown session.serialize_handler. Failed to decode session object. in
/home/siouxsports/php-5.2.7RC3/ext/session/tests/session_decode_variation3.php on line 20
bool(true)
array(3) {
["foo"]=>
int(1234567890)
["bar"]=>
string(5) "Blah!"
["guff"]=>
float(123.456)
}
Warning: session_destroy(): Trying to destroy uninitialized session in
/home/siouxsports/php-5.2.7RC3/ext/session/tests/session_decode_variation3.php on line 22
bool(false)
Done
================================================================================
003+ Warning: session_start(): Cannot find save handler files in
/home/siouxsports/php-5.2.7RC3/ext/session/tests/session_decode_variation3.php on line 13
003- Warning: session_start(): Unknown session.serialize_handler. Failed to decode session object.
in %s on line %d
005+
006+ Notice: Undefined variable: _SESSION in
/home/siouxsports/php-5.2.7RC3/ext/session/tests/session_decode_variation3.php on line 14
007+ NULL
005- array(0) {
006- }
026- bool(true)
027+
028+ Warning: session_destroy(): Trying to destroy uninitialized session in
/home/siouxsports/php-5.2.7RC3/ext/session/tests/session_decode_variation3.php on line 22
029+ bool(false)
================================================================================
================================================================================
/home/siouxsports/php-5.2.7RC3/ext/session/tests/session_encode_variation8.phpt
================================================================================
*** Testing session_encode() : variation ***
Warning: session_start(): Cannot find save handler files in
/home/siouxsports/php-5.2.7RC3/ext/session/tests/session_encode_variation8.php on line 13
bool(true)
Warning: session_encode(): Cannot encode non-existent session. in
/home/siouxsports/php-5.2.7RC3/ext/session/tests/session_encode_variation8.php on line 15
string(0) ""
Warning: session_destroy(): Trying to destroy uninitialized session in
/home/siouxsports/php-5.2.7RC3/ext/session/tests/session_encode_variation8.php on line 17
bool(false)
Done
================================================================================
003+ Warning: session_start(): Cannot find save handler files in
/home/siouxsports/php-5.2.7RC3/ext/session/tests/session_encode_variation8.php on line 13
003- Warning: session_start(): Unknown session.serialize_handler. Failed to decode session object.
in %s on line %d
006+ Warning: session_encode(): Cannot encode non-existent session. in
/home/siouxsports/php-5.2.7RC3/ext/session/tests/session_encode_variation8.php on line 15
006- Warning: session_encode(): Unknown session.serialize_handler. Failed to encode session object.
in %s on line %d
008+
009+ Warning: session_destroy(): Trying to destroy uninitialized session in
/home/siouxsports/php-5.2.7RC3/ext/session/tests/session_encode_variation8.php on line 17
010+ bool(false)
008- bool(true)
================================================================================
================================================================================
/home/siouxsports/php-5.2.7RC3/ext/standard/tests/array/array_slice_variation2.phpt
================================================================================
*** Testing array_slice() : usage variations ***
-- Iteration 1 --
array(4) {
["one"]=>
int(1)
[0]=>
int(2)
["three"]=>
int(3)
[1]=>
int(4)
}
-- Iteration 2 --
array(3) {
[0]=>
int(2)
["three"]=>
int(3)
[1]=>
int(4)
}
-- Iteration 3 --
array(0) {
}
-- Iteration 4 --
array(4) {
["one"]=>
int(1)
[0]=>
int(2)
["three"]=>
int(3)
[1]=>
int(4)
}
-- Iteration 5 --
array(0) {
}
-- Iteration 6 --
array(4) {
["one"]=>
int(1)
[0]=>
int(2)
["three"]=>
int(3)
[1]=>
int(4)
}
-- Iteration 7 --
array(4) {
["one"]=>
int(1)
[0]=>
int(2)
["three"]=>
int(3)
[1]=>
int(4)
}
-- Iteration 8 --
array(4) {
["one"]=>
int(1)
[0]=>
int(2)
["three"]=>
int(3)
[1]=>
int(4)
}
-- Iteration 9 --
array(4) {
["one"]=>
int(1)
[0]=>
int(2)
["three"]=>
int(3)
[1]=>
int(4)
}
-- Iteration 10 --
array(4) {
["one"]=>
int(1)
[0]=>
int(2)
["three"]=>
int(3)
[1]=>
int(4)
}
-- Iteration 11 --
array(4) {
["one"]=>
int(1)
[0]=>
int(2)
["three"]=>
int(3)
[1]=>
int(4)
}
-- Iteration 12 --
array(3) {
[0]=>
int(2)
["three"]=>
int(3)
[1]=>
int(4)
}
-- Iteration 13 --
array(4) {
["one"]=>
int(1)
[0]=>
int(2)
["three"]=>
int(3)
[1]=>
int(4)
}
-- Iteration 14 --
array(3) {
[0]=>
int(2)
["three"]=>
int(3)
[1]=>
int(4)
}
-- Iteration 15 --
array(4) {
["one"]=>
int(1)
[0]=>
int(2)
["three"]=>
int(3)
[1]=>
int(4)
}
-- Iteration 16 --
Warning: array_slice() expects parameter 2 to be long, string given in
/home/siouxsports/php-5.2.7RC3/ext/standard/tests/array/array_slice_variation2.php on line 83
NULL
-- Iteration 17 --
Warning: array_slice() expects parameter 2 to be long, string given in
/home/siouxsports/php-5.2.7RC3/ext/standard/tests/array/array_slice_variation2.php on line 83
NULL
-- Iteration 18 --
Warning: array_slice() expects parameter 2 to be long, array given in
/home/siouxsports/php-5.2.7RC3/ext/standard/tests/array/array_slice_variation2.php on line 83
NULL
-- Iteration 19 --
Warning: array_slice() expects parameter 2 to be long, string given in
/home/siouxsports/php-5.2.7RC3/ext/standard/tests/array/array_slice_variation2.php on line 83
NULL
-- Iteration 20 --
Warning: array_slice() expects parameter 2 to be long, string given in
/home/siouxsports/php-5.2.7RC3/ext/standard/tests/array/array_slice_variation2.php on line 83
NULL
-- Iteration 21 --
Warning: array_slice() expects parameter 2 to be long, string given in
/home/siouxsports/php-5.2.7RC3/ext/standard/tests/array/array_slice_variation2.php on line 83
NULL
-- Iteration 22 --
array(4) {
["one"]=>
int(1)
[0]=>
int(2)
["three"]=>
int(3)
[1]=>
int(4)
}
-- Iteration 23 --
array(4) {
["one"]=>
int(1)
[0]=>
int(2)
["three"]=>
int(3)
[1]=>
int(4)
}
Done
================================================================================
058+ array(4) {
059+ ["one"]=>
060+ int(1)
061+ [0]=>
062+ int(2)
063+ ["three"]=>
064+ int(3)
065+ [1]=>
066+ int(4)
058- array(0) {
================================================================================
================================================================================
/home/siouxsports/php-5.2.7RC3/ext/standard/tests/array/array_slice_variation3.phpt
================================================================================
*** Testing array_slice() : usage variations ***
-- Iteration 1 --
array(0) {
}
-- Iteration 2 --
array(1) {
["three"]=>
int(3)
}
-- Iteration 3 --
array(2) {
["three"]=>
int(3)
[0]=>
int(4)
}
-- Iteration 4 --
array(0) {
}
-- Iteration 5 --
array(2) {
["three"]=>
int(3)
[0]=>
int(4)
}
-- Iteration 6 --
array(0) {
}
-- Iteration 7 --
array(0) {
}
-- Iteration 8 --
array(0) {
}
-- Iteration 9 --
array(0) {
}
-- Iteration 10 --
array(2) {
["three"]=>
int(3)
[0]=>
int(4)
}
-- Iteration 11 --
array(2) {
["three"]=>
int(3)
[0]=>
int(4)
}
-- Iteration 12 --
array(1) {
["three"]=>
int(3)
}
-- Iteration 13 --
array(0) {
}
-- Iteration 14 --
array(1) {
["three"]=>
int(3)
}
-- Iteration 15 --
array(0) {
}
-- Iteration 16 --
array(0) {
}
-- Iteration 17 --
array(0) {
}
-- Iteration 18 --
array(0) {
}
-- Iteration 19 --
array(0) {
}
-- Iteration 20 --
array(0) {
}
-- Iteration 21 --
array(0) {
}
-- Iteration 22 --
array(2) {
["three"]=>
int(3)
[0]=>
int(4)
}
-- Iteration 23 --
array(2) {
["three"]=>
int(3)
[0]=>
int(4)
}
Done
================================================================================
038+ array(0) {
038- array(2) {
039- ["three"]=>
040- int(3)
041- [0]=>
042- int(4)
================================================================================
================================================================================
/home/siouxsports/php-5.2.7RC3/ext/standard/tests/strings/htmlentities02.phpt (warn: possibly
braindead libc)
================================================================================
string(24) "¼½¾"
================================================================================
001+ string(24) "¼½¾"
001- string(20) "ŒœŸ"
================================================================================
================================================================================
/home/siouxsports/php-5.2.7RC3/ext/standard/tests/strings/htmlentities04.phpt (warn: possibly
braindead libc)
================================================================================
string(42) "¡¢¡£¡¤"
================================================================================
001+ string(42) "¡¢¡£¡¤"
001- string(6) "¡¢¡£¡¤"
================================================================================
================================================================================
/home/siouxsports/php-5.2.7RC3/ext/standard/tests/strings/htmlentities15.phpt (warn: possibly
braindead libc)
================================================================================
string(9) "ÒÏÓËÏÛÎÙÊ"
string(63)
"ÒÏÓËÏÛÎÙÊ"
================================================================================
002+ string(63)
"ÒÏÓËÏÛÎÙÊ"
002- string(63)
"роскошный"
================================================================================
================================================================================
/home/siouxsports/php-5.2.7RC3/ext/xmlrpc/tests/bug40576.phpt
================================================================================
string(125) "<?xml version="1.0" encoding="utf-8"?>
<params>
<param>
<value>
<double>1.123456789</double>
</value>
</param>
</params>
"
string(130) "<?xml version="1.0" encoding="utf-8"?>
<params>
<param>
<value>
<double>1.1234567891E+13</double>
</value>
</param>
</params>
"
string(116) "<?xml version="1.0" encoding="utf-8"?>
<params>
<param>
<value>
<int>11234567</int>
</value>
</param>
</params>
"
string(106) "<?xml version="1.0" encoding="utf-8"?>
<params>
<param>
<value>
<string/>
</value>
</param>
</params>
"
string(118) "<?xml version="1.0" encoding="utf-8"?>
<params>
<param>
<value>
<string>test</string>
</value>
</param>
</params>
"
string(139) "<?xml version="1.0" encoding="utf-8"?>
<params>
<param>
<value>
<string>1.22222222222222222222222</string>
</value>
</param>
</params>
"
Done
================================================================================
010+ string(130) "<?xml version="1.0" encoding="utf-8"?>
010- string(128) "<?xml version="1.0" encoding="utf-8"?>
014+ <double>1.1234567891E+13</double>
014- <double>11234567891000</double>
================================================================================
================================================================================
BUILD ENVIRONMENT
================================================================================
OS:
Linux - Linux siouxsports.com 2.6.18.8-linode10 #2 SMP Sat Jul 19 20:24:32 EDT 2008 i686
Autoconf:
autoconf (GNU Autoconf) 2.59
Written by David J. MacKenzie and Akim Demaille.
Copyright (C) 2003 Free Software Foundation, Inc.
This is free software; see the source for copying conditions. There is NO
warranty; not even for MERCHANTABILITY or FITNESS FOR A PARTICULAR PURPOSE.
Bundled Libtool:
ltmain.sh (GNU libtool) 1.5.20 (1.1220.2.287 2005/08/31 18:54:15)
Copyright (C) 2005 Free Software Foundation, Inc.
This is free software; see the source for copying conditions. There is NO
warranty; not even for MERCHANTABILITY or FITNESS FOR A PARTICULAR PURPOSE.
System Libtool:
N/A
Compiler:
Using built-in specs.
Target: i386-redhat-linux
Configured with: ../configure --prefix=/usr --mandir=/usr/share/man --infodir=/usr/share/info
--enable-shared --enable-threads=posix --enable-checking=release --with-system-zlib
--enable-__cxa_atexit --disable-libunwind-exceptions --enable-libgcj-multifile
--enable-languages=c,c++,objc,obj-c++,java,fortran,ada --enable-java-awt=gtk --disable-dssi
--enable-plugin --with-java-home=/usr/lib/jvm/java-1.4.2-gcj-1.4.2.0/jre --with-cpu=generic
--host=i386-redhat-linux
Thread model: posix
gcc version 4.1.2 20071124 (Red Hat 4.1.2-42)
Bison:
Libraries:
linux-gate.so.1 => (0xb7ffb000)
libcrypt.so.1 => /lib/libcrypt.so.1 (0x4fe86000)
librt.so.1 => /lib/librt.so.1 (0x4fdf7000)
libmysqlclient.so.15 => /usr/lib/mysql/libmysqlclient.so.15 (0x41300000)
libfreetype.so.6 => /usr/lib/libfreetype.so.6 (0x4ffee000)
libpng12.so.0 => /usr/lib/libpng12.so.0 (0x4fe0a000)
libz.so.1 => /usr/lib/libz.so.1 (0x4fe58000)
libjpeg.so.62 => /usr/lib/libjpeg.so.62 (0xb7fd2000)
libcurl.so.3 => /usr/lib/libcurl.so.3 (0x4124f000)
libbz2.so.1 => /usr/lib/libbz2.so.1 (0x41000000)
libresolv.so.2 => /lib/libresolv.so.2 (0x4ffce000)
libm.so.6 => /lib/libm.so.6 (0x4fdb4000)
libdl.so.2 => /lib/libdl.so.2 (0xb7fcd000)
libnsl.so.1 => /lib/libnsl.so.1 (0x4feba000)
libxml2.so.2 => /usr/lib/libxml2.so.2 (0xb7e9b000)
libgssapi_krb5.so.2 => /usr/lib/libgssapi_krb5.so.2 (0x411ea000)
libkrb5.so.3 => /usr/lib/libkrb5.so.3 (0x41155000)
libk5crypto.so.3 => /usr/lib/libk5crypto.so.3 (0x41227000)
libcom_err.so.2 => /lib/libcom_err.so.2 (0x4ffe3000)
libidn.so.11 => /usr/lib/libidn.so.11 (0xb7e69000)
libssl.so.6 => /lib/libssl.so.6 (0x412b9000)
libcrypto.so.6 => /lib/libcrypto.so.6 (0x41020000)
libc.so.6 => /lib/libc.so.6 (0x4fc6f000)
libpthread.so.0 => /lib/libpthread.so.0 (0x4fe6d000)
/lib/ld-linux.so.2 (0x4fc51000)
libkrb5support.so.0 => /usr/lib/libkrb5support.so.0 (0x41015000)
libkeyutils.so.1 => /lib/libkeyutils.so.1 (0xb7e65000)
libselinux.so.1 => /lib/libselinux.so.1 (0x4fddd000)
libsepol.so.1 => /lib/libsepol.so.1 (0xb7e1e000)
User's E-mail: jimdahl at yahoo dot com
================================================================================
PHPINFO
================================================================================
phpinfo()
PHP Version => 5.2.7RC3
System => Linux siouxsports.com 2.6.18.8-linode10 #2 SMP Sat Jul 19 20:24:32 EDT 2008 i686
Build Date => Nov 8 2008 17:17:10
Configure Command => './configure' '--with-pdo-mysql'
'--with-apxs2=/usr/local/apache2/bin/apxs' '--with-mysql=/usr'
'--with-mysqli=/usr/bin/mysql_config' '--with-jpeg-dir=/usr'
'--with-zlib' '--enable-mbstring' '--with-bz2' '--with-gd'
'--enable-gd-native-ttf' '--with-freetype-dir=/usr' '--with-xmlrpc'
'--with-curl'
Server API => Command Line Interface
Virtual Directory Support => disabled
Configuration File (php.ini) Path => /usr/local/lib
Loaded Configuration File => /usr/local/lib/php.ini
Scan this dir for additional .ini files => (none)
additional .ini files parsed => (none)
PHP API => 20041225
PHP Extension => 20060613
Zend Extension => 220060519
Debug Build => no
Thread Safety => disabled
Zend Memory Manager => enabled
IPv6 Support => enabled
Registered PHP Streams => php, file, data, http, ftp, compress.bzip2, compress.zlib
Registered Stream Socket Transports => tcp, udp, unix, udg
Registered Stream Filters => string.rot13, string.toupper, string.tolower, string.strip_tags,
convert.*, consumed, convert.iconv.*, bzip2.*, zlib.*
This program makes use of the Zend Scripting Language Engine:
Zend Engine v2.2.0, Copyright (c) 1998-2008 Zend Technologies
_______________________________________________________________________
Configuration
PHP Core
Directive => Local Value => Master Value
allow_call_time_pass_reference => Off => Off
allow_url_fopen => On => On
allow_url_include => Off => Off
always_populate_raw_post_data => Off => Off
arg_separator.input => & => &
arg_separator.output => & => &
asp_tags => Off => Off
auto_append_file => no value => no value
auto_globals_jit => On => On
auto_prepend_file => no value => no value
browscap => no value => no value
default_charset => no value => no value
default_mimetype => text/html => text/html
define_syslog_variables => Off => Off
disable_classes => no value => no value
disable_functions => no value => no value
display_errors => STDERR => STDERR
display_startup_errors => Off => Off
doc_root => no value => no value
docref_ext => no value => no value
docref_root => no value => no value
enable_dl => On => On
error_append_string => no value => no value
error_log => no value => no value
error_prepend_string => no value => no value
error_reporting => 6143 => 6143
expose_php => Off => Off
extension_dir => /usr/local/lib/php/extensions/no-debug-non-zts-20060613 =>
/usr/local/lib/php/extensions/no-debug-non-zts-20060613
file_uploads => On => On
highlight.bg => <font style="color: #FFFFFF">#FFFFFF</font> => <font
style="color: #FFFFFF">#FFFFFF</font>
highlight.comment => <font style="color: #FF8000">#FF8000</font> =>
<font style="color: #FF8000">#FF8000</font>
highlight.default => <font style="color: #0000BB">#0000BB</font> =>
<font style="color: #0000BB">#0000BB</font>
highlight.html => <font style="color: #000000">#000000</font> =>
<font style="color: #000000">#000000</font>
highlight.keyword => <font style="color: #007700">#007700</font> =>
<font style="color: #007700">#007700</font>
highlight.string => <font style="color: #DD0000">#DD0000</font> =>
<font style="color: #DD0000">#DD0000</font>
html_errors => Off => Off
ignore_repeated_errors => Off => Off
ignore_repeated_source => Off => Off
ignore_user_abort => Off => Off
implicit_flush => On => On
include_path => .:/usr/local/lib/php:/www/Zend:/www/Smarty =>
.:/usr/local/lib/php:/www/Zend:/www/Smarty
log_errors => On => On
log_errors_max_len => 1024 => 1024
magic_quotes_gpc => Off => Off
magic_quotes_runtime => Off => Off
magic_quotes_sybase => Off => Off
mail.force_extra_parameters => no value => no value
max_execution_time => 0 => 0
max_input_nesting_level => 64 => 64
max_input_time => -1 => -1
memory_limit => 16M => 16M
open_basedir => no value => no value
output_buffering => 0 => 0
output_handler => no value => no value
post_max_size => 60M => 60M
precision => 14 => 14
realpath_cache_size => 16K => 16K
realpath_cache_ttl => 120 => 120
register_argc_argv => On => On
register_globals => Off => Off
register_long_arrays => Off => Off
report_memleaks => On => On
report_zend_debug => Off => Off
safe_mode => Off => Off
safe_mode_exec_dir => no value => no value
safe_mode_gid => Off => Off
safe_mode_include_dir => no value => no value
sendmail_from => no value => no value
sendmail_path => /usr/sbin/sendmail -t -i => /usr/sbin/sendmail -t -i
serialize_precision => 100 => 100
short_open_tag => Off => Off
SMTP => localhost => localhost
smtp_port => 25 => 25
sql.safe_mode => Off => Off
track_errors => Off => Off
unserialize_callback_func => no value => no value
upload_max_filesize => 60M => 60M
upload_tmp_dir => no value => no value
user_dir => no value => no value
variables_order => GPCS => GPCS
xmlrpc_error_number => 0 => 0
xmlrpc_errors => Off => Off
y2k_compliance => On => On
zend.ze1_compatibility_mode => Off => Off
apc
APC Support => disabled
Version => 3.0.19
MMAP Support => Enabled
MMAP File Mask =>
Locking type => pthread mutex Locks
Revision => $Revision: 3.154.2.5 $
Build Date => May 18 2008 22:11:30
Directive => Local Value => Master Value
apc.cache_by_default => On => On
apc.coredump_unmap => Off => Off
apc.enable_cli => Off => Off
apc.enabled => On => On
apc.file_update_protection => 2 => 2
apc.filters => no value => no value
apc.gc_ttl => 3600 => 3600
apc.include_once_override => Off => Off
apc.max_file_size => 1M => 1M
apc.mmap_file_mask => no value => no value
apc.num_files_hint => 1000 => 1000
apc.report_autofilter => Off => Off
apc.rfc1867 => Off => Off
apc.rfc1867_freq => 0 => 0
apc.rfc1867_name => APC_UPLOAD_PROGRESS => APC_UPLOAD_PROGRESS
apc.rfc1867_prefix => upload_ => upload_
apc.shm_segments => 1 => 1
apc.shm_size => 40 => 40
apc.slam_defense => 0 => 0
apc.stat => On => On
apc.stat_ctime => Off => Off
apc.ttl => 0 => 0
apc.user_entries_hint => 4096 => 4096
apc.user_ttl => 0 => 0
apc.write_lock => On => On
bz2
BZip2 Support => Enabled
Stream Wrapper support => compress.bz2://
Stream Filter support => bzip2.decompress, bzip2.compress
BZip2 Version => 1.0.3, 15-Feb-2005
ctype
ctype functions => enabled
curl
cURL support => enabled
cURL Information => libcurl/7.15.5 OpenSSL/0.9.8b zlib/1.2.3 libidn/0.6.5
date
date/time support => enabled
"Olson" Timezone Database Version => 2008.9
Timezone Database => internal
Default timezone => America/New_York
Directive => Local Value => Master Value
date.default_latitude => 31.7667 => 31.7667
date.default_longitude => 35.2333 => 35.2333
date.sunrise_zenith => 90.583333 => 90.583333
date.sunset_zenith => 90.583333 => 90.583333
date.timezone => no value => no value
dom
DOM/XML => enabled
DOM/XML API Version => 20031129
libxml Version => 2.6.26
HTML Support => enabled
XPath Support => enabled
XPointer Support => enabled
Schema Support => enabled
RelaxNG Support => enabled
filter
Input Validation and Filtering => enabled
Revision => $Revision: 1.52.2.43 $
Directive => Local Value => Master Value
filter.default => unsafe_raw => unsafe_raw
filter.default_flags => no value => no value
gd
GD Support => enabled
GD Version => bundled (2.0.34 compatible)
FreeType Support => enabled
FreeType Linkage => with freetype
FreeType Version => 2.2.1
GIF Read Support => enabled
GIF Create Support => enabled
JPG Support => enabled
PNG Support => enabled
WBMP Support => enabled
XBM Support => enabled
hash
hash support => enabled
Hashing Engines => md2 md4 md5 sha1 sha256 sha384 sha512 ripemd128 ripemd160 ripemd256 ripemd320
whirlpool tiger128,3 tiger160,3 tiger192,3 tiger128,4 tiger160,4 tiger192,4 snefru gost adler32
crc32 crc32b haval128,3 haval160,3 haval192,3 haval224,3 haval256,3 haval128,4 haval160,4 haval192,4
haval224,4 haval256,4 haval128,5 haval160,5 haval192,5 haval224,5 haval256,5
iconv
iconv support => enabled
iconv implementation => glibc
iconv library version => 2.5
Directive => Local Value => Master Value
iconv.input_encoding => ISO-8859-1 => ISO-8859-1
iconv.internal_encoding => ISO-8859-1 => ISO-8859-1
iconv.output_encoding => ISO-8859-1 => ISO-8859-1
json
json support => enabled
json version => 1.2.1
libxml
libXML support => active
libXML Version => 2.6.26
libXML streams => enabled
mbstring
Multibyte Support => enabled
Multibyte string engine => libmbfl
Multibyte (japanese) regex support => enabled
Multibyte regex (oniguruma) version => 4.4.4
Multibyte regex (oniguruma) backtrack check => On
mbstring extension makes use of "streamable kanji code filter and converter", which is
distributed under the GNU Lesser General Public License version 2.1.
Directive => Local Value => Master Value
mbstring.detect_order => no value => no value
mbstring.encoding_translation => Off => Off
mbstring.func_overload => 0 => 0
mbstring.http_input => pass => pass
mbstring.http_output => pass => pass
mbstring.internal_encoding => no value => no value
mbstring.language => neutral => neutral
mbstring.strict_detection => Off => Off
mbstring.substitute_character => no value => no value
mysql
MySQL Support => enabled
Active Persistent Links => 0
Active Links => 0
Client API version => 5.0.45
MYSQL_MODULE_TYPE => external
MYSQL_SOCKET => /var/lib/mysql/mysql.sock
MYSQL_INCLUDE => -I/usr/include/mysql
MYSQL_LIBS => -L/usr/lib/mysql -lmysqlclient
Directive => Local Value => Master Value
mysql.allow_persistent => On => On
mysql.connect_timeout => 60 => 60
mysql.default_host => no value => no value
mysql.default_password => no value => no value
mysql.default_port => no value => no value
mysql.default_socket => no value => no value
mysql.default_user => no value => no value
mysql.max_links => Unlimited => Unlimited
mysql.max_persistent => Unlimited => Unlimited
mysql.trace_mode => Off => Off
mysqli
MysqlI Support => enabled
Client API library version => 5.0.45
Client API header version => 5.0.45
MYSQLI_SOCKET => /var/lib/mysql/mysql.sock
Directive => Local Value => Master Value
mysqli.default_host => no value => no value
mysqli.default_port => 3306 => 3306
mysqli.default_pw => no value => no value
mysqli.default_socket => no value => no value
mysqli.default_user => no value => no value
mysqli.max_links => Unlimited => Unlimited
mysqli.reconnect => Off => Off
pcre
PCRE (Perl Compatible Regular Expressions) Support => enabled
PCRE Library Version => 7.6 2008-01-28
Directive => Local Value => Master Value
pcre.backtrack_limit => 100000 => 100000
pcre.recursion_limit => 100000 => 100000
PDO
PDO support => enabled
PDO drivers => sqlite2, sqlite, mysql
pdo_mysql
PDO Driver for MySQL, client library version => 5.0.45
pdo_sqlite
PDO Driver for SQLite 3.x => enabled
PECL Module version => (bundled) 1.0.1 $Id: pdo_sqlite.c,v 1.10.2.6.2.3 2007/12/31 07:20:10
sebastian Exp $
SQLite Library => 3.3.7
posix
Revision => $Revision: 1.70.2.3.2.20 $
Reflection
Reflection => enabled
Version => $Id: php_reflection.c,v 1.164.2.33.2.54 2008/10/29 13:34:08 felipe Exp $
session
Session Support => enabled
Registered save handlers => files user sqlite
Registered serializer handlers => php php_binary
Directive => Local Value => Master Value
session.auto_start => Off => Off
session.bug_compat_42 => Off => Off
session.bug_compat_warn => On => On
session.cache_expire => 180 => 180
session.cache_limiter => nocache => nocache
session.cookie_domain => no value => no value
session.cookie_httponly => Off => Off
session.cookie_lifetime => 0 => 0
session.cookie_path => / => /
session.cookie_secure => Off => Off
session.entropy_file => no value => no value
session.entropy_length => 0 => 0
session.gc_divisor => 1000 => 1000
session.gc_maxlifetime => 1440 => 1440
session.gc_probability => 1 => 1
session.hash_bits_per_character => 5 => 5
session.hash_function => 0 => 0
session.name => PHPSESSID => PHPSESSID
session.referer_check => no value => no value
session.save_handler => files => files
session.save_path => no value => no value
session.serialize_handler => php => php
session.use_cookies => On => On
session.use_only_cookies => Off => Off
session.use_trans_sid => 0 => 0
SimpleXML
Simplexml support => enabled
Revision => $Revision: 1.151.2.22.2.45 $
Schema support => enabled
SPL
SPL support => enabled
Interfaces => Countable, OuterIterator, RecursiveIterator, SeekableIterator, SplObserver,
SplSubject
Classes => AppendIterator, ArrayIterator, ArrayObject, BadFunctionCallException,
BadMethodCallException, CachingIterator, DirectoryIterator, DomainException, EmptyIterator,
FilterIterator, InfiniteIterator, InvalidArgumentException, IteratorIterator, LengthException,
LimitIterator, LogicException, NoRewindIterator, OutOfBoundsException, OutOfRangeException,
OverflowException, ParentIterator, RangeException, RecursiveArrayIterator, RecursiveCachingIterator,
RecursiveDirectoryIterator, RecursiveFilterIterator, RecursiveIteratorIterator,
RecursiveRegexIterator, RegexIterator, RuntimeException, SimpleXMLIterator, SplFileInfo,
SplFileObject, SplObjectStorage, SplTempFileObject, UnderflowException, UnexpectedValueException
SQLite
SQLite support => enabled
PECL Module version => 2.0-dev $Id: sqlite.c,v 1.166.2.13.2.10 2007/12/31 07:20:11 sebastian Exp
$
SQLite Library => 2.8.17
SQLite Encoding => iso8859
Directive => Local Value => Master Value
sqlite.assoc_case => 0 => 0
standard
Regex Library => Bundled library enabled
Dynamic Library Support => enabled
Path to sendmail => /usr/sbin/sendmail -t -i
Directive => Local Value => Master Value
assert.active => 1 => 1
assert.bail => 0 => 0
assert.callback => no value => no value
assert.quiet_eval => 0 => 0
assert.warning => 1 => 1
auto_detect_line_endings => 0 => 0
default_socket_timeout => 60 => 60
safe_mode_allowed_env_vars => PHP_ => PHP_
safe_mode_protected_env_vars => LD_LIBRARY_PATH => LD_LIBRARY_PATH
url_rewriter.tags => a=href,area=href,frame=src,input=src,form=fakeentry =>
a=href,area=href,frame=src,input=src,form=fakeentry
user_agent => no value => no value
tokenizer
Tokenizer Support => enabled
xml
XML Support => active
XML Namespace Support => active
libxml2 Version => 2.6.26
xmlreader
XMLReader => enabled
xmlrpc
core library version => xmlrpc-epi v. 0.51
php extension version => 0.51
author => Dan Libby
homepage => http://xmlrpc-epi.sourceforge.net
open sourced by => Epinions.com
xmlwriter
XMLWriter => enabled
zlib
ZLib Support => enabled
Stream Wrapper support => compress.zlib://
Stream Filter support => zlib.inflate, zlib.deflate
Compiled Version => 1.2.3
Linked Version => 1.2.3
Directive => Local Value => Master Value
zlib.output_compression => Off => Off
zlib.output_compression_level => -1 => -1
zlib.output_handler => no value => no value
Additional Modules
Module Name
Environment
Variable => Value
HOSTNAME => siouxsports.com
TEST_PHP_SRCDIR => /home/siouxsports/php-5.2.7RC3
SHELL => /bin/bash
TERM => xterm
MAKEFLAGS =>
HISTSIZE => 1000
SSH_CLIENT => deleted
SSH_TTY => deleted
USER => siouxsports
LS_COLORS =>
no=00:fi=00:di=00;34:ln=00;36:pi=40;33:so=00;35:bd=40;33;01:cd=40;33;01:or=01;05;37;41:mi=01;05;37;41:ex=00;32:*.cmd=00;32:*.exe=00;32:*.com=00;32:*.btm=00;32:*.bat=00;32:*.sh=00;32:*.csh=00;32:*.tar=00;31:*.tgz=00;31:*.arj=00;31:*.taz=00;31:*.lzh=00;31:*.zip=00;31:*.z=00;31:*.Z=00;31:*.gz=00;31:*.bz2=00;31:*.bz=00;31:*.tz=00;31:*.rpm=00;31:*.cpio=00;31:*.jpg=00;35:*.gif=00;35:*.bmp=00;35:*.xbm=00;35:*.xpm=00;35:*.png=00;35:*.tif=00;35:
SSH_AUTH_SOCK => deleted
MAKELEVEL => 1
MFLAGS =>
PATH => /usr/kerberos/bin:/usr/local/bin:/bin:/usr/bin:/home/siouxsports/bin
MAIL => /var/spool/mail/siouxsports
_ => /home/siouxsports/php-5.2.7RC3/sapi/cli/php
PWD => /home/siouxsports/php-5.2.7RC3
INPUTRC => /etc/inputrc
LANG => en_US.UTF-8
TEST_PHP_EXECUTABLE => /home/siouxsports/php-5.2.7RC3/sapi/cli/php
HOME => /home/siouxsports
SHLVL => 3
LOGNAME => siouxsports
SSH_CONNECTION => deleted
LESSOPEN => |/usr/bin/lesspipe.sh %s
CC => gcc
G_BROKEN_FILENAMES => 1
PHP Variables
Variable => Value
_SERVER["HOSTNAME"] => siouxsports.com
_SERVER["TEST_PHP_SRCDIR"] => /home/siouxsports/php-5.2.7RC3
_SERVER["SHELL"] => /bin/bash
_SERVER["TERM"] => xterm
_SERVER["MAKEFLAGS"] =>
_SERVER["HISTSIZE"] => 1000
_SERVER["SSH_CLIENT"] => deleted
_SERVER["SSH_TTY"] => deleted
_SERVER["USER"] => siouxsports
_SERVER["LS_COLORS"] =>
no=00:fi=00:di=00;34:ln=00;36:pi=40;33:so=00;35:bd=40;33;01:cd=40;33;01:or=01;05;37;41:mi=01;05;37;41:ex=00;32:*.cmd=00;32:*.exe=00;32:*.com=00;32:*.btm=00;32:*.bat=00;32:*.sh=00;32:*.csh=00;32:*.tar=00;31:*.tgz=00;31:*.arj=00;31:*.taz=00;31:*.lzh=00;31:*.zip=00;31:*.z=00;31:*.Z=00;31:*.gz=00;31:*.bz2=00;31:*.bz=00;31:*.tz=00;31:*.rpm=00;31:*.cpio=00;31:*.jpg=00;35:*.gif=00;35:*.bmp=00;35:*.xbm=00;35:*.xpm=00;35:*.png=00;35:*.tif=00;35:
_SERVER["SSH_AUTH_SOCK"] => deleted
_SERVER["MAKELEVEL"] => 1
_SERVER["MFLAGS"] =>
_SERVER["PATH"] => /usr/kerberos/bin:/usr/local/bin:/bin:/usr/bin:/home/siouxsports/bin
_SERVER["MAIL"] => /var/spool/mail/siouxsports
_SERVER["_"] => /home/siouxsports/php-5.2.7RC3/sapi/cli/php
_SERVER["PWD"] => /home/siouxsports/php-5.2.7RC3
_SERVER["INPUTRC"] => /etc/inputrc
_SERVER["LANG"] => en_US.UTF-8
_SERVER["TEST_PHP_EXECUTABLE"] => /home/siouxsports/php-5.2.7RC3/sapi/cli/php
_SERVER["HOME"] => /home/siouxsports
_SERVER["SHLVL"] => 3
_SERVER["LOGNAME"] => siouxsports
_SERVER["SSH_CONNECTION"] => deleted
_SERVER["LESSOPEN"] => |/usr/bin/lesspipe.sh %s
_SERVER["CC"] => gcc
_SERVER["G_BROKEN_FILENAMES"] => 1
_SERVER["PHP_SELF"] =>
_SERVER["SCRIPT_NAME"] =>
_SERVER["SCRIPT_FILENAME"] =>
_SERVER["PATH_TRANSLATED"] =>
_SERVER["DOCUMENT_ROOT"] =>
_SERVER["REQUEST_TIME"] => 1226185479
_SERVER["argv"] => Array
(
)
_SERVER["argc"] => 0
PHP License
This program is free software; you can redistribute it and/or modify
it under the terms of the PHP License as published by the PHP Group
and included in the distribution in the file: LICENSE
This program is distributed in the hope that it will be useful,
but WITHOUT ANY WARRANTY; without even the implied warranty of
MERCHANTABILITY or FITNESS FOR A PARTICULAR PURPOSE.
If you did not receive a copy of the PHP license, or have any
questions about PHP licensing, please contact license@php.net.