Test results for 5.3.0alpha3-dev [failed]

From: Date: Sun, 09 Nov 2008 10:12:56 +0000
Subject: Test results for 5.3.0alpha3-dev [failed]
Groups: php.qa.reports 
Request: Send a blank email to php-qa-reports+get-13142@lists.php.net to get a copy of this message
===================================================================== FAILED TEST SUMMARY --------------------------------------------------------------------- Bug #45392 (ob_start()/ob_end_clean() and memory_limit) [tests/lang/bug45392.phpt] Bug #16069 (ICONV transliteration failure) [ext/iconv/tests/bug16069.phpt] iconv stream filter [ext/iconv/tests/iconv_stream_filter.phpt] Phar: copy-on-write test 5 [cache_list] [ext/phar/tests/cache_list/copyonwrite5.phar.phpt] Phar: copy-on-write test 6 [cache_list] [ext/phar/tests/cache_list/copyonwrite6.phar.phpt] SPL: FilesystemIterator and foreach [ext/spl/tests/dit_003.phpt] SPL: iterator_to_array() and exceptions [ext/spl/tests/iterator_041.phpt] SPL: iterator_to_array() and exceptions from delayed destruct [ext/spl/tests/iterator_041b.phpt] proc_open [ext/standard/tests/general_functions/proc_open02.phpt] Test gethostbynamel() function : error conditions [ext/standard/tests/network/gethostbynamel_error.phpt] ===================================================================== ===================================================================== EXPECTED FAILED TEST SUMMARY --------------------------------------------------------------------- Inconsistencies when accessing protected members [Zend/tests/access_modifiers_008.phpt] Inconsistencies when accessing protected members - 2 [Zend/tests/access_modifiers_009.phpt] Test restore_error_handler() function : bug #46196 [Zend/tests/bug46196.phpt] SimpleXML: array casting bug [ext/simplexml/tests/034.phpt] ===================================================================== ===================================================================== TEST RESULT SUMMARY --------------------------------------------------------------------- Exts skipped : 51 Exts tested : 26 --------------------------------------------------------------------- Number of tests : 8026 5547 Tests skipped : 2479 ( 30.9%) -------- Tests warned : 0 ( 0.0%) ( 0.0%) Tests failed : 10 ( 0.1%) ( 0.2%) Expected fail : 4 ( 0.0%) ( 0.1%) Tests passed : 5533 ( 68.9%) ( 99.7%) --------------------------------------------------------------------- Time taken : 330 seconds ===================================================================== ===================================================================== FAILED TEST SUMMARY --------------------------------------------------------------------- Bug #45392 (ob_start()/ob_end_clean() and memory_limit) [tests/lang/bug45392.phpt] Bug #16069 (ICONV transliteration failure) [ext/iconv/tests/bug16069.phpt] iconv stream filter [ext/iconv/tests/iconv_stream_filter.phpt] Phar: copy-on-write test 5 [cache_list] [ext/phar/tests/cache_list/copyonwrite5.phar.phpt] Phar: copy-on-write test 6 [cache_list] [ext/phar/tests/cache_list/copyonwrite6.phar.phpt] SPL: FilesystemIterator and foreach [ext/spl/tests/dit_003.phpt] SPL: iterator_to_array() and exceptions [ext/spl/tests/iterator_041.phpt] SPL: iterator_to_array() and exceptions from delayed destruct [ext/spl/tests/iterator_041b.phpt] proc_open [ext/standard/tests/general_functions/proc_open02.phpt] Test gethostbynamel() function : error conditions [ext/standard/tests/network/gethostbynamel_error.phpt] ===================================================================== ===================================================================== EXPECTED FAILED TEST SUMMARY --------------------------------------------------------------------- Inconsistencies when accessing protected members [Zend/tests/access_modifiers_008.phpt] Inconsistencies when accessing protected members - 2 [Zend/tests/access_modifiers_009.phpt] Test restore_error_handler() function : bug #46196 [Zend/tests/bug46196.phpt] SimpleXML: array casting bug [ext/simplexml/tests/034.phpt] ===================================================================== ================================================================================ /home/tawmas/Desktop/php5.3-200811090930/tests/lang/bug45392.phpt ================================================================================ 2 Fatal error: Allowed memory size of 262144 bytes exhausted (tried to allocate 143361 bytes) in /home/tawmas/Desktop/php5.3-200811090930/tests/lang/bug45392.php on line 9 ================================================================================ 003- 5 ================================================================================ ================================================================================ /home/tawmas/Desktop/php5.3-200811090930/ext/iconv/tests/bug16069.phpt ================================================================================ ¥ß¥ê¥Ð¡¼¥ë¥ß¥ê¥Ð¡¼¥ë¥ß¥ê¥Ð¡¼¥ë¥ß¥ê¥Ð¡¼¥ë¥ß¥ê¥Ð¡¼¥ë¥ß¥ê¥Ð¡¼¥ë¥ß¥ê¥Ð¡¼¥ë¥ß¥ê¥Ð¡¼¥ë¥ß¥ê¥Ð¡¼¥ë¥ß¥ê¥Ð¡¼¥ë¥ß¥ê¥Ð¡¼¥ë¥ß¥ß¥ê¥Ð¡¼¥ë¥ß¥ê¥Ð¡¼¥ë¥ß¥ê¥Ð¡¼¥ë¥ß¥ê¥Ð¡¼¥ë¥ß¥ê¥Ð¡¼¥ë¥ß¥ê¥Ð¡¼¥ë¥ß¥ê¥Ð¡¼¥ë¥ß¥ê¥Ð¡¼¥ë¥ß¥ê¥Ð¡¼¥ë¥ß¥ê¥Ð¡¼¥ë¥ß¥ê¥Ð¡¼¥ë¥ß¥ê¥Ð¡¼¥ë¥ß¥ê¥Ð¡¼¥ë¥ß¥ê¥Ð¡¼¥ë¥ß¥ê¥Ð¡¼¥ë¥ß¥ê¥Ð¡¼¥ë¥ß¥ê¥Ð¡¼¥ë¥ß¥ê¥Ð¡¼¥ë¥ß¥ê¥Ð¡¼¥ë¥ß¥ê¥Ð¡¼¥ë¥ß¥ê¥Ð¡¼¥ë¥ß¥ê¥Ð¡¼¥ë¥ß¥ê¥Ð¡¼¥ë¥ß¥ê¥Ð¡¼¥ë¥ß¥ê¥Ð¡¼¥ë¥ß¥ê¥Ð¡¼¥ë¥ß¥ê¥Ð¡¼¥ë¥ß¥ê¥Ð¡¼¥ë¥ß¥ê¥Ð¡¼¥ë(¡ë§¥¡ë) ================================================================================ 001+ ¥ß¥ê¥Ð¡¼¥ë¥ß¥ê¥Ð¡¼¥ë¥ß¥ê¥Ð¡¼¥ë¥ß¥ê¥Ð¡¼¥ë¥ß¥ê¥Ð¡¼¥ë¥ß¥ê¥Ð¡¼¥ë¥ß¥ê¥Ð¡¼¥ë¥ß¥ê¥Ð¡¼¥ë¥ß¥ê¥Ð¡¼¥ë¥ß¥ê¥Ð¡¼¥ë¥ß¥ê¥Ð¡¼¥ë¥ß¥ß¥ê¥Ð¡¼¥ë¥ß¥ê¥Ð¡¼¥ë¥ß¥ê¥Ð¡¼¥ë¥ß¥ê¥Ð¡¼¥ë¥ß¥ê¥Ð¡¼¥ë¥ß¥ê¥Ð¡¼¥ë¥ß¥ê¥Ð¡¼¥ë¥ß¥ê¥Ð¡¼¥ë¥ß¥ê¥Ð¡¼¥ë¥ß¥ê¥Ð¡¼¥ë¥ß¥ê¥Ð¡¼¥ë¥ß¥ê¥Ð¡¼¥ë¥ß¥ê¥Ð¡¼¥ë¥ß¥ê¥Ð¡¼¥ë¥ß¥ê¥Ð¡¼¥ë¥ß¥ê¥Ð¡¼¥ë¥ß¥ê¥Ð¡¼¥ë¥ß¥ê¥Ð¡¼¥ë¥ß¥ê¥Ð¡¼¥ë¥ß¥ê¥Ð¡¼¥ë¥ß¥ê¥Ð¡¼¥ë¥ß¥ê¥Ð¡¼¥ë¥ß¥ê¥Ð¡¼¥ë¥ß¥ê¥Ð¡¼¥ë¥ß¥ê¥Ð¡¼¥ë¥ß¥ê¥Ð¡¼¥ë¥ß¥ê¥Ð¡¼¥ë¥ß¥ê¥Ð¡¼¥ë¥ß¥ê¥Ð¡¼¥ë(¡ë§¥¡ë) 001- ¥ß¥ê¥Ð¡¼¥ë¥ß¥ê¥Ð¡¼¥ë¥ß¥ê¥Ð¡¼¥ë¥ß¥ê¥Ð¡¼¥ë¥ß¥ê¥Ð¡¼¥ë¥ß¥ê¥Ð¡¼¥ë¥ß¥ê¥Ð¡¼¥ë¥ß¥ê¥Ð¡¼¥ë¥ß¥ê¥Ð¡¼¥ë¥ß¥ê¥Ð¡¼¥ë¥ß¥ê¥Ð¡¼¥ë¥ß¥ê¥Ð¡¼¥ë¥ß¥ê¥Ð¡¼¥ë¥ß¥ê¥Ð¡¼¥ë¥ß¥ê¥Ð¡¼¥ë¥ß¥ê¥Ð¡¼¥ë¥ß¥ê¥Ð¡¼¥ë¥ß¥ê¥Ð¡¼¥ë¥ß¥ê¥Ð¡¼¥ë¥ß¥ê¥Ð¡¼¥ë¥ß¥ê¥Ð¡¼¥ë¥ß¥ê¥Ð¡¼¥ë¥ß¥ê¥Ð¡¼¥ë¥ß¥ê¥Ð¡¼¥ë¥ß¥ê¥Ð¡¼¥ë¥ß¥ê¥Ð¡¼¥ë¥ß¥ê¥Ð¡¼¥ë¥ß¥ê¥Ð¡¼¥ë¥ß¥ê¥Ð¡¼¥ë¥ß¥ê¥Ð¡¼¥ë¥ß¥ê¥Ð¡¼¥ë¥ß¥ê¥Ð¡¼¥ë¥ß¥ê¥Ð¡¼¥ë¥ß¥ê¥Ð¡¼¥ë¥ß¥ê¥Ð¡¼¥ë¥ß¥ê¥Ð¡¼¥ë¥ß¥ê¥Ð¡¼¥ë¥ß¥ê¥Ð¡¼¥ë¥ß¥ê¥Ð¡¼¥ë¥ß¥ê¥Ð¡¼¥ë(¡ë§¥¡ë) ================================================================================ ================================================================================ /home/tawmas/Desktop/php5.3-200811090930/ext/iconv/tests/iconv_stream_filter.phpt ================================================================================ string(20) "1b244224332473244b24" string(10) "41244f1b28" string(2) "42" string(20) "a4b3a4f3a4cba4c1a4cf" string(10) "69636f6e76" string(2) "0a" string(20) "1b244f24332466245824" string(10) "4e24421b28" string(2) "4f" ================================================================================ 007+ string(20) "1b244f24332466245824" 008+ string(10) "4e24421b28" 009+ string(2) "4f" 007- 008- Warning: fread(): iconv stream filter ("ISO-2022-JP"=>"EUC-JP"): invalid multibyte sequence in %s on line %d 009- string(0) "" 010- string(0) "" 011- string(0) "" ================================================================================ ================================================================================ /home/tawmas/Desktop/php5.3-200811090930/ext/phar/tests/cache_list/copyonwrite5.phar.phpt ================================================================================ array(2) { ["file2"]=> string(85) "/home/tawmas/Desktop/php5.3-200811090930/ext/phar/tests/cache_list/copyonwrite5/file2" ["file1"]=> string(85) "/home/tawmas/Desktop/php5.3-200811090930/ext/phar/tests/cache_list/copyonwrite5/file1" } phar:///home/tawmas/Desktop/php5.3-200811090930/ext/phar/tests/cache_list/copyonwrite5.phar.php/file1 file1 phar:///home/tawmas/Desktop/php5.3-200811090930/ext/phar/tests/cache_list/copyonwrite5.phar.php/file2 file2 phar:///home/tawmas/Desktop/php5.3-200811090930/ext/phar/tests/cache_list/copyonwrite5.phar.php/hi hi ok ================================================================================ 002+ ["file2"]=> 003+ string(85) "/home/tawmas/Desktop/php5.3-200811090930/ext/phar/tests/cache_list/copyonwrite5/file2" 004- ["file2"]=> 005- string(%d) "%sfile2" ================================================================================ ================================================================================ /home/tawmas/Desktop/php5.3-200811090930/ext/phar/tests/cache_list/copyonwrite6.phar.phpt ================================================================================ Fatal error: Uncaught exception 'UnexpectedValueException' with message 'Iterator RecursiveDirectoryIterator returned a path "/home/tawmas/Desktop/php5.3-200811090930/ext/phar/tests/cache_list" that is not in the base directory "/home/tawmas/Desktop/php5.3-200811090930/ext/phar/tests/cache_list/copyonwrite6"' in /home/tawmas/Desktop/php5.3-200811090930/ext/phar/tests/cache_list/copyonwrite6.phar.php:7 Stack trace: #0 /home/tawmas/Desktop/php5.3-200811090930/ext/phar/tests/cache_list/copyonwrite6.phar.php(7): Phar->buildFromIterator(Object(RecursiveDirectoryIterator), '/home/tawmas/De...') #1 {main} thrown in /home/tawmas/Desktop/php5.3-200811090930/ext/phar/tests/cache_list/copyonwrite6.phar.php on line 7 ================================================================================ 001+ Fatal error: Uncaught exception 'UnexpectedValueException' with message 'Iterator RecursiveDirectoryIterator returned a path "/home/tawmas/Desktop/php5.3-200811090930/ext/phar/tests/cache_list" that is not in the base directory "/home/tawmas/Desktop/php5.3-200811090930/ext/phar/tests/cache_list/copyonwrite6"' in /home/tawmas/Desktop/php5.3-200811090930/ext/phar/tests/cache_list/copyonwrite6.phar.php:7 002+ Stack trace: 003+ #0 /home/tawmas/Desktop/php5.3-200811090930/ext/phar/tests/cache_list/copyonwrite6.phar.php(7): Phar->buildFromIterator(Object(RecursiveDirectoryIterator), '/home/tawmas/De...') 004+ #1 {main} 005+ thrown in /home/tawmas/Desktop/php5.3-200811090930/ext/phar/tests/cache_list/copyonwrite6.phar.php on line 7 001- array(2) { 002- ["file1"]=> 003- string(%d) "%sfile1" 004- ["file2"]=> 005- string(%d) "%sfile2" 006- } 007- phar://%scopyonwrite6.phar.php%cfile1 file1 008- phar://%scopyonwrite6.phar.php%cfile2 file2 009- phar://%scopyonwrite6.phar.php%chi hi 010- ok ================================================================================ ================================================================================ /home/tawmas/Desktop/php5.3-200811090930/ext/spl/tests/dit_003.phpt ================================================================================ Fatal error: Uncaught exception 'UnexpectedValueException' with message 'FilesystemIterator::__construct(CVS): failed to open dir: No such file or directory' in /home/tawmas/Desktop/php5.3-200811090930/ext/spl/tests/dit_003.php:3 Stack trace: #0 /home/tawmas/Desktop/php5.3-200811090930/ext/spl/tests/dit_003.php(3): FilesystemIterator->__construct('CVS') #1 {main} thrown in /home/tawmas/Desktop/php5.3-200811090930/ext/spl/tests/dit_003.php on line 3 ================================================================================ 001+ Fatal error: Uncaught exception 'UnexpectedValueException' with message 'FilesystemIterator::__construct(CVS): failed to open dir: No such file or directory' in /home/tawmas/Desktop/php5.3-200811090930/ext/spl/tests/dit_003.php:3 002+ Stack trace: 001- bool(true) 002- ===DONE=== 003+ #0 /home/tawmas/Desktop/php5.3-200811090930/ext/spl/tests/dit_003.php(3): FilesystemIterator->__construct('CVS') 004+ #1 {main} 005+ thrown in /home/tawmas/Desktop/php5.3-200811090930/ext/spl/tests/dit_003.php on line 3 ================================================================================ ================================================================================ /home/tawmas/Desktop/php5.3-200811090930/ext/spl/tests/iterator_041.phpt ================================================================================ ===iterator_to_array=== State 0: __construct() Segmentation fault ================================================================================ 003+ Segmentation fault 003- State 1: __construct() 004- State 2: rewind() 005- State 3: valid() 006- State 4: current() 007- State 5: key() 008- State 6: next() 009- array(2) { 010- [0]=> 011- int(1) 012- [1]=> 013- int(2) 014- } 015- ===iterator_count=== 016- State 0: __construct() 017- State 1: __construct() 018- State 2: rewind() 019- State 3: valid() 020- State 6: next() 021- int(2) 022- ===DONE=== ================================================================================ ================================================================================ /home/tawmas/Desktop/php5.3-200811090930/ext/spl/tests/iterator_041b.phpt ================================================================================ ===iterator_to_array=== State 0: __construct() Segmentation fault ================================================================================ 003+ Segmentation fault 003- State 1: __construct() 004- State 2: rewind() 005- State 3: valid() 006- State 4: current() 007- State 5: key() 008- State 6: next() 009- ===iterator_count=== 010- State 0: __construct() 011- State 1: __construct() 012- State 2: rewind() 013- State 3: valid() 014- State 6: next() 015- ===DONE=== ================================================================================ ================================================================================ /home/tawmas/Desktop/php5.3-200811090930/ext/standard/tests/general_functions/proc_open02.phpt ================================================================================ bool(true) array(8) { ["command"]=> string(28) "/usr/bin/nohup /bin/sleep 50" ["pid"]=> int(10193) ["running"]=> bool(false) ["signaled"]=> bool(true) ["stopped"]=> bool(false) ["exitcode"]=> int(-1) ["termsig"]=> int(1) ["stopsig"]=> int(0) } bool(false) array(8) { ["command"]=> string(28) "/usr/bin/nohup /bin/sleep 50" ["pid"]=> int(10193) ["running"]=> bool(false) ["signaled"]=> bool(false) ["stopped"]=> bool(false) ["exitcode"]=> int(-1) ["termsig"]=> int(0) ["stopsig"]=> int(0) } Done! ================================================================================ 008+ bool(false) 009+ ["signaled"]=> 009- ["signaled"]=> 010- bool(false) 016+ int(1) 016- int(0) 020+ bool(false) 020- bool(true) 029+ bool(false) 029- bool(true) 035+ int(0) 035- int(15) ================================================================================ ================================================================================ /home/tawmas/Desktop/php5.3-200811090930/ext/standard/tests/network/gethostbynamel_error.phpt ================================================================================ *** Testing gethostbynamel() : error conditions *** -- Testing gethostbynamel() function with Zero arguments -- Warning: gethostbynamel() expects exactly 1 parameter, 0 given in /home/tawmas/Desktop/php5.3-200811090930/ext/standard/tests/network/gethostbynamel_error.php on line 12 NULL -- Testing gethostbynamel() function with more than expected no. of arguments -- Warning: gethostbynamel() expects exactly 1 parameter, 2 given in /home/tawmas/Desktop/php5.3-200811090930/ext/standard/tests/network/gethostbynamel_error.php on line 18 NULL -- Testing gethostbynamel() with an unknown host -- array(1) { [0]=> string(13) "208.69.34.132" } Done ================================================================================ 014+ array(1) { 015+ [0]=> 016+ string(13) "208.69.34.132" 017+ } 014- bool(false) ================================================================================ ================================================================================ BUILD ENVIRONMENT ================================================================================ OS: Linux - Linux tylke 2.6.27-7-generic #1 SMP Tue Nov 4 19:33:06 UTC 2008 x86_64 Autoconf: Bundled Libtool: ltmain.sh (GNU libtool) 1.5.20 (1.1220.2.287 2005/08/31 18:54:15) Copyright (C) 2005 Free Software Foundation, Inc. This is free software; see the source for copying conditions. There is NO warranty; not even for MERCHANTABILITY or FITNESS FOR A PARTICULAR PURPOSE. System Libtool: N/A Compiler: Using built-in specs. Target: x86_64-linux-gnu Configured with: ../src/configure -v --with-pkgversion='Ubuntu 4.3.2-1ubuntu11' --with-bugurl=file:///usr/share/doc/gcc-4.3/README.Bugs --enable-languages=c,c++,fortran,objc,obj-c++ --prefix=/usr --enable-shared --with-system-zlib --libexecdir=/usr/lib --without-included-gettext --enable-threads=posix --enable-nls --with-gxx-include-dir=/usr/include/c++/4.3 --program-suffix=-4.3 --enable-clocale=gnu --enable-libstdcxx-debug --enable-objc-gc --enable-mpfr --enable-checking=release --build=x86_64-linux-gnu --host=x86_64-linux-gnu --target=x86_64-linux-gnu Thread model: posix gcc version 4.3.2 (Ubuntu 4.3.2-1ubuntu11) Bison: Libraries: linux-vdso.so.1 => (0x00007fffc97ff000) libcrypt.so.1 => /lib/libcrypt.so.1 (0x00002b01e1564000) librt.so.1 => /lib/librt.so.1 (0x00002b01e179c000) libresolv.so.2 => /lib/libresolv.so.2 (0x00002b01e19a5000) libm.so.6 => /lib/libm.so.6 (0x00002b01e1bbb000) libdl.so.2 => /lib/libdl.so.2 (0x00002b01e1e40000) libnsl.so.1 => /lib/libnsl.so.1 (0x00002b01e2044000) libxml2.so.2 => /usr/lib/libxml2.so.2 (0x00002b01e225e000) libc.so.6 => /lib/libc.so.6 (0x00002b01e25bb000) libpthread.so.0 => /lib/libpthread.so.0 (0x00002b01e292d000) /lib64/ld-linux-x86-64.so.2 (0x00002b01e1344000) libz.so.1 => /usr/lib/libz.so.1 (0x00002b01e2b4a000) User's E-mail: tawmas at tawmas dot net ================================================================================ PHPINFO ================================================================================ phpinfo() PHP Version => 5.3.0alpha3-dev System => Linux tylke 2.6.27-7-generic #1 SMP Tue Nov 4 19:33:06 UTC 2008 x86_64 Build Date => Nov 9 2008 11:03:59 Configure Command => './configure' Server API => Command Line Interface Virtual Directory Support => disabled Configuration File (php.ini) Path => /usr/local/lib Loaded Configuration File => (none) Scan this dir for additional .ini files => (none) additional .ini files parsed => (none) PHP API => 20041225 PHP Extension => 20071006 Zend Extension => 220070929 Debug Build => no Thread Safety => disabled Zend Memory Manager => enabled Zend Multibyte Support => disabled IPv6 Support => enabled Registered PHP Streams => php, file, glob, data, http, ftp, phar Registered Stream Socket Transports => tcp, udp, unix, udg Registered Stream Filters => string.rot13, string.toupper, string.tolower, string.strip_tags, convert.*, consumed, convert.iconv.* This program makes use of the Zend Scripting Language Engine: Zend Engine v2.3.0, Copyright (c) 1998-2008 Zend Technologies _______________________________________________________________________ Configuration PHP Core Directive => Local Value => Master Value allow_call_time_pass_reference => On => On allow_url_fopen => On => On allow_url_include => Off => Off always_populate_raw_post_data => Off => Off arg_separator.input => & => & arg_separator.output => & => & asp_tags => Off => Off auto_append_file => no value => no value auto_globals_jit => On => On auto_prepend_file => no value => no value browscap => no value => no value default_charset => no value => no value default_mimetype => text/html => text/html define_syslog_variables => Off => Off disable_classes => no value => no value disable_functions => no value => no value display_errors => STDERR => STDERR display_startup_errors => Off => Off doc_root => no value => no value docref_ext => no value => no value docref_root => no value => no value enable_dl => On => On error_append_string => no value => no value error_log => no value => no value error_prepend_string => no value => no value error_reporting => no value => no value exit_on_timeout => Off => Off expose_php => On => On extension_dir => /usr/local/lib/php/extensions/no-debug-non-zts-20071006 => /usr/local/lib/php/extensions/no-debug-non-zts-20071006 file_uploads => On => On highlight.bg => <font style="color: #FFFFFF">#FFFFFF</font> => <font style="color: #FFFFFF">#FFFFFF</font> highlight.comment => <font style="color: #FF8000">#FF8000</font> => <font style="color: #FF8000">#FF8000</font> highlight.default => <font style="color: #0000BB">#0000BB</font> => <font style="color: #0000BB">#0000BB</font> highlight.html => <font style="color: #000000">#000000</font> => <font style="color: #000000">#000000</font> highlight.keyword => <font style="color: #007700">#007700</font> => <font style="color: #007700">#007700</font> highlight.string => <font style="color: #DD0000">#DD0000</font> => <font style="color: #DD0000">#DD0000</font> html_errors => Off => Off ignore_repeated_errors => Off => Off ignore_repeated_source => Off => Off ignore_user_abort => Off => Off implicit_flush => On => On include_path => .:/usr/local/lib/php => .:/usr/local/lib/php log_errors => Off => Off log_errors_max_len => 1024 => 1024 magic_quotes_gpc => On => On magic_quotes_runtime => Off => Off magic_quotes_sybase => Off => Off mail.force_extra_parameters => no value => no value max_execution_time => 0 => 0 max_input_nesting_level => 64 => 64 max_input_time => -1 => -1 memory_limit => 128M => 128M open_basedir => no value => no value output_buffering => 0 => 0 output_handler => no value => no value post_max_size => 8M => 8M precision => 14 => 14 realpath_cache_size => 16K => 16K realpath_cache_ttl => 120 => 120 register_argc_argv => On => On register_globals => Off => Off register_long_arrays => On => On report_memleaks => On => On report_zend_debug => Off => Off request_order => no value => no value safe_mode => Off => Off safe_mode_exec_dir => /usr/local/php/bin => /usr/local/php/bin safe_mode_gid => Off => Off safe_mode_include_dir => no value => no value sendmail_from => no value => no value sendmail_path => /usr/sbin/sendmail -t -i => /usr/sbin/sendmail -t -i serialize_precision => 100 => 100 short_open_tag => On => On SMTP => localhost => localhost smtp_port => 25 => 25 sql.safe_mode => Off => Off track_errors => Off => Off unserialize_callback_func => no value => no value upload_max_filesize => 2M => 2M upload_tmp_dir => no value => no value user_dir => no value => no value user_ini.cache_ttl => 300 => 300 user_ini.filename => .user.ini => .user.ini variables_order => EGPCS => EGPCS xmlrpc_error_number => 0 => 0 xmlrpc_errors => Off => Off y2k_compliance => On => On zend.enable_gc => On => On ctype ctype functions => enabled date date/time support => enabled "Olson" Timezone Database Version => 2008.9 Timezone Database => internal Default timezone => Europe/Berlin Directive => Local Value => Master Value date.default_latitude => 31.7667 => 31.7667 date.default_longitude => 35.2333 => 35.2333 date.sunrise_zenith => 90.583333 => 90.583333 date.sunset_zenith => 90.583333 => 90.583333 date.timezone => no value => no value dom DOM/XML => enabled DOM/XML API Version => 20031129 libxml Version => 2.6.32 HTML Support => enabled XPath Support => enabled XPointer Support => enabled Schema Support => enabled RelaxNG Support => enabled ereg Regex Library => Bundled library enabled fileinfo fileinfo support => enabled version => 1.0.5-dev filter Input Validation and Filtering => enabled Revision => $Revision: 1.52.2.39.2.10 $ Directive => Local Value => Master Value filter.default => unsafe_raw => unsafe_raw filter.default_flags => no value => no value hash hash support => enabled Hashing Engines => md2 md4 md5 sha1 sha224 sha256 sha384 sha512 ripemd128 ripemd160 ripemd256 ripemd320 whirlpool tiger128,3 tiger160,3 tiger192,3 tiger128,4 tiger160,4 tiger192,4 snefru snefru256 gost adler32 crc32 crc32b haval128,3 haval160,3 haval192,3 haval224,3 haval256,3 haval128,4 haval160,4 haval192,4 haval224,4 haval256,4 haval128,5 haval160,5 haval192,5 haval224,5 haval256,5 iconv iconv support => enabled iconv implementation => glibc iconv library version => 2.8.90 Directive => Local Value => Master Value iconv.input_encoding => ISO-8859-1 => ISO-8859-1 iconv.internal_encoding => ISO-8859-1 => ISO-8859-1 iconv.output_encoding => ISO-8859-1 => ISO-8859-1 json json support => enabled json version => 1.2.1 libxml libXML support => active libXML Version => 2.6.32 libXML streams => enabled pcre PCRE (Perl Compatible Regular Expressions) Support => enabled PCRE Library Version => 7.8 2008-09-05 Directive => Local Value => Master Value pcre.backtrack_limit => 100000 => 100000 pcre.recursion_limit => 100000 => 100000 PDO PDO support => enabled PDO drivers => sqlite, sqlite2 pdo_sqlite PDO Driver for SQLite 3.x => enabled SQLite Library => 3.6.2 Phar Phar: PHP Archive support => enabled Phar EXT version => 2.0.0-dev Phar API version => 1.1.1 CVS revision => $Revision: 1.370.2.54 $ Phar-based phar archives => enabled Tar-based phar archives => enabled ZIP-based phar archives => enabled gzip compression => disabled (install ext/zlib) bzip2 compression => disabled (install pecl/bz2) OpenSSL support => disabled (install ext/openssl) Phar based on pear/PHP_Archive, original concept by Davey Shafik. Phar fully realized by Gregory Beaver and Marcus Boerger. Portions of tar implementation Copyright (c) 2003-2008 Tim Kientzle. Directive => Local Value => Master Value phar.cache_list => no value => no value phar.readonly => On => On phar.require_hash => On => On posix Revision => $Revision: 1.70.2.3.2.16.2.12 $ Reflection Reflection => enabled Version => $Id: php_reflection.c,v 1.164.2.33.2.45.2.39 2008/11/04 15:58:55 helly Exp $ session Session Support => enabled Registered save handlers => files user sqlite Registered serializer handlers => php php_binary Directive => Local Value => Master Value session.auto_start => Off => Off session.bug_compat_42 => On => On session.bug_compat_warn => On => On session.cache_expire => 180 => 180 session.cache_limiter => nocache => nocache session.cookie_domain => no value => no value session.cookie_httponly => Off => Off session.cookie_lifetime => 0 => 0 session.cookie_path => / => / session.cookie_secure => Off => Off session.entropy_file => no value => no value session.entropy_length => 0 => 0 session.gc_divisor => 100 => 100 session.gc_maxlifetime => 1440 => 1440 session.gc_probability => 1 => 1 session.hash_bits_per_character => 4 => 4 session.hash_function => 0 => 0 session.name => PHPSESSID => PHPSESSID session.referer_check => no value => no value session.save_handler => files => files session.save_path => no value => no value session.serialize_handler => php => php session.use_cookies => On => On session.use_only_cookies => On => On session.use_trans_sid => 0 => 0 SimpleXML Simplexml support => enabled Revision => $Revision: 1.151.2.22.2.35.2.26 $ Schema support => enabled SPL SPL support => enabled Interfaces => Countable, OuterIterator, RecursiveIterator, SeekableIterator, SplObserver, SplSubject Classes => AppendIterator, ArrayIterator, ArrayObject, BadFunctionCallException, BadMethodCallException, CachingIterator, DirectoryIterator, DomainException, EmptyIterator, FilesystemIterator, FilterIterator, GlobIterator, InfiniteIterator, InvalidArgumentException, IteratorIterator, LengthException, LimitIterator, LogicException, MultipleIterator, NoRewindIterator, OutOfBoundsException, OutOfRangeException, OverflowException, ParentIterator, RangeException, RecursiveArrayIterator, RecursiveCachingIterator, RecursiveDirectoryIterator, RecursiveFilterIterator, RecursiveIteratorIterator, RecursiveRegexIterator, RecursiveTreeIterator, RegexIterator, RuntimeException, SplDoublyLinkedList, SplFileInfo, SplFileObject, SplFixedArray, SplHeap, SplMinHeap, SplMaxHeap, SplObjectStorage, SplPriorityQueue, SplQueue, SplStack, SplTempFileObject, UnderflowException, UnexpectedValueException SQLite SQLite support => enabled PECL Module version => 2.0-dev $Id: sqlite.c,v 1.166.2.13.2.9.2.14 2008/11/02 21:19:36 felipe Exp $ SQLite Library => 2.8.17 SQLite Encoding => iso8859 Directive => Local Value => Master Value sqlite.assoc_case => 0 => 0 sqlite3 SQLite3 support => enabled SQLite3 module version => 0.7-dev SQLite Library => 3.6.2 Directive => Local Value => Master Value sqlite3.extension_dir => no value => no value standard Dynamic Library Support => enabled Path to sendmail => /usr/sbin/sendmail -t -i Directive => Local Value => Master Value assert.active => 1 => 1 assert.bail => 0 => 0 assert.callback => no value => no value assert.quiet_eval => 0 => 0 assert.warning => 1 => 1 auto_detect_line_endings => 0 => 0 default_socket_timeout => 60 => 60 safe_mode_allowed_env_vars => PHP_ => PHP_ safe_mode_protected_env_vars => LD_LIBRARY_PATH => LD_LIBRARY_PATH url_rewriter.tags => a=href,area=href,frame=src,form=,fieldset= => a=href,area=href,frame=src,form=,fieldset= user_agent => no value => no value tokenizer Tokenizer Support => enabled xml XML Support => active XML Namespace Support => active libxml2 Version => 2.6.32 xmlreader XMLReader => enabled xmlwriter XMLWriter => enabled Additional Modules Module Name Environment Variable => Value LESSOPEN => | /usr/bin/lesspipe %s GNOME_KEYRING_PID => 12412 SSH_CLIENT => deleted USER => tawmas GNOME_KEYRING_SOCKET => /tmp/keyring-ffAmri/socket ORBIT_SOCKETDIR => /tmp/orbit-tawmas SHLVL => 1 HOME => /home/tawmas TEST_PHP_SRCDIR => /home/tawmas/Desktop/php5.3-200811090930 SSH_TTY => deleted DESKTOP_SESSION => gnome XDG_SESSION_COOKIE => 7968c77d47c11ba05abd28b747efb3f5-1226220517.135641-1688765958 GTK_RC_FILES => /etc/gtk/gtkrc:/home/tawmas/.gtkrc-1.2-gnome2 GDM_XSERVER_LOCATION => local DBUS_SESSION_BUS_ADDRESS => unix:abstract=/tmp/dbus-20BPns4ORg,guid=545ba134d86ab0e6c71b79614916a3e6 MAKEFLAGS => COLORTERM => gnome-terminal LOGNAME => tawmas _ => /usr/bin/make WINDOWID => 25168634 TEST_PHP_EXECUTABLE => /home/tawmas/Desktop/php5.3-200811090930/sapi/cli/php USERNAME => tawmas TERM => xterm GNOME_DESKTOP_SESSION_ID => this-is-deprecated HISTCONTROL => ignoreboth WINDOWPATH => 7 GDM_LANG => en_US.UTF-8 SESSION_MANAGER => local/tylke:/tmp/.ICE-unix/12423 PATH => /usr/local/sbin:/usr/local/bin:/usr/sbin:/usr/bin:/sbin:/bin:/usr/games MAKELEVEL => 1 DISPLAY => :0.0 LANG => en_US.UTF-8 XAUTHORITY => /home/tawmas/.Xauthority LS_COLORS => no=00:fi=00:di=01;34:ln=01;36:pi=40;33:so=01;35:do=01;35:bd=40;33;01:cd=40;33;01:or=40;31;01:su=37;41:sg=30;43:tw=30;42:ow=34;42:st=37;44:ex=01;32:*.tar=01;31:*.tgz=01;31:*.svgz=01;31:*.arj=01;31:*.taz=01;31:*.lzh=01;31:*.lzma=01;31:*.zip=01;31:*.z=01;31:*.Z=01;31:*.dz=01;31:*.gz=01;31:*.bz2=01;31:*.bz=01;31:*.tbz2=01;31:*.tz=01;31:*.deb=01;31:*.rpm=01;31:*.jar=01;31:*.rar=01;31:*.ace=01;31:*.zoo=01;31:*.cpio=01;31:*.7z=01;31:*.rz=01;31:*.jpg=01;35:*.jpeg=01;35:*.gif=01;35:*.bmp=01;35:*.pbm=01;35:*.pgm=01;35:*.ppm=01;35:*.tga=01;35:*.xbm=01;35:*.xpm=01;35:*.tif=01;35:*.tiff=01;35:*.png=01;35:*.svg=01;35:*.mng=01;35:*.pcx=01;35:*.mov=01;35:*.mpg=01;35:*.mpeg=01;35:*.m2v=01;35:*.mkv=01;35:*.ogm=01;35:*.mp4=01;35:*.m4v=01;35:*.mp4v=01;35:*.vob=01;35:*.qt=01;35:*.nuv=01;35:*.wmv=01;35:*.asf=01;35:*.rm=01;35:*.rmvb=01;35:*.flc=01;35:*.avi=01;35:*.fli=01;35:*.gl=01;35:*.dl=01;35:*.xcf=01;35:*.xwd=01;35:*.yuv=01;35:*.aac=00;36:*.au=00;36:*.flac=00;36:*.mid=00;36:*.midi! =00;36:*.mka=00;36:*.mp3=00;36:*.mpc=00;36:*.ogg=00;36:*.ra=00;36:*.wav=00;36: SSH_AUTH_SOCK => deleted SHELL => /bin/bash GDMSESSION => gnome LESSCLOSE => /usr/bin/lesspipe %s %s GPG_AGENT_INFO => /tmp/gpg-PiCO6t/S.gpg-agent:12540:1 MESA_NO_ASM => 1 PWD => /home/tawmas/Desktop/php5.3-200811090930 SSH_CONNECTION => deleted XDG_DATA_DIRS => /usr/local/share/:/usr/share/:/usr/share/gdm/ MFLAGS => CC => gcc EDITOR => /usr/bin/nano PHP Variables Variable => Value _SERVER["LESSOPEN"] => | /usr/bin/lesspipe %s _SERVER["GNOME_KEYRING_PID"] => 12412 _SERVER["SSH_CLIENT"] => deleted _SERVER["USER"] => tawmas _SERVER["GNOME_KEYRING_SOCKET"] => /tmp/keyring-ffAmri/socket _SERVER["ORBIT_SOCKETDIR"] => /tmp/orbit-tawmas _SERVER["SHLVL"] => 1 _SERVER["HOME"] => /home/tawmas _SERVER["TEST_PHP_SRCDIR"] => /home/tawmas/Desktop/php5.3-200811090930 _SERVER["SSH_TTY"] => deleted _SERVER["DESKTOP_SESSION"] => gnome _SERVER["XDG_SESSION_COOKIE"] => 7968c77d47c11ba05abd28b747efb3f5-1226220517.135641-1688765958 _SERVER["GTK_RC_FILES"] => /etc/gtk/gtkrc:/home/tawmas/.gtkrc-1.2-gnome2 _SERVER["GDM_XSERVER_LOCATION"] => local _SERVER["DBUS_SESSION_BUS_ADDRESS"] => unix:abstract=/tmp/dbus-20BPns4ORg,guid=545ba134d86ab0e6c71b79614916a3e6 _SERVER["MAKEFLAGS"] => _SERVER["COLORTERM"] => gnome-terminal _SERVER["LOGNAME"] => tawmas _SERVER["_"] => /usr/bin/make _SERVER["WINDOWID"] => 25168634 _SERVER["TEST_PHP_EXECUTABLE"] => /home/tawmas/Desktop/php5.3-200811090930/sapi/cli/php _SERVER["USERNAME"] => tawmas _SERVER["TERM"] => xterm _SERVER["GNOME_DESKTOP_SESSION_ID"] => this-is-deprecated _SERVER["HISTCONTROL"] => ignoreboth _SERVER["WINDOWPATH"] => 7 _SERVER["GDM_LANG"] => en_US.UTF-8 _SERVER["SESSION_MANAGER"] => local/tylke:/tmp/.ICE-unix/12423 _SERVER["PATH"] => /usr/local/sbin:/usr/local/bin:/usr/sbin:/usr/bin:/sbin:/bin:/usr/games _SERVER["MAKELEVEL"] => 1 _SERVER["DISPLAY"] => :0.0 _SERVER["LANG"] => en_US.UTF-8 _SERVER["XAUTHORITY"] => /home/tawmas/.Xauthority _SERVER["LS_COLORS"] => no=00:fi=00:di=01;34:ln=01;36:pi=40;33:so=01;35:do=01;35:bd=40;33;01:cd=40;33;01:or=40;31;01:su=37;41:sg=30;43:tw=30;42:ow=34;42:st=37;44:ex=01;32:*.tar=01;31:*.tgz=01;31:*.svgz=01;31:*.arj=01;31:*.taz=01;31:*.lzh=01;31:*.lzma=01;31:*.zip=01;31:*.z=01;31:*.Z=01;31:*.dz=01;31:*.gz=01;31:*.bz2=01;31:*.bz=01;31:*.tbz2=01;31:*.tz=01;31:*.deb=01;31:*.rpm=01;31:*.jar=01;31:*.rar=01;31:*.ace=01;31:*.zoo=01;31:*.cpio=01;31:*.7z=01;31:*.rz=01;31:*.jpg=01;35:*.jpeg=01;35:*.gif=01;35:*.bmp=01;35:*.pbm=01;35:*.pgm=01;35:*.ppm=01;35:*.tga=01;35:*.xbm=01;35:*.xpm=01;35:*.tif=01;35:*.tiff=01;35:*.png=01;35:*.svg=01;35:*.mng=01;35:*.pcx=01;35:*.mov=01;35:*.mpg=01;35:*.mpeg=01;35:*.m2v=01;35:*.mkv=01;35:*.ogm=01;35:*.mp4=01;35:*.m4v=01;35:*.mp4v=01;35:*.vob=01;35:*.qt=01;35:*.nuv=01;35:*.wmv=01;35:*.asf=01;35:*.rm=01;35:*.rmvb=01;35:*.flc=01;35:*.avi=01;35:*.fli=01;35:*.gl=01;35:*.dl=01;35:*.xcf=01;35:*.xwd=01;35:*.yuv=01;35:*.aac=00;36:*.au=00;36:*.flac=00;36:*.mid=0! 0;36:*.midi=00;36:*.mka=00;36:*.mp3=00;36:*.mpc=00;36:*.ogg=00;36:*.ra=00;36:*.wav=00;36: _SERVER["SSH_AUTH_SOCK"] => deleted _SERVER["SHELL"] => /bin/bash _SERVER["GDMSESSION"] => gnome _SERVER["LESSCLOSE"] => /usr/bin/lesspipe %s %s _SERVER["GPG_AGENT_INFO"] => /tmp/gpg-PiCO6t/S.gpg-agent:12540:1 _SERVER["MESA_NO_ASM"] => 1 _SERVER["PWD"] => /home/tawmas/Desktop/php5.3-200811090930 _SERVER["SSH_CONNECTION"] => deleted _SERVER["XDG_DATA_DIRS"] => /usr/local/share/:/usr/share/:/usr/share/gdm/ _SERVER["MFLAGS"] => _SERVER["CC"] => gcc _SERVER["EDITOR"] => /usr/bin/nano _SERVER["PHP_SELF"] => _SERVER["SCRIPT_NAME"] => _SERVER["SCRIPT_FILENAME"] => _SERVER["PATH_TRANSLATED"] => _SERVER["DOCUMENT_ROOT"] => _SERVER["REQUEST_TIME"] => 1226225573 _SERVER["argv"] => Array ( ) _SERVER["argc"] => 0 _ENV["LESSOPEN"] => | /usr/bin/lesspipe %s _ENV["GNOME_KEYRING_PID"] => 12412 _ENV["SSH_CLIENT"] => deleted _ENV["USER"] => tawmas _ENV["GNOME_KEYRING_SOCKET"] => /tmp/keyring-ffAmri/socket _ENV["ORBIT_SOCKETDIR"] => /tmp/orbit-tawmas _ENV["SHLVL"] => 1 _ENV["HOME"] => /home/tawmas _ENV["TEST_PHP_SRCDIR"] => /home/tawmas/Desktop/php5.3-200811090930 _ENV["SSH_TTY"] => deleted _ENV["DESKTOP_SESSION"] => gnome _ENV["XDG_SESSION_COOKIE"] => 7968c77d47c11ba05abd28b747efb3f5-1226220517.135641-1688765958 _ENV["GTK_RC_FILES"] => /etc/gtk/gtkrc:/home/tawmas/.gtkrc-1.2-gnome2 _ENV["GDM_XSERVER_LOCATION"] => local _ENV["DBUS_SESSION_BUS_ADDRESS"] => unix:abstract=/tmp/dbus-20BPns4ORg,guid=545ba134d86ab0e6c71b79614916a3e6 _ENV["MAKEFLAGS"] => _ENV["COLORTERM"] => gnome-terminal _ENV["LOGNAME"] => tawmas _ENV["_"] => /usr/bin/make _ENV["WINDOWID"] => 25168634 _ENV["TEST_PHP_EXECUTABLE"] => /home/tawmas/Desktop/php5.3-200811090930/sapi/cli/php _ENV["USERNAME"] => tawmas _ENV["TERM"] => xterm _ENV["GNOME_DESKTOP_SESSION_ID"] => this-is-deprecated _ENV["HISTCONTROL"] => ignoreboth _ENV["WINDOWPATH"] => 7 _ENV["GDM_LANG"] => en_US.UTF-8 _ENV["SESSION_MANAGER"] => local/tylke:/tmp/.ICE-unix/12423 _ENV["PATH"] => /usr/local/sbin:/usr/local/bin:/usr/sbin:/usr/bin:/sbin:/bin:/usr/games _ENV["MAKELEVEL"] => 1 _ENV["DISPLAY"] => :0.0 _ENV["LANG"] => en_US.UTF-8 _ENV["XAUTHORITY"] => /home/tawmas/.Xauthority _ENV["LS_COLORS"] => no=00:fi=00:di=01;34:ln=01;36:pi=40;33:so=01;35:do=01;35:bd=40;33;01:cd=40;33;01:or=40;31;01:su=37;41:sg=30;43:tw=30;42:ow=34;42:st=37;44:ex=01;32:*.tar=01;31:*.tgz=01;31:*.svgz=01;31:*.arj=01;31:*.taz=01;31:*.lzh=01;31:*.lzma=01;31:*.zip=01;31:*.z=01;31:*.Z=01;31:*.dz=01;31:*.gz=01;31:*.bz2=01;31:*.bz=01;31:*.tbz2=01;31:*.tz=01;31:*.deb=01;31:*.rpm=01;31:*.jar=01;31:*.rar=01;31:*.ace=01;31:*.zoo=01;31:*.cpio=01;31:*.7z=01;31:*.rz=01;31:*.jpg=01;35:*.jpeg=01;35:*.gif=01;35:*.bmp=01;35:*.pbm=01;35:*.pgm=01;35:*.ppm=01;35:*.tga=01;35:*.xbm=01;35:*.xpm=01;35:*.tif=01;35:*.tiff=01;35:*.png=01;35:*.svg=01;35:*.mng=01;35:*.pcx=01;35:*.mov=01;35:*.mpg=01;35:*.mpeg=01;35:*.m2v=01;35:*.mkv=01;35:*.ogm=01;35:*.mp4=01;35:*.m4v=01;35:*.mp4v=01;35:*.vob=01;35:*.qt=01;35:*.nuv=01;35:*.wmv=01;35:*.asf=01;35:*.rm=01;35:*.rmvb=01;35:*.flc=01;35:*.avi=01;35:*.fli=01;35:*.gl=01;35:*.dl=01;35:*.xcf=01;35:*.xwd=01;35:*.yuv=01;35:*.aac=00;36:*.au=00;36:*.flac=00;36:*.mid=00;3! 6:*.midi=00;36:*.mka=00;36:*.mp3=00;36:*.mpc=00;36:*.ogg=00;36:*.ra=00;36:*.wav=00;36: _ENV["SSH_AUTH_SOCK"] => deleted _ENV["SHELL"] => /bin/bash _ENV["GDMSESSION"] => gnome _ENV["LESSCLOSE"] => /usr/bin/lesspipe %s %s _ENV["GPG_AGENT_INFO"] => /tmp/gpg-PiCO6t/S.gpg-agent:12540:1 _ENV["MESA_NO_ASM"] => 1 _ENV["PWD"] => /home/tawmas/Desktop/php5.3-200811090930 _ENV["SSH_CONNECTION"] => deleted _ENV["XDG_DATA_DIRS"] => /usr/local/share/:/usr/share/:/usr/share/gdm/ _ENV["MFLAGS"] => _ENV["CC"] => gcc _ENV["EDITOR"] => /usr/bin/nano PHP License This program is free software; you can redistribute it and/or modify it under the terms of the PHP License as published by the PHP Group and included in the distribution in the file: LICENSE This program is distributed in the hope that it will be useful, but WITHOUT ANY WARRANTY; without even the implied warranty of MERCHANTABILITY or FITNESS FOR A PARTICULAR PURPOSE. If you did not receive a copy of the PHP license, or have any questions about PHP licensing, please contact license@php.net.

« previous php.qa.reports (#13142) next »