Test results for 5.3.0alpha3-dev [failed]
| From: | noreply@php.net | Date: | Sun, 09 Nov 2008 16:18:11 +0000 |
| Subject: | Test results for 5.3.0alpha3-dev [failed] | ||
| Groups: | php.qa.reports | ||
| Request: | Send a blank email to php-qa-reports+get-13143@lists.php.net to get a copy of this message | ||
=====================================================================
FAILED TEST SUMMARY
---------------------------------------------------------------------
Bug #45392 (ob_start()/ob_end_clean() and memory_limit) [tests/lang/bug45392.phpt]
Bug #16069 (ICONV transliteration failure) [ext/iconv/tests/bug16069.phpt]
iconv stream filter [ext/iconv/tests/iconv_stream_filter.phpt]
Bug #41567 (json_encode() double conversion is inconsistent with PHP) [ext/json/tests/bug41567.phpt]
mysqli_connect() [ext/mysqli/tests/mysqli_connect.phpt]
new mysqli() [ext/mysqli/tests/mysqli_connect_oo.phpt]
new mysqli() [ext/mysqli/tests/mysqli_connect_oo_defaults.phpt]
Bug #34657 (If you get a communication problem when loading the WSDL, it fatal's)
[ext/soap/tests/bugs/bug34657.phpt]
SPL: FilesystemIterator and foreach [ext/spl/tests/dit_003.phpt]
SQLite3::open error test [ext/sqlite3/tests/sqlite3_15_open_error.phpt]
Test is_executable() function: usage variations - file/dir with diff. perms
[ext/standard/tests/file/is_executable_variation2.phpt]
Test is_readable() function: usage variations - file/dir with diff. perms
[ext/standard/tests/file/is_readable_variation2.phpt]
Test is_writable() and its alias is_writeable() function: usage variations - file/dir with diff.
perms [ext/standard/tests/file/is_writable_variation2.phpt]
Test lchown() function : error functionality [ext/standard/tests/file/lchown_error.phpt]
proc_open [ext/standard/tests/general_functions/proc_open02.phpt]
similar_text(), basic tests [ext/standard/tests/strings/similar_text_basic.phpt]
=====================================================================
=====================================================================
EXPECTED FAILED TEST SUMMARY
---------------------------------------------------------------------
Inconsistencies when accessing protected members [Zend/tests/access_modifiers_008.phpt]
Inconsistencies when accessing protected members - 2 [Zend/tests/access_modifiers_009.phpt]
Test restore_error_handler() function : bug #46196 [Zend/tests/bug46196.phpt]
SimpleXML: array casting bug [ext/simplexml/tests/034.phpt]
=====================================================================
=====================================================================
TEST RESULT SUMMARY
---------------------------------------------------------------------
Exts skipped : 43
Exts tested : 34
---------------------------------------------------------------------
Number of tests : 7978 6145
Tests skipped : 1833 ( 23.0%) --------
Tests warned : 0 ( 0.0%) ( 0.0%)
Tests failed : 16 ( 0.2%) ( 0.3%)
Expected fail : 4 ( 0.1%) ( 0.1%)
Tests passed : 6125 ( 76.8%) ( 99.7%)
---------------------------------------------------------------------
Time taken : 428 seconds
=====================================================================
=====================================================================
FAILED TEST SUMMARY
---------------------------------------------------------------------
Bug #45392 (ob_start()/ob_end_clean() and memory_limit) [tests/lang/bug45392.phpt]
Bug #16069 (ICONV transliteration failure) [ext/iconv/tests/bug16069.phpt]
iconv stream filter [ext/iconv/tests/iconv_stream_filter.phpt]
Bug #41567 (json_encode() double conversion is inconsistent with PHP) [ext/json/tests/bug41567.phpt]
mysqli_connect() [ext/mysqli/tests/mysqli_connect.phpt]
new mysqli() [ext/mysqli/tests/mysqli_connect_oo.phpt]
new mysqli() [ext/mysqli/tests/mysqli_connect_oo_defaults.phpt]
Bug #34657 (If you get a communication problem when loading the WSDL, it fatal's)
[ext/soap/tests/bugs/bug34657.phpt]
SPL: FilesystemIterator and foreach [ext/spl/tests/dit_003.phpt]
SQLite3::open error test [ext/sqlite3/tests/sqlite3_15_open_error.phpt]
Test is_executable() function: usage variations - file/dir with diff. perms
[ext/standard/tests/file/is_executable_variation2.phpt]
Test is_readable() function: usage variations - file/dir with diff. perms
[ext/standard/tests/file/is_readable_variation2.phpt]
Test is_writable() and its alias is_writeable() function: usage variations - file/dir with diff.
perms [ext/standard/tests/file/is_writable_variation2.phpt]
Test lchown() function : error functionality [ext/standard/tests/file/lchown_error.phpt]
proc_open [ext/standard/tests/general_functions/proc_open02.phpt]
similar_text(), basic tests [ext/standard/tests/strings/similar_text_basic.phpt]
=====================================================================
=====================================================================
EXPECTED FAILED TEST SUMMARY
---------------------------------------------------------------------
Inconsistencies when accessing protected members [Zend/tests/access_modifiers_008.phpt]
Inconsistencies when accessing protected members - 2 [Zend/tests/access_modifiers_009.phpt]
Test restore_error_handler() function : bug #46196 [Zend/tests/bug46196.phpt]
SimpleXML: array casting bug [ext/simplexml/tests/034.phpt]
=====================================================================
================================================================================
/root/php5.3-200811091330/tests/lang/bug45392.phpt
================================================================================
2
Fatal error: Allowed memory size of 262144 bytes exhausted (tried to allocate 204801 bytes) in
/root/php5.3-200811091330/tests/lang/bug45392.php on line 9
================================================================================
003- 5
================================================================================
================================================================================
/root/php5.3-200811091330/ext/iconv/tests/bug16069.phpt
================================================================================
¥ß¥ê¥Ð¡¼¥ë¥ß¥ê¥Ð¡¼¥ë¥ß¥ê¥Ð¡¼¥ë¥ß¥ê¥Ð¡¼¥ë¥ß¥ê¥Ð¡¼¥ë¥ß¥ê¥Ð¡¼¥ë¥ß¥ê¥Ð¡¼¥ë¥ß¥ê¥Ð¡¼¥ë¥ß¥ê¥Ð¡¼¥ë¥ß¥ê¥Ð¡¼¥ë¥ß¥ê¥Ð¡¼¥ë¥ß¥ß¥ê¥Ð¡¼¥ë¥ß¥ê¥Ð¡¼¥ë¥ß¥ê¥Ð¡¼¥ë¥ß¥ê¥Ð¡¼¥ë¥ß¥ê¥Ð¡¼¥ë¥ß¥ê¥Ð¡¼¥ë¥ß¥ê¥Ð¡¼¥ë¥ß¥ê¥Ð¡¼¥ë¥ß¥ê¥Ð¡¼¥ë¥ß¥ê¥Ð¡¼¥ë¥ß¥ê¥Ð¡¼¥ë¥ß¥ê¥Ð¡¼¥ë¥ß¥ê¥Ð¡¼¥ë¥ß¥ê¥Ð¡¼¥ë¥ß¥ê¥Ð¡¼¥ë¥ß¥ê¥Ð¡¼¥ë¥ß¥ê¥Ð¡¼¥ë¥ß¥ê¥Ð¡¼¥ë¥ß¥ê¥Ð¡¼¥ë¥ß¥ê¥Ð¡¼¥ë¥ß¥ê¥Ð¡¼¥ë¥ß¥ê¥Ð¡¼¥ë¥ß¥ê¥Ð¡¼¥ë¥ß¥ê¥Ð¡¼¥ë¥ß¥ê¥Ð¡¼¥ë¥ß¥ê¥Ð¡¼¥ë¥ß¥ê¥Ð¡¼¥ë¥ß¥ê¥Ð¡¼¥ë¥ß¥ê¥Ð¡¼¥ë(¡ë§¥¡ë)
================================================================================
001+
¥ß¥ê¥Ð¡¼¥ë¥ß¥ê¥Ð¡¼¥ë¥ß¥ê¥Ð¡¼¥ë¥ß¥ê¥Ð¡¼¥ë¥ß¥ê¥Ð¡¼¥ë¥ß¥ê¥Ð¡¼¥ë¥ß¥ê¥Ð¡¼¥ë¥ß¥ê¥Ð¡¼¥ë¥ß¥ê¥Ð¡¼¥ë¥ß¥ê¥Ð¡¼¥ë¥ß¥ê¥Ð¡¼¥ë¥ß¥ß¥ê¥Ð¡¼¥ë¥ß¥ê¥Ð¡¼¥ë¥ß¥ê¥Ð¡¼¥ë¥ß¥ê¥Ð¡¼¥ë¥ß¥ê¥Ð¡¼¥ë¥ß¥ê¥Ð¡¼¥ë¥ß¥ê¥Ð¡¼¥ë¥ß¥ê¥Ð¡¼¥ë¥ß¥ê¥Ð¡¼¥ë¥ß¥ê¥Ð¡¼¥ë¥ß¥ê¥Ð¡¼¥ë¥ß¥ê¥Ð¡¼¥ë¥ß¥ê¥Ð¡¼¥ë¥ß¥ê¥Ð¡¼¥ë¥ß¥ê¥Ð¡¼¥ë¥ß¥ê¥Ð¡¼¥ë¥ß¥ê¥Ð¡¼¥ë¥ß¥ê¥Ð¡¼¥ë¥ß¥ê¥Ð¡¼¥ë¥ß¥ê¥Ð¡¼¥ë¥ß¥ê¥Ð¡¼¥ë¥ß¥ê¥Ð¡¼¥ë¥ß¥ê¥Ð¡¼¥ë¥ß¥ê¥Ð¡¼¥ë¥ß¥ê¥Ð¡¼¥ë¥ß¥ê¥Ð¡¼¥ë¥ß¥ê¥Ð¡¼¥ë¥ß¥ê¥Ð¡¼¥ë¥ß¥ê¥Ð¡¼¥ë(¡ë§¥¡ë)
001-
¥ß¥ê¥Ð¡¼¥ë¥ß¥ê¥Ð¡¼¥ë¥ß¥ê¥Ð¡¼¥ë¥ß¥ê¥Ð¡¼¥ë¥ß¥ê¥Ð¡¼¥ë¥ß¥ê¥Ð¡¼¥ë¥ß¥ê¥Ð¡¼¥ë¥ß¥ê¥Ð¡¼¥ë¥ß¥ê¥Ð¡¼¥ë¥ß¥ê¥Ð¡¼¥ë¥ß¥ê¥Ð¡¼¥ë¥ß¥ê¥Ð¡¼¥ë¥ß¥ê¥Ð¡¼¥ë¥ß¥ê¥Ð¡¼¥ë¥ß¥ê¥Ð¡¼¥ë¥ß¥ê¥Ð¡¼¥ë¥ß¥ê¥Ð¡¼¥ë¥ß¥ê¥Ð¡¼¥ë¥ß¥ê¥Ð¡¼¥ë¥ß¥ê¥Ð¡¼¥ë¥ß¥ê¥Ð¡¼¥ë¥ß¥ê¥Ð¡¼¥ë¥ß¥ê¥Ð¡¼¥ë¥ß¥ê¥Ð¡¼¥ë¥ß¥ê¥Ð¡¼¥ë¥ß¥ê¥Ð¡¼¥ë¥ß¥ê¥Ð¡¼¥ë¥ß¥ê¥Ð¡¼¥ë¥ß¥ê¥Ð¡¼¥ë¥ß¥ê¥Ð¡¼¥ë¥ß¥ê¥Ð¡¼¥ë¥ß¥ê¥Ð¡¼¥ë¥ß¥ê¥Ð¡¼¥ë¥ß¥ê¥Ð¡¼¥ë¥ß¥ê¥Ð¡¼¥ë¥ß¥ê¥Ð¡¼¥ë¥ß¥ê¥Ð¡¼¥ë¥ß¥ê¥Ð¡¼¥ë¥ß¥ê¥Ð¡¼¥ë¥ß¥ê¥Ð¡¼¥ë(¡ë§¥¡ë)
================================================================================
================================================================================
/root/php5.3-200811091330/ext/iconv/tests/iconv_stream_filter.phpt
================================================================================
string(20) "1b244224332473244b24"
string(10) "41244f1b28"
string(2) "42"
string(20) "a4b3a4f3a4cba4c1a4cf"
string(10) "69636f6e76"
string(2) "0a"
string(20) "1b244f24332466245824"
string(10) "4e24421b28"
string(2) "4f"
================================================================================
007+ string(20) "1b244f24332466245824"
008+ string(10) "4e24421b28"
009+ string(2) "4f"
007-
008- Warning: fread(): iconv stream filter ("ISO-2022-JP"=>"EUC-JP"): invalid
multibyte sequence in %s on line %d
009- string(0) ""
010- string(0) ""
011- string(0) ""
================================================================================
================================================================================
/root/php5.3-200811091330/ext/json/tests/bug41567.phpt
================================================================================
float(123456789.123)
Done
================================================================================
001+ float(123456789.123)
001- float(123456789.12345)
================================================================================
================================================================================
/root/php5.3-200811091330/ext/mysqli/tests/mysqli_connect.phpt
================================================================================
Warning: mysqli_connect(): [2002] No such file or directory (trying to connect via
unix:///tmp/mysql.sock) in /root/php5.3-200811091330/ext/mysqli/tests/mysqli_connect.php on line 47
Warning: mysqli_connect(): (HY000/2002): No such file or directory in
/root/php5.3-200811091330/ext/mysqli/tests/mysqli_connect.php on line 47
[008] Cannot connect to the server using host=localhost, user=root, passwd=***, dbname=test,
port=3306, socket=
Warning: mysqli_close() expects parameter 1 to be mysqli, boolean given in
/root/php5.3-200811091330/ext/mysqli/tests/mysqli_connect.php on line 51
Warning: mysqli_connect(): [2002] No such file or directory (trying to connect via
unix:///tmp/mysql.sock) in /root/php5.3-200811091330/ext/mysqli/tests/mysqli_connect.php on line 53
Warning: mysqli_connect(): (HY000/2002): No such file or directory in
/root/php5.3-200811091330/ext/mysqli/tests/mysqli_connect.php on line 53
Warning: mysqli_connect(): [2002] No such file or directory (trying to connect via
unix:///tmp/mysql.sock) in /root/php5.3-200811091330/ext/mysqli/tests/mysqli_connect.php on line 62
Warning: mysqli_connect(): (HY000/2002): No such file or directory in
/root/php5.3-200811091330/ext/mysqli/tests/mysqli_connect.php on line 62
[011] Usage of mysqli.default_socket failed
Warning: mysqli_connect(): [2002] No such file or directory (trying to connect via
unix:///tmp/mysql.sock) in /root/php5.3-200811091330/ext/mysqli/tests/mysqli_connect.php on line 73
Warning: mysqli_connect(): (HY000/2002): No such file or directory in
/root/php5.3-200811091330/ext/mysqli/tests/mysqli_connect.php on line 73
[013] Usage of mysqli.default_port failed
Warning: mysqli_connect(): [2002] No such file or directory (trying to connect via
unix:///tmp/mysql.sock) in /root/php5.3-200811091330/ext/mysqli/tests/mysqli_connect.php on line 84
Warning: mysqli_connect(): (HY000/2002): No such file or directory in
/root/php5.3-200811091330/ext/mysqli/tests/mysqli_connect.php on line 84
[015] Usage of mysqli.default_pw failed
Warning: mysqli_connect(): [2002] No such file or directory (trying to connect via
unix:///tmp/mysql.sock) in /root/php5.3-200811091330/ext/mysqli/tests/mysqli_connect.php on line 95
Warning: mysqli_connect(): (HY000/2002): No such file or directory in
/root/php5.3-200811091330/ext/mysqli/tests/mysqli_connect.php on line 95
[017] Usage of mysqli.default_user failed
Warning: mysqli_connect(): [2002] No such file or directory (trying to connect via
unix:///tmp/mysql.sock) in /root/php5.3-200811091330/ext/mysqli/tests/mysqli_connect.php on line 106
Warning: mysqli_connect(): (HY000/2002): No such file or directory in
/root/php5.3-200811091330/ext/mysqli/tests/mysqli_connect.php on line 106
[019] Usage of mysqli.default_host failed
Warning: mysqli_connect(): [2002] No such file or directory (trying to connect via
unix:///tmp/mysql.sock) in /root/php5.3-200811091330/ext/mysqli/tests/mysqli_connect.php on line 118
Warning: mysqli_connect(): (HY000/2002): No such file or directory in
/root/php5.3-200811091330/ext/mysqli/tests/mysqli_connect.php on line 118
[021] Usage of mysqli.default_host (persistent) failed
done!
================================================================================
001+ Warning: mysqli_connect(): [2002] No such file or directory (trying to connect via
unix:///tmp/mysql.sock) in /root/php5.3-200811091330/ext/mysqli/tests/mysqli_connect.php on line 47
002+
003+ Warning: mysqli_connect(): (HY000/2002): No such file or directory in
/root/php5.3-200811091330/ext/mysqli/tests/mysqli_connect.php on line 47
004+ [008] Cannot connect to the server using host=localhost, user=root, passwd=***, dbname=test,
port=3306, socket=
005+
006+ Warning: mysqli_close() expects parameter 1 to be mysqli, boolean given in
/root/php5.3-200811091330/ext/mysqli/tests/mysqli_connect.php on line 51
007+
008+ Warning: mysqli_connect(): [2002] No such file or directory (trying to connect via
unix:///tmp/mysql.sock) in /root/php5.3-200811091330/ext/mysqli/tests/mysqli_connect.php on line 53
009+
010+ Warning: mysqli_connect(): (HY000/2002): No such file or directory in
/root/php5.3-200811091330/ext/mysqli/tests/mysqli_connect.php on line 53
011+
012+ Warning: mysqli_connect(): [2002] No such file or directory (trying to connect via
unix:///tmp/mysql.sock) in /root/php5.3-200811091330/ext/mysqli/tests/mysqli_connect.php on line 62
013+
014+ Warning: mysqli_connect(): (HY000/2002): No such file or directory in
/root/php5.3-200811091330/ext/mysqli/tests/mysqli_connect.php on line 62
015+ [011] Usage of mysqli.default_socket failed
016+
017+ Warning: mysqli_connect(): [2002] No such file or directory (trying to connect via
unix:///tmp/mysql.sock) in /root/php5.3-200811091330/ext/mysqli/tests/mysqli_connect.php on line 73
018+
019+ Warning: mysqli_connect(): (HY000/2002): No such file or directory in
/root/php5.3-200811091330/ext/mysqli/tests/mysqli_connect.php on line 73
020+ [013] Usage of mysqli.default_port failed
021+
022+ Warning: mysqli_connect(): [2002] No such file or directory (trying to connect via
unix:///tmp/mysql.sock) in /root/php5.3-200811091330/ext/mysqli/tests/mysqli_connect.php on line 84
023+
024+ Warning: mysqli_connect(): (HY000/2002): No such file or directory in
/root/php5.3-200811091330/ext/mysqli/tests/mysqli_connect.php on line 84
001- Warning: mysqli_connect(): (%d/%d): Access denied for user '%s'@'%s' (using
password: YES) in %s on line %d
002- array(1) {
003- ["testing"]=>
004- string(21) "mysqli.default_socket"
005- }
006- array(1) {
007- ["testing"]=>
008- string(19) "mysqli.default_port"
009- }
010- array(1) {
011- ["testing"]=>
012- string(17) "mysqli.default_pw"
013- }
014- array(2) {
015- [0]=>
016- string(19) "mysqli.default_user"
017- ["testing"]=>
018- string(19) "mysqli.default_user"
019- }
020- array(1) {
021- [0]=>
022- string(19) "mysqli.default_host"
023- }
024- done!
025+ [015] Usage of mysqli.default_pw failed
026+
027+ Warning: mysqli_connect(): [2002] No such file or directory (trying to connect via
unix:///tmp/mysql.sock) in /root/php5.3-200811091330/ext/mysqli/tests/mysqli_connect.php on line 95
028+
029+ Warning: mysqli_connect(): (HY000/2002): No such file or directory in
/root/php5.3-200811091330/ext/mysqli/tests/mysqli_connect.php on line 95
030+ [017] Usage of mysqli.default_user failed
031+
032+ Warning: mysqli_connect(): [2002] No such file or directory (trying to connect via
unix:///tmp/mysql.sock) in /root/php5.3-200811091330/ext/mysqli/tests/mysqli_connect.php on line 106
033+
034+ Warning: mysqli_connect(): (HY000/2002): No such file or directory in
/root/php5.3-200811091330/ext/mysqli/tests/mysqli_connect.php on line 106
035+ [019] Usage of mysqli.default_host failed
036+
037+ Warning: mysqli_connect(): [2002] No such file or directory (trying to connect via
unix:///tmp/mysql.sock) in /root/php5.3-200811091330/ext/mysqli/tests/mysqli_connect.php on line 118
038+
039+ Warning: mysqli_connect(): (HY000/2002): No such file or directory in
/root/php5.3-200811091330/ext/mysqli/tests/mysqli_connect.php on line 118
040+ [021] Usage of mysqli.default_host (persistent) failed
041+ done!
================================================================================
================================================================================
/root/php5.3-200811091330/ext/mysqli/tests/mysqli_connect_oo.phpt
================================================================================
Warning: mysqli::mysqli(): [2002] No such file or directory (trying to connect via
unix:///tmp/mysql.sock) in /root/php5.3-200811091330/ext/mysqli/tests/mysqli_connect_oo.php on line
9
Warning: mysqli::mysqli(): (HY000/2002): No such file or directory in
/root/php5.3-200811091330/ext/mysqli/tests/mysqli_connect_oo.php on line 9
Warning: mysqli::mysqli(): [2002] No such file or directory (trying to connect via
unix:///tmp/mysql.sock) in /root/php5.3-200811091330/ext/mysqli/tests/mysqli_connect_oo.php on line
18
Warning: mysqli::mysqli(): (HY000/2002): No such file or directory in
/root/php5.3-200811091330/ext/mysqli/tests/mysqli_connect_oo.php on line 18
[005] Usage of mysqli.default_socket failed
Warning: mysqli::mysqli(): [2002] No such file or directory (trying to connect via
unix:///tmp/mysql.sock) in /root/php5.3-200811091330/ext/mysqli/tests/mysqli_connect_oo.php on line
25
Warning: mysqli::mysqli(): (HY000/2002): No such file or directory in
/root/php5.3-200811091330/ext/mysqli/tests/mysqli_connect_oo.php on line 25
[006] Usage of mysqli.default_port failed
Warning: mysqli::mysqli(): [2002] No such file or directory (trying to connect via
unix:///tmp/mysql.sock) in /root/php5.3-200811091330/ext/mysqli/tests/mysqli_connect_oo.php on line
32
Warning: mysqli::mysqli(): (HY000/2002): No such file or directory in
/root/php5.3-200811091330/ext/mysqli/tests/mysqli_connect_oo.php on line 32
[007] Usage of mysqli.default_pw failed
Warning: mysqli::mysqli(): [2002] No such file or directory (trying to connect via
unix:///tmp/mysql.sock) in /root/php5.3-200811091330/ext/mysqli/tests/mysqli_connect_oo.php on line
39
Warning: mysqli::mysqli(): (HY000/2002): No such file or directory in
/root/php5.3-200811091330/ext/mysqli/tests/mysqli_connect_oo.php on line 39
[008] Usage of mysqli.default_user failed
[012] Failed to create mysqli object
... and now Exceptions
Warning: mysqli::mysqli(): [2002] No such file or directory (trying to connect via
unix:///tmp/mysql.sock) in /root/php5.3-200811091330/ext/mysqli/tests/mysqli_connect_oo.php on line
81
No such file or directory
Warning: mysqli::mysqli(): [2002] No such file or directory (trying to connect via
unix:///tmp/mysql.sock) in /root/php5.3-200811091330/ext/mysqli/tests/mysqli_connect_oo.php on line
91
No such file or directory
[017] Usage of mysqli.default_socket failed
Warning: mysqli::mysqli(): [2002] No such file or directory (trying to connect via
unix:///tmp/mysql.sock) in /root/php5.3-200811091330/ext/mysqli/tests/mysqli_connect_oo.php on line
100
No such file or directory
[018] Usage of mysqli.default_port failed
Warning: mysqli::mysqli(): [2002] No such file or directory (trying to connect via
unix:///tmp/mysql.sock) in /root/php5.3-200811091330/ext/mysqli/tests/mysqli_connect_oo.php on line
109
No such file or directory
[019] Usage of mysqli.default_pw failed
Warning: mysqli::mysqli(): [2002] No such file or directory (trying to connect via
unix:///tmp/mysql.sock) in /root/php5.3-200811091330/ext/mysqli/tests/mysqli_connect_oo.php on line
118
No such file or directory
[020] Usage of mysqli.default_user failed
Warning: mysqli::real_connect(): [2002] No such file or directory (trying to connect via
unix:///tmp/mysql.sock) in /root/php5.3-200811091330/ext/mysqli/tests/mysqli_connect_oo.php on line
129
No such file or directory
[021] Usage of mysqli.default_host failed
done!
================================================================================
001+ Warning: mysqli::mysqli(): [2002] No such file or directory (trying to connect via
unix:///tmp/mysql.sock) in /root/php5.3-200811091330/ext/mysqli/tests/mysqli_connect_oo.php on line
9
002+
003+ Warning: mysqli::mysqli(): (HY000/2002): No such file or directory in
/root/php5.3-200811091330/ext/mysqli/tests/mysqli_connect_oo.php on line 9
004+
001- Warning: mysqli::mysqli(): (%d/%d): Access denied for user
'%sunknown%s'@'%s' (using password: %s) in %s on line %d
002- ... and now Exceptions
003- Access denied for user '%s'@'%s' (using password: %s)
004- done!
005+ Warning: mysqli::mysqli(): [2002] No such file or directory (trying to connect via
unix:///tmp/mysql.sock) in /root/php5.3-200811091330/ext/mysqli/tests/mysqli_connect_oo.php on line
18
006+
007+ Warning: mysqli::mysqli(): (HY000/2002): No such file or directory in
/root/php5.3-200811091330/ext/mysqli/tests/mysqli_connect_oo.php on line 18
008+ [005] Usage of mysqli.default_socket failed
009+
010+ Warning: mysqli::mysqli(): [2002] No such file or directory (trying to connect via
unix:///tmp/mysql.sock) in /root/php5.3-200811091330/ext/mysqli/tests/mysqli_connect_oo.php on line
25
011+
012+ Warning: mysqli::mysqli(): (HY000/2002): No such file or directory in
/root/php5.3-200811091330/ext/mysqli/tests/mysqli_connect_oo.php on line 25
013+ [006] Usage of mysqli.default_port failed
014+
015+ Warning: mysqli::mysqli(): [2002] No such file or directory (trying to connect via
unix:///tmp/mysql.sock) in /root/php5.3-200811091330/ext/mysqli/tests/mysqli_connect_oo.php on line
32
016+
017+ Warning: mysqli::mysqli(): (HY000/2002): No such file or directory in
/root/php5.3-200811091330/ext/mysqli/tests/mysqli_connect_oo.php on line 32
018+ [007] Usage of mysqli.default_pw failed
019+
020+ Warning: mysqli::mysqli(): [2002] No such file or directory (trying to connect via
unix:///tmp/mysql.sock) in /root/php5.3-200811091330/ext/mysqli/tests/mysqli_connect_oo.php on line
39
021+
022+ Warning: mysqli::mysqli(): (HY000/2002): No such file or directory in
/root/php5.3-200811091330/ext/mysqli/tests/mysqli_connect_oo.php on line 39
023+ [008] Usage of mysqli.default_user failed
024+ [012] Failed to create mysqli object
025+ ... and now Exceptions
026+
027+ Warning: mysqli::mysqli(): [2002] No such file or directory (trying to connect via
unix:///tmp/mysql.sock) in /root/php5.3-200811091330/ext/mysqli/tests/mysqli_connect_oo.php on line
81
028+ No such file or directory
029+
030+ Warning: mysqli::mysqli(): [2002] No such file or directory (trying to connect via
unix:///tmp/mysql.sock) in /root/php5.3-200811091330/ext/mysqli/tests/mysqli_connect_oo.php on line
91
031+ No such file or directory
032+ [017] Usage of mysqli.default_socket failed
033+
034+ Warning: mysqli::mysqli(): [2002] No such file or directory (trying to connect via
unix:///tmp/mysql.sock) in /root/php5.3-200811091330/ext/mysqli/tests/mysqli_connect_oo.php on line
100
035+ No such file or directory
036+ [018] Usage of mysqli.default_port failed
037+
038+ Warning: mysqli::mysqli(): [2002] No such file or directory (trying to connect via
unix:///tmp/mysql.sock) in /root/php5.3-200811091330/ext/mysqli/tests/mysqli_connect_oo.php on line
109
039+ No such file or directory
040+ [019] Usage of mysqli.default_pw failed
041+
042+ Warning: mysqli::mysqli(): [2002] No such file or directory (trying to connect via
unix:///tmp/mysql.sock) in /root/php5.3-200811091330/ext/mysqli/tests/mysqli_connect_oo.php on line
118
043+ No such file or directory
044+ [020] Usage of mysqli.default_user failed
045+
046+ Warning: mysqli::real_connect(): [2002] No such file or directory (trying to connect via
unix:///tmp/mysql.sock) in /root/php5.3-200811091330/ext/mysqli/tests/mysqli_connect_oo.php on line
129
047+ No such file or directory
048+ [021] Usage of mysqli.default_host failed
049+ done!
================================================================================
================================================================================
/root/php5.3-200811091330/ext/mysqli/tests/mysqli_connect_oo_defaults.phpt
================================================================================
Warning: mysqli::real_connect(): [2002] No such file or directory (trying to connect via
unix://socket) in /root/php5.3-200811091330/ext/mysqli/tests/mysqli_connect_oo_defaults.php on line
18
No such file or directory
[002] Usage of mysqli.default_socket failed
Warning: mysqli::real_connect(): [2002] No such file or directory (trying to connect via
unix://socket) in /root/php5.3-200811091330/ext/mysqli/tests/mysqli_connect_oo_defaults.php on line
35
No such file or directory
[004] Usage of mysqli.default_port failed
Warning: mysqli::real_connect(): [2002] No such file or directory (trying to connect via
unix://socket) in /root/php5.3-200811091330/ext/mysqli/tests/mysqli_connect_oo_defaults.php on line
52
No such file or directory
[006] Usage of mysqli.default_pw failed
Warning: mysqli::real_connect(): [2002] No such file or directory (trying to connect via
unix://socket) in /root/php5.3-200811091330/ext/mysqli/tests/mysqli_connect_oo_defaults.php on line
70
No such file or directory
[008] Usage of mysqli.default_user failed
Warning: mysqli::real_connect(): [2002] No such file or directory (trying to connect via
unix://socket) in /root/php5.3-200811091330/ext/mysqli/tests/mysqli_connect_oo_defaults.php on line
88
No such file or directory
[012] Usage of mysqli.default_host failed
Warning: mysqli_connect(): [2002] No such file or directory (trying to connect via unix://socket) in
/root/php5.3-200811091330/ext/mysqli/tests/mysqli_connect_oo_defaults.php on line 111
No such file or directory
[014] Usage of mysqli_connect() has failed
Warning: mysqli_connect(): [2002] No such file or directory (trying to connect via unix://socket) in
/root/php5.3-200811091330/ext/mysqli/tests/mysqli_connect_oo_defaults.php on line 124
No such file or directory
[016] Usage of mysqli_connect() has failed
done!
================================================================================
001+ Warning: mysqli::real_connect(): [2002] No such file or directory (trying to connect via
unix://socket) in /root/php5.3-200811091330/ext/mysqli/tests/mysqli_connect_oo_defaults.php on line
18
002+ No such file or directory
003+ [002] Usage of mysqli.default_socket failed
004+
005+ Warning: mysqli::real_connect(): [2002] No such file or directory (trying to connect via
unix://socket) in /root/php5.3-200811091330/ext/mysqli/tests/mysqli_connect_oo_defaults.php on line
35
006+ No such file or directory
007+ [004] Usage of mysqli.default_port failed
008+
009+ Warning: mysqli::real_connect(): [2002] No such file or directory (trying to connect via
unix://socket) in /root/php5.3-200811091330/ext/mysqli/tests/mysqli_connect_oo_defaults.php on line
52
010+ No such file or directory
011+ [006] Usage of mysqli.default_pw failed
012+
013+ Warning: mysqli::real_connect(): [2002] No such file or directory (trying to connect via
unix://socket) in /root/php5.3-200811091330/ext/mysqli/tests/mysqli_connect_oo_defaults.php on line
70
014+ No such file or directory
015+ [008] Usage of mysqli.default_user failed
016+
017+ Warning: mysqli::real_connect(): [2002] No such file or directory (trying to connect via
unix://socket) in /root/php5.3-200811091330/ext/mysqli/tests/mysqli_connect_oo_defaults.php on line
88
018+ No such file or directory
019+ [012] Usage of mysqli.default_host failed
020+
021+ Warning: mysqli_connect(): [2002] No such file or directory (trying to connect via
unix://socket) in /root/php5.3-200811091330/ext/mysqli/tests/mysqli_connect_oo_defaults.php on line
111
022+ No such file or directory
023+ [014] Usage of mysqli_connect() has failed
024+
025+ Warning: mysqli_connect(): [2002] No such file or directory (trying to connect via
unix://socket) in /root/php5.3-200811091330/ext/mysqli/tests/mysqli_connect_oo_defaults.php on line
124
026+ No such file or directory
027+ [016] Usage of mysqli_connect() has failed
001- array(1) {
002- ["testing"]=>
003- string(21) "mysqli.default_socket"
004- }
005- array(1) {
006- ["testing"]=>
007- string(19) "mysqli.default_port"
008- }
009- array(1) {
010- ["testing"]=>
011- string(17) "mysqli.default_pw"
012- }
013- array(1) {
014- ["testing"]=>
015- string(19) "mysqli.default_user"
016- }
017- array(1) {
018- ["all_defaults"]=>
019- string(13) "have been set"
020- }
021- array(1) {
022- ["all_defaults"]=>
023- string(13) "have been set"
024- }
================================================================================
================================================================================
/root/php5.3-200811091330/ext/soap/tests/bugs/bug34657.phpt
================================================================================
SoapFault
SOAP-ERROR: Parsing WSDL: Couldn't load from 'http://i_dont_exist.com/some.wsdl' : failed
to load external entity "http://i_dont_exist.com/some.wsdl"
ok
================================================================================
001+ SoapFault
002+ SOAP-ERROR: Parsing WSDL: Couldn't load from 'http://i_dont_exist.com/some.wsdl' : failed
to load external entity "http://i_dont_exist.com/some.wsdl"
001- Warning: SoapClient::SoapClient(): %s %sbug34657.php on line 3
003- Warning: SoapClient::SoapClient(http://i_dont_exist.com/some.wsdl): failed to open stream:
%sbug34657.php on line 3
004-
005- Warning: SoapClient::SoapClient(): I/O warning : failed to load external entity "http://i_dont_exist.com/some.wsdl" in
%sbug34657.php on line 3
006- SoapFault
007- SOAP-ERROR: Parsing WSDL: Couldn't load from 'http://i_dont_exist.com/some.wsdl'
================================================================================
================================================================================
/root/php5.3-200811091330/ext/spl/tests/dit_003.phpt
================================================================================
Fatal error: Uncaught exception 'UnexpectedValueException' with message
'FilesystemIterator::__construct(CVS): failed to open dir: No such file or directory' in
/root/php5.3-200811091330/ext/spl/tests/dit_003.php:3
Stack trace:
#0 /root/php5.3-200811091330/ext/spl/tests/dit_003.php(3):
FilesystemIterator->__construct('CVS')
#1 {main}
thrown in /root/php5.3-200811091330/ext/spl/tests/dit_003.php on line 3
================================================================================
001+ Fatal error: Uncaught exception 'UnexpectedValueException' with message
'FilesystemIterator::__construct(CVS): failed to open dir: No such file or directory' in
/root/php5.3-200811091330/ext/spl/tests/dit_003.php:3
002+ Stack trace:
001- bool(true)
002- ===DONE===
003+ #0 /root/php5.3-200811091330/ext/spl/tests/dit_003.php(3):
FilesystemIterator->__construct('CVS')
004+ #1 {main}
005+ thrown in /root/php5.3-200811091330/ext/spl/tests/dit_003.php on line 3
================================================================================
================================================================================
/root/php5.3-200811091330/ext/sqlite3/tests/sqlite3_15_open_error.phpt
================================================================================
object(SQLite3)#1 (0) {
}
Done
================================================================================
001- Notice: SQLite3::__construct(): Unable to open database: unable to open database file in
%s/sqlite3_15_open_error.php on line %d
================================================================================
================================================================================
/root/php5.3-200811091330/ext/standard/tests/file/is_executable_variation2.phpt
================================================================================
*** Testing is_executable(): usage variations ***
*** Testing is_executable() on directory without execute permission ***
bool(true)
*** Testing miscelleneous input for is_executable() function ***
-- Iteration 1 --
bool(true)
-- Iteration 2 --
bool(true)
-- Iteration 3 --
bool(true)
-- Iteration 4 --
bool(true)
-- Iteration 5 --
bool(false)
-- Iteration 6 --
bool(true)
-- Iteration 7 --
bool(true)
-- Iteration 8 --
bool(true)
-- Iteration 9 --
bool(true)
-- Iteration 10 --
bool(true)
Done
================================================================================
004+ bool(true)
004- bool(false)
024+ bool(true)
024- bool(false)
================================================================================
================================================================================
/root/php5.3-200811091330/ext/standard/tests/file/is_readable_variation2.phpt
================================================================================
*** Testing is_readable(): usage variations ***
*** Testing is_readable() on directory without read permission ***
bool(true)
*** Testing miscelleneous input for is_readable() function ***
-- Iteration 1 --
bool(true)
-- Iteration 2 --
bool(true)
-- Iteration 3 --
bool(true)
-- Iteration 4 --
bool(true)
-- Iteration 5 --
bool(true)
-- Iteration 6 --
bool(true)
-- Iteration 7 --
bool(true)
-- Iteration 8 --
bool(true)
-- Iteration 9 --
bool(true)
-- Iteration 10 --
bool(true)
Done
================================================================================
004+ bool(true)
004- bool(false)
016+ bool(true)
016- bool(false)
================================================================================
================================================================================
/root/php5.3-200811091330/ext/standard/tests/file/is_writable_variation2.phpt
================================================================================
*** Testing is_writable(): usage variations ***
*** Testing is_writable() on directory without write permission ***
bool(true)
bool(true)
*** Testing miscelleneous input for is_writable() function ***
-- Iteration 1 --
bool(true)
bool(true)
-- Iteration 2 --
bool(true)
bool(true)
-- Iteration 3 --
bool(true)
bool(true)
-- Iteration 4 --
bool(true)
bool(true)
-- Iteration 5 --
bool(true)
bool(true)
-- Iteration 6 --
bool(true)
bool(true)
-- Iteration 7 --
bool(true)
bool(true)
-- Iteration 8 --
bool(true)
bool(true)
-- Iteration 9 --
bool(true)
bool(true)
-- Iteration 10 --
bool(true)
bool(true)
Done
================================================================================
004+ bool(true)
005+ bool(true)
004- bool(false)
005- bool(false)
018+ bool(true)
019+ bool(true)
018- bool(false)
019- bool(false)
027+ bool(true)
028+ bool(true)
027- bool(false)
028- bool(false)
033+ bool(true)
034+ bool(true)
033- bool(false)
034- bool(false)
036+ bool(true)
037+ bool(true)
036- bool(false)
037- bool(false)
================================================================================
================================================================================
/root/php5.3-200811091330/ext/standard/tests/file/lchown_error.phpt
================================================================================
*** Testing lchown() : error functionality ***
Warning: lchown() expects exactly 2 parameters, 1 given in
/root/php5.3-200811091330/ext/standard/tests/file/lchown_error.php on line 17
bool(true)
Warning: lchown() expects exactly 2 parameters, 3 given in
/root/php5.3-200811091330/ext/standard/tests/file/lchown_error.php on line 20
bool(true)
Warning: lchown(): No such file or directory in
/root/php5.3-200811091330/ext/standard/tests/file/lchown_error.php on line 23
bool(false)
Warning: lchown() expects parameter 1 to be string, object given in
/root/php5.3-200811091330/ext/standard/tests/file/lchown_error.php on line 26
bool(true)
Warning: lchown() expects parameter 1 to be string, array given in
/root/php5.3-200811091330/ext/standard/tests/file/lchown_error.php on line 27
bool(true)
bool(true)
===DONE===
================================================================================
017+ bool(true)
017-
018- Warning: lchown(): Operation not permitted in %s on line %d
019- bool(false)
================================================================================
================================================================================
/root/php5.3-200811091330/ext/standard/tests/general_functions/proc_open02.phpt
================================================================================
bool(true)
array(8) {
["command"]=>
string(28) "/usr/bin/nohup /bin/sleep 50"
["pid"]=>
int(29943)
["running"]=>
bool(false)
["signaled"]=>
bool(true)
["stopped"]=>
bool(false)
["exitcode"]=>
int(-1)
["termsig"]=>
int(1)
["stopsig"]=>
int(0)
}
bool(false)
array(8) {
["command"]=>
string(28) "/usr/bin/nohup /bin/sleep 50"
["pid"]=>
int(29943)
["running"]=>
bool(false)
["signaled"]=>
bool(false)
["stopped"]=>
bool(false)
["exitcode"]=>
int(-1)
["termsig"]=>
int(0)
["stopsig"]=>
int(0)
}
Done!
================================================================================
008+ bool(false)
009+ ["signaled"]=>
009- ["signaled"]=>
010- bool(false)
016+ int(1)
016- int(0)
020+ bool(false)
020- bool(true)
029+ bool(false)
029- bool(true)
035+ int(0)
035- int(15)
================================================================================
================================================================================
/root/php5.3-200811091330/ext/standard/tests/strings/similar_text_basic.phpt
================================================================================
int(3)
int(0)
int(1)
int(7)
float(54.5454545455)
float(0)
float(18.1818181818)
float(51.8518518519)
===DONE===
================================================================================
005+ float(54.5454545455)
005- float(54.545454545455)
007+ float(18.1818181818)
008+ float(51.8518518519)
007- float(18.181818181818)
008- float(51.851851851852)
================================================================================
================================================================================
BUILD ENVIRONMENT
================================================================================
OS:
Linux - Linux srv006 2.6.17-10-server #2 SMP Fri Oct 13 18:47:26 UTC 2006 i686
Autoconf:
autoconf (GNU Autoconf) 2.60
Written by David J. MacKenzie and Akim Demaille.
Copyright (C) 2006 Free Software Foundation, Inc.
This is free software; see the source for copying conditions. There is NO
warranty; not even for MERCHANTABILITY or FITNESS FOR A PARTICULAR PURPOSE.
Bundled Libtool:
ltmain.sh (GNU libtool) 1.5.20 (1.1220.2.287 2005/08/31 18:54:15)
Copyright (C) 2005 Free Software Foundation, Inc.
This is free software; see the source for copying conditions. There is NO
warranty; not even for MERCHANTABILITY or FITNESS FOR A PARTICULAR PURPOSE.
System Libtool:
N/A
Compiler:
Using built-in specs.
Target: i486-linux-gnu
Configured with: ../src/configure -v --enable-languages=c,c++,fortran,objc,obj-c++,treelang
--prefix=/usr --enable-shared --with-system-zlib --libexecdir=/usr/lib --without-included-gettext
--enable-threads=posix --enable-nls --program-suffix=-4.1 --enable-__cxa_atexit --enable-clocale=gnu
--enable-libstdcxx-debug --enable-mpfr --enable-checking=release i486-linux-gnu
Thread model: posix
gcc version 4.1.2 20060928 (prerelease) (Ubuntu 4.1.1-13ubuntu5)
Bison:
Libraries:
linux-gate.so.1 => (0xffffe000)
libcrypt.so.1 => /lib/tls/i686/cmov/libcrypt.so.1 (0x40021000)
librt.so.1 => /lib/tls/i686/cmov/librt.so.1 (0x4004f000)
libmcrypt.so.4 => /usr/lib/libmcrypt.so.4 (0x40058000)
libltdl.so.3 => /usr/lib/libltdl.so.3 (0x40085000)
libpng12.so.0 => /usr/lib/libpng12.so.0 (0x4008c000)
libz.so.1 => /usr/lib/libz.so.1 (0x400b0000)
libresolv.so.2 => /lib/tls/i686/cmov/libresolv.so.2 (0x400c4000)
libnsl.so.1 => /lib/tls/i686/cmov/libnsl.so.1 (0x400d7000)
libxml2.so.2 => /usr/lib/libxml2.so.2 (0x400ed000)
libdl.so.2 => /lib/tls/i686/cmov/libdl.so.2 (0x40206000)
libm.so.6 => /lib/tls/i686/cmov/libm.so.6 (0x4020b000)
libc.so.6 => /lib/tls/i686/cmov/libc.so.6 (0x40231000)
libpthread.so.0 => /lib/tls/i686/cmov/libpthread.so.0 (0x40365000)
/lib/ld-linux.so.2 (0x40000000)
User's E-mail:
================================================================================
PHPINFO
================================================================================
phpinfo()
PHP Version => 5.3.0alpha3-dev
System => Linux srv006 2.6.17-10-server #2 SMP Fri Oct 13 18:47:26 UTC 2006 i686
Build Date => Nov 9 2008 16:39:50
Configure Command => './configure' '--with-pcre-regex'
'--without-sqlite' '--with-mysqli=mysqlnd' '--with-gd'
'--with-ttf' '--enable-exif' '--with-mcrypt'
'--enable-mbstring' '--enable-spl' '--prefix=/usr/local/php5'
'--with-zlib' '--enable-gd-native-ttf' '--enable-sockets'
'--enable-soap' '--with-apxs2=/usr/local/apache2/bin/apxs'
Server API => Command Line Interface
Virtual Directory Support => disabled
Configuration File (php.ini) Path => /usr/local/php5/lib
Loaded Configuration File => /etc/php.ini
Scan this dir for additional .ini files => (none)
additional .ini files parsed => (none)
PHP API => 20041225
PHP Extension => 20071006
Zend Extension => 220070929
Debug Build => no
Thread Safety => disabled
Zend Memory Manager => enabled
Zend Multibyte Support => disabled
IPv6 Support => enabled
Registered PHP Streams => php, file, glob, data, http, ftp, compress.zlib, phar
Registered Stream Socket Transports => tcp, udp, unix, udg
Registered Stream Filters => string.rot13, string.toupper, string.tolower, string.strip_tags,
convert.*, consumed, convert.iconv.*, zlib.*
This program makes use of the Zend Scripting Language Engine:
Zend Engine v2.3.0, Copyright (c) 1998-2008 Zend Technologies
_______________________________________________________________________
Configuration
PHP Core
Directive => Local Value => Master Value
allow_call_time_pass_reference => On => On
allow_url_fopen => On => On
allow_url_include => Off => Off
always_populate_raw_post_data => Off => Off
arg_separator.input => & => &
arg_separator.output => & => &
asp_tags => Off => Off
auto_append_file => no value => no value
auto_globals_jit => On => On
auto_prepend_file => no value => no value
browscap => no value => no value
default_charset => utf-8 => utf-8
default_mimetype => text/html => text/html
define_syslog_variables => Off => Off
disable_classes => no value => no value
disable_functions => no value => no value
display_errors => STDERR => STDERR
display_startup_errors => On => On
doc_root => no value => no value
docref_ext => no value => no value
docref_root => no value => no value
enable_dl => On => On
error_append_string => no value => no value
error_log => no value => no value
error_prepend_string => no value => no value
error_reporting => 30711 => 30711
exit_on_timeout => Off => Off
expose_php => Off => Off
extension_dir => /usr/local/php5/lib/php/extensions/no-debug-non-zts-20071006 =>
/usr/local/php5/lib/php/extensions/no-debug-non-zts-20071006
file_uploads => On => On
highlight.bg => <font style="color: #FFFFFF">#FFFFFF</font> => <font
style="color: #FFFFFF">#FFFFFF</font>
highlight.comment => <font style="color: #FF8000">#FF8000</font> =>
<font style="color: #FF8000">#FF8000</font>
highlight.default => <font style="color: #0000BB">#0000BB</font> =>
<font style="color: #0000BB">#0000BB</font>
highlight.html => <font style="color: #000000">#000000</font> =>
<font style="color: #000000">#000000</font>
highlight.keyword => <font style="color: #007700">#007700</font> =>
<font style="color: #007700">#007700</font>
highlight.string => <font style="color: #DD0000">#DD0000</font> =>
<font style="color: #DD0000">#DD0000</font>
html_errors => Off => Off
ignore_repeated_errors => Off => Off
ignore_repeated_source => Off => Off
ignore_user_abort => Off => Off
implicit_flush => On => On
include_path =>
/www/v3.szene1.at/htdocs/lib:.:/www/v3.szene1.at/htdocs/application/classes:/www/v3.szene1.at/htdocs/lib/Pear:/usr/local/php5/lib/php:/usr/share/php
=>
/www/v3.szene1.at/htdocs/lib:.:/www/v3.szene1.at/htdocs/application/classes:/www/v3.szene1.at/htdocs/lib/Pear:/usr/local/php5/lib/php:/usr/share/php
log_errors => Off => Off
log_errors_max_len => 1024 => 1024
magic_quotes_gpc => On => On
magic_quotes_runtime => Off => Off
magic_quotes_sybase => Off => Off
mail.force_extra_parameters => no value => no value
max_execution_time => 0 => 0
max_input_nesting_level => 64 => 64
max_input_time => -1 => -1
memory_limit => 128M => 128M
open_basedir => no value => no value
output_buffering => 0 => 0
output_handler => no value => no value
post_max_size => 30M => 30M
precision => 12 => 12
realpath_cache_size => 16K => 16K
realpath_cache_ttl => 120 => 120
register_argc_argv => On => On
register_globals => Off => Off
register_long_arrays => On => On
report_memleaks => On => On
report_zend_debug => Off => Off
request_order => no value => no value
safe_mode => Off => Off
safe_mode_exec_dir => /usr/local/php/bin => /usr/local/php/bin
safe_mode_gid => Off => Off
safe_mode_include_dir => no value => no value
sendmail_from => no value => no value
sendmail_path => /usr/sbin/sendmail -t -i => /usr/sbin/sendmail -t -i
serialize_precision => 100 => 100
short_open_tag => On => On
SMTP => localhost => localhost
smtp_port => 25 => 25
sql.safe_mode => Off => Off
track_errors => On => On
unserialize_callback_func => no value => no value
upload_max_filesize => 30M => 30M
upload_tmp_dir => no value => no value
user_dir => no value => no value
user_ini.cache_ttl => 300 => 300
user_ini.filename => .user.ini => .user.ini
variables_order => EGPCS => EGPCS
xmlrpc_error_number => 0 => 0
xmlrpc_errors => Off => Off
y2k_compliance => On => On
zend.enable_gc => On => On
apc
APC Support => disabled
Version => 3.0.19
MMAP Support => Enabled
MMAP File Mask =>
Locking type => pthread mutex Locks
Revision => $Revision: 3.154.2.5 $
Build Date => Sep 27 2008 12:24:14
Directive => Local Value => Master Value
apc.cache_by_default => On => On
apc.coredump_unmap => Off => Off
apc.enable_cli => Off => Off
apc.enabled => On => On
apc.file_update_protection => 2 => 2
apc.filters => no value => no value
apc.gc_ttl => 3600 => 3600
apc.include_once_override => Off => Off
apc.max_file_size => 2M => 2M
apc.mmap_file_mask => no value => no value
apc.num_files_hint => 100 => 100
apc.report_autofilter => On => On
apc.rfc1867 => On => On
apc.rfc1867_freq => 0 => 0
apc.rfc1867_name => APC_UPLOAD_PROGRESS => APC_UPLOAD_PROGRESS
apc.rfc1867_prefix => upload_ => upload_
apc.shm_segments => 1 => 1
apc.shm_size => 256 => 256
apc.slam_defense => 0 => 0
apc.stat => On => On
apc.stat_ctime => Off => Off
apc.ttl => 7200 => 7200
apc.user_entries_hint => 3200 => 3200
apc.user_ttl => 7200 => 7200
apc.write_lock => Off => Off
ctype
ctype functions => enabled
date
date/time support => enabled
"Olson" Timezone Database Version => 2008.9
Timezone Database => internal
Default timezone => Europe/Berlin
Directive => Local Value => Master Value
date.default_latitude => 31.7667 => 31.7667
date.default_longitude => 35.2333 => 35.2333
date.sunrise_zenith => 90.583333 => 90.583333
date.sunset_zenith => 90.583333 => 90.583333
date.timezone => no value => no value
dom
DOM/XML => enabled
DOM/XML API Version => 20031129
libxml Version => 2.6.26
HTML Support => enabled
XPath Support => enabled
XPointer Support => enabled
Schema Support => enabled
RelaxNG Support => enabled
ereg
Regex Library => Bundled library enabled
exif
EXIF Support => enabled
EXIF Version => 1.4 $Id: exif.c,v 1.173.2.5.2.20.2.11 2008/11/02 21:19:31 felipe Exp $
Supported EXIF Version => 0220
Supported filetypes => JPEG,TIFF
fileinfo
fileinfo support => enabled
version => 1.0.5-dev
filter
Input Validation and Filtering => enabled
Revision => $Revision: 1.52.2.39.2.10 $
Directive => Local Value => Master Value
filter.default => unsafe_raw => unsafe_raw
filter.default_flags => no value => no value
gd
GD Support => enabled
GD Version => bundled (2.0.34 compatible)
GIF Read Support => enabled
GIF Create Support => enabled
PNG Support => enabled
libPNG Version => 1.2.8
WBMP Support => enabled
XBM Support => enabled
hash
hash support => enabled
Hashing Engines => md2 md4 md5 sha1 sha224 sha256 sha384 sha512 ripemd128 ripemd160 ripemd256
ripemd320 whirlpool tiger128,3 tiger160,3 tiger192,3 tiger128,4 tiger160,4 tiger192,4 snefru
snefru256 gost adler32 crc32 crc32b haval128,3 haval160,3 haval192,3 haval224,3 haval256,3
haval128,4 haval160,4 haval192,4 haval224,4 haval256,4 haval128,5 haval160,5 haval192,5 haval224,5
haval256,5
iconv
iconv support => enabled
iconv implementation => glibc
iconv library version => 2.4
Directive => Local Value => Master Value
iconv.input_encoding => ISO-8859-1 => ISO-8859-1
iconv.internal_encoding => ISO-8859-1 => ISO-8859-1
iconv.output_encoding => ISO-8859-1 => ISO-8859-1
json
json support => enabled
json version => 1.2.1
libxml
libXML support => active
libXML Version => 2.6.26
libXML streams => enabled
mbstring
Multibyte Support => enabled
Multibyte string engine => libmbfl
HTTP input encoding translation => disabled
mbstring extension makes use of "streamable kanji code filter and converter", which is
distributed under the GNU Lesser General Public License version 2.1.
Multibyte (japanese) regex support => enabled
Multibyte regex (oniguruma) backtrack check => On
Multibyte regex (oniguruma) version => 4.7.1
Directive => Local Value => Master Value
mbstring.detect_order => no value => no value
mbstring.encoding_translation => Off => Off
mbstring.func_overload => 0 => 0
mbstring.http_input => pass => pass
mbstring.http_output => pass => pass
mbstring.http_output_conv_mimetypes => ^(text/|application/xhtml\+xml) =>
^(text/|application/xhtml\+xml)
mbstring.internal_encoding => no value => no value
mbstring.language => neutral => neutral
mbstring.strict_detection => Off => Off
mbstring.substitute_character => no value => no value
mcrypt
mcrypt support => enabled
Version => 2.5.7
Api No => 20021217
Supported ciphers => cast-128 gost rijndael-128 twofish arcfour cast-256 loki97 rijndael-192
saferplus wake blowfish-compat des rijndael-256 serpent xtea blowfish enigma rc2 tripledes
Supported modes => cbc cfb ctr ecb ncfb nofb ofb stream
Directive => Local Value => Master Value
mcrypt.algorithms_dir => no value => no value
mcrypt.modes_dir => no value => no value
memcache
memcache support => enabled
Active persistent connections => 0
Version => 2.2.4
Revision => $Revision: 1.104 $
Directive => Local Value => Master Value
memcache.allow_failover => 1 => 1
memcache.chunk_size => 8192 => 8192
memcache.default_port => 1121 => 1121
memcache.hash_function => crc32 => crc32
memcache.hash_strategy => standard => standard
memcache.max_failover_attempts => 2 => 2
mysqli
MysqlI Support => enabled
Client API library version => mysqlnd 5.0.5-dev - 081106 - $Revision: 1.3.2.18 $
Active Persistent Links => 0
Inactive Persistent Links => 0
Active Links => 0
Persistent cache => enabled
put_hits => 0
put_misses => 0
get_hits => 0
get_misses => 0
size => 2000
free_items => 2000
references => 2
Directive => Local Value => Master Value
mysqli.allow_local_infile => On => On
mysqli.allow_persistent => On => On
mysqli.cache_size => 2000 => 2000
mysqli.default_host => no value => no value
mysqli.default_port => 3306 => 3306
mysqli.default_pw => no value => no value
mysqli.default_socket => no value => no value
mysqli.default_user => no value => no value
mysqli.max_links => Unlimited => Unlimited
mysqli.max_persistent => Unlimited => Unlimited
mysqli.reconnect => Off => Off
mysqlnd
mysqlnd => enabled
Version => mysqlnd 5.0.5-dev - 081106 - $Revision: 1.3.2.18 $
Command buffer size => 2048
Read buffer size => 32768
Collecting statistics => Yes
Collecting memory statistics => No
Client statistics =>
bytes_sent => 0
bytes_received => 0
packets_sent => 0
packets_received => 0
protocol_overhead_in => 0
protocol_overhead_out => 0
bytes_received_ok_packet => 0
bytes_received_eof_packet => 0
bytes_received_rset_header_packet => 0
bytes_received_rset_field_meta_packet => 0
bytes_received_rset_row_packet => 0
bytes_received_prepare_response_packet => 0
bytes_received_change_user_packet => 0
packets_sent_command => 0
packets_received_ok => 0
packets_received_eof => 0
packets_received_rset_header => 0
packets_received_rset_field_meta => 0
packets_received_rset_row => 0
packets_received_prepare_response => 0
packets_received_change_user => 0
result_set_queries => 0
non_result_set_queries => 0
no_index_used => 0
bad_index_used => 0
slow_queries => 0
buffered_sets => 0
unbuffered_sets => 0
ps_buffered_sets => 0
ps_unbuffered_sets => 0
flushed_normal_sets => 0
flushed_ps_sets => 0
ps_prepared_never_executed => 0
ps_prepared_once_executed => 0
rows_fetched_from_server_normal => 0
rows_fetched_from_server_ps => 0
rows_buffered_from_client_normal => 0
rows_buffered_from_client_ps => 0
rows_fetched_from_client_normal_buffered => 0
rows_fetched_from_client_normal_unbuffered => 0
rows_fetched_from_client_ps_buffered => 0
rows_fetched_from_client_ps_unbuffered => 0
rows_fetched_from_client_ps_cursor => 0
rows_skipped_normal => 0
rows_skipped_ps => 0
copy_on_write_saved => 0
copy_on_write_performed => 0
command_buffer_too_small => 0
connect_success => 0
connect_failure => 0
connection_reused => 0
reconnect => 0
pconnect_success => 0
active_connections => 0
active_persistent_connections => 0
explicit_close => 0
implicit_close => 0
disconnect_close => 0
in_middle_of_command_close => 0
explicit_free_result => 0
implicit_free_result => 0
explicit_stmt_close => 0
implicit_stmt_close => 0
mem_emalloc_count => 0
mem_emalloc_ammount => 0
mem_ecalloc_count => 0
mem_ecalloc_ammount => 0
mem_erealloc_count => 0
mem_erealloc_ammount => 0
mem_efree_count => 0
mem_malloc_count => 0
mem_malloc_ammount => 0
mem_calloc_count => 0
mem_calloc_ammount => 0
mem_realloc_count => 0
mem_realloc_ammount => 0
mem_free_count => 0
proto_text_fetched_null => 0
proto_text_fetched_bit => 0
proto_text_fetched_tinyint => 0
proto_text_fetched_short => 0
proto_text_fetched_int24 => 0
proto_text_fetched_int => 0
proto_text_fetched_bigint => 0
proto_text_fetched_decimal => 0
proto_text_fetched_float => 0
proto_text_fetched_double => 0
proto_text_fetched_date => 0
proto_text_fetched_year => 0
proto_text_fetched_time => 0
proto_text_fetched_datetime => 0
proto_text_fetched_timestamp => 0
proto_text_fetched_string => 0
proto_text_fetched_blob => 0
proto_text_fetched_enum => 0
proto_text_fetched_set => 0
proto_text_fetched_geometry => 0
proto_text_fetched_other => 0
proto_binary_fetched_null => 0
proto_binary_fetched_bit => 0
proto_binary_fetched_tinyint => 0
proto_binary_fetched_short => 0
proto_binary_fetched_int24 => 0
proto_binary_fetched_int => 0
proto_binary_fetched_bigint => 0
proto_binary_fetched_decimal => 0
proto_binary_fetched_float => 0
proto_binary_fetched_double => 0
proto_binary_fetched_date => 0
proto_binary_fetched_year => 0
proto_binary_fetched_time => 0
proto_binary_fetched_datetime => 0
proto_binary_fetched_timestamp => 0
proto_binary_fetched_string => 0
proto_binary_fetched_blob => 0
proto_binary_fetched_enum => 0
proto_binary_fetched_set => 0
proto_binary_fetched_geometry => 0
proto_binary_fetched_other => 0
pcre
PCRE (Perl Compatible Regular Expressions) Support => enabled
PCRE Library Version => 7.8 2008-09-05
Directive => Local Value => Master Value
pcre.backtrack_limit => 100000 => 100000
pcre.recursion_limit => 100000 => 100000
PDO
PDO support => enabled
PDO drivers => sqlite
pdo_sqlite
PDO Driver for SQLite 3.x => enabled
SQLite Library => 3.6.2
Phar
Phar: PHP Archive support => enabled
Phar EXT version => 2.0.0-dev
Phar API version => 1.1.1
CVS revision => $Revision: 1.370.2.54 $
Phar-based phar archives => enabled
Tar-based phar archives => enabled
ZIP-based phar archives => enabled
gzip compression => enabled
bzip2 compression => disabled (install pecl/bz2)
OpenSSL support => disabled (install ext/openssl)
Phar based on pear/PHP_Archive, original concept by Davey Shafik.
Phar fully realized by Gregory Beaver and Marcus Boerger.
Portions of tar implementation Copyright (c) 2003-2008 Tim Kientzle.
Directive => Local Value => Master Value
phar.cache_list => no value => no value
phar.readonly => On => On
phar.require_hash => On => On
posix
Revision => $Revision: 1.70.2.3.2.16.2.12 $
Reflection
Reflection => enabled
Version => $Id: php_reflection.c,v 1.164.2.33.2.45.2.39 2008/11/04 15:58:55 helly Exp $
session
Session Support => enabled
Registered save handlers => files user memcache
Registered serializer handlers => php php_binary
Directive => Local Value => Master Value
session.auto_start => Off => Off
session.bug_compat_42 => On => On
session.bug_compat_warn => On => On
session.cache_expire => 180 => 180
session.cache_limiter => nocache => nocache
session.cookie_domain => no value => no value
session.cookie_httponly => Off => Off
session.cookie_lifetime => 0 => 0
session.cookie_path => / => /
session.cookie_secure => Off => Off
session.entropy_file => no value => no value
session.entropy_length => 0 => 0
session.gc_divisor => 100 => 100
session.gc_maxlifetime => 1440 => 1440
session.gc_probability => 1 => 1
session.hash_bits_per_character => 4 => 4
session.hash_function => 0 => 0
session.name => PHPSESSID => PHPSESSID
session.referer_check => no value => no value
session.save_handler => files => files
session.save_path => /tmp/sess/ => /tmp/sess/
session.serialize_handler => php => php
session.use_cookies => On => On
session.use_only_cookies => On => On
session.use_trans_sid => 0 => 0
SimpleXML
Simplexml support => enabled
Revision => $Revision: 1.151.2.22.2.35.2.26 $
Schema support => enabled
soap
Soap Client => enabled
Soap Server => enabled
Directive => Local Value => Master Value
soap.wsdl_cache => 1 => 1
soap.wsdl_cache_dir => /tmp => /tmp
soap.wsdl_cache_enabled => 1 => 1
soap.wsdl_cache_limit => 5 => 5
soap.wsdl_cache_ttl => 86400 => 86400
sockets
Sockets Support => enabled
SPL
SPL support => enabled
Interfaces => Countable, OuterIterator, RecursiveIterator, SeekableIterator, SplObserver,
SplSubject
Classes => AppendIterator, ArrayIterator, ArrayObject, BadFunctionCallException,
BadMethodCallException, CachingIterator, DirectoryIterator, DomainException, EmptyIterator,
FilesystemIterator, FilterIterator, GlobIterator, InfiniteIterator, InvalidArgumentException,
IteratorIterator, LengthException, LimitIterator, LogicException, MultipleIterator,
NoRewindIterator, OutOfBoundsException, OutOfRangeException, OverflowException, ParentIterator,
RangeException, RecursiveArrayIterator, RecursiveCachingIterator, RecursiveDirectoryIterator,
RecursiveFilterIterator, RecursiveIteratorIterator, RecursiveRegexIterator, RecursiveTreeIterator,
RegexIterator, RuntimeException, SplDoublyLinkedList, SplFileInfo, SplFileObject, SplFixedArray,
SplHeap, SplMinHeap, SplMaxHeap, SplObjectStorage, SplPriorityQueue, SplQueue, SplStack,
SplTempFileObject, UnderflowException, UnexpectedValueException
sqlite3
SQLite3 support => enabled
SQLite3 module version => 0.7-dev
SQLite Library => 3.6.2
Directive => Local Value => Master Value
sqlite3.extension_dir => no value => no value
standard
Dynamic Library Support => enabled
Path to sendmail => /usr/sbin/sendmail -t -i
Directive => Local Value => Master Value
assert.active => 1 => 1
assert.bail => 0 => 0
assert.callback => no value => no value
assert.quiet_eval => 0 => 0
assert.warning => 1 => 1
auto_detect_line_endings => 0 => 0
default_socket_timeout => 5 => 5
safe_mode_allowed_env_vars => PHP_ => PHP_
safe_mode_protected_env_vars => LD_LIBRARY_PATH => LD_LIBRARY_PATH
url_rewriter.tags => a=href,area=href,frame=src,input=src,form=,fieldset= =>
a=href,area=href,frame=src,input=src,form=,fieldset=
user_agent => no value => no value
tokenizer
Tokenizer Support => enabled
xml
XML Support => active
XML Namespace Support => active
libxml2 Version => 2.6.26
xmlreader
XMLReader => enabled
xmlwriter
XMLWriter => enabled
zlib
ZLib Support => enabled
Stream Wrapper support => compress.zlib://
Stream Filter support => zlib.inflate, zlib.deflate
Compiled Version => 1.2.3
Linked Version => 1.2.3
Directive => Local Value => Master Value
zlib.output_compression => On => On
zlib.output_compression_level => 5 => 5
zlib.output_handler => no value => no value
Additional Modules
Module Name
Environment
Variable => Value
LESSOPEN => | /usr/bin/lesspipe %s
USER => root
SSH_CLIENT => deleted
MAIL => /var/mail/root
SHLVL => 1
HOME => /root
OLDPWD => /root
TEST_PHP_SRCDIR => /root/php5.3-200811091330
SSH_TTY => deleted
MAKEFLAGS =>
LOGNAME => root
_ => /usr/bin/make
TEST_PHP_EXECUTABLE => /root/php5.3-200811091330/sapi/cli/php
TERM => xterm
PATH => /usr/local/sbin:/usr/local/bin:/usr/sbin:/usr/bin:/sbin:/bin:/usr/bin/X11:/usr/games
MAKELEVEL => 1
LANG => de_AT.UTF-8
LS_COLORS =>
no=00:fi=00:di=01;34:ln=01;36:pi=40;33:so=01;35:do=01;35:bd=40;33;01:cd=40;33;01:or=40;31;01:su=37;41:sg=30;43:tw=30;42:ow=34;42:st=37;44:ex=01;32:*.tar=01;31:*.tgz=01;31:*.arj=01;31:*.taz=01;31:*.lzh=01;31:*.zip=01;31:*.z=01;31:*.Z=01;31:*.gz=01;31:*.bz2=01;31:*.deb=01;31:*.rpm=01;31:*.jar=01;31:*.jpg=01;35:*.jpeg=01;35:*.gif=01;35:*.bmp=01;35:*.pbm=01;35:*.pgm=01;35:*.ppm=01;35:*.tga=01;35:*.xbm=01;35:*.xpm=01;35:*.tif=01;35:*.tiff=01;35:*.png=01;35:*.mov=01;35:*.mpg=01;35:*.mpeg=01;35:*.avi=01;35:*.fli=01;35:*.gl=01;35:*.dl=01;35:*.xcf=01;35:*.xwd=01;35:*.flac=01;35:*.mp3=01;35:*.mpc=01;35:*.ogg=01;35:*.wav=01;35:
SSH_AUTH_SOCK => deleted
SHELL => /bin/bash
LESSCLOSE => /usr/bin/lesspipe %s %s
PWD => /root/php5.3-200811091330
SSH_CONNECTION => deleted
MFLAGS =>
CC => gcc
PHP Variables
Variable => Value
_SERVER["LESSOPEN"] => | /usr/bin/lesspipe %s
_SERVER["USER"] => root
_SERVER["SSH_CLIENT"] => deleted
_SERVER["MAIL"] => /var/mail/root
_SERVER["SHLVL"] => 1
_SERVER["HOME"] => /root
_SERVER["OLDPWD"] => /root
_SERVER["TEST_PHP_SRCDIR"] => /root/php5.3-200811091330
_SERVER["SSH_TTY"] => deleted
_SERVER["MAKEFLAGS"] =>
_SERVER["LOGNAME"] => root
_SERVER["_"] => /usr/bin/make
_SERVER["TEST_PHP_EXECUTABLE"] => /root/php5.3-200811091330/sapi/cli/php
_SERVER["TERM"] => xterm
_SERVER["PATH"] =>
/usr/local/sbin:/usr/local/bin:/usr/sbin:/usr/bin:/sbin:/bin:/usr/bin/X11:/usr/games
_SERVER["MAKELEVEL"] => 1
_SERVER["LANG"] => de_AT.UTF-8
_SERVER["LS_COLORS"] =>
no=00:fi=00:di=01;34:ln=01;36:pi=40;33:so=01;35:do=01;35:bd=40;33;01:cd=40;33;01:or=40;31;01:su=37;41:sg=30;43:tw=30;42:ow=34;42:st=37;44:ex=01;32:*.tar=01;31:*.tgz=01;31:*.arj=01;31:*.taz=01;31:*.lzh=01;31:*.zip=01;31:*.z=01;31:*.Z=01;31:*.gz=01;31:*.bz2=01;31:*.deb=01;31:*.rpm=01;31:*.jar=01;31:*.jpg=01;35:*.jpeg=01;35:*.gif=01;35:*.bmp=01;35:*.pbm=01;35:*.pgm=01;35:*.ppm=01;35:*.tga=01;35:*.xbm=01;35:*.xpm=01;35:*.tif=01;35:*.tiff=01;35:*.png=01;35:*.mov=01;35:*.mpg=01;35:*.mpeg=01;35:*.avi=01;35:*.fli=01;35:*.gl=01;35:*.dl=01;35:*.xcf=01;35:*.xwd=01;35:*.flac=01;35:*.mp3=01;35:*.mpc=01;35:*.ogg=01;35:*.wav=01;35:
_SERVER["SSH_AUTH_SOCK"] => deleted
_SERVER["SHELL"] => /bin/bash
_SERVER["LESSCLOSE"] => /usr/bin/lesspipe %s %s
_SERVER["PWD"] => /root/php5.3-200811091330
_SERVER["SSH_CONNECTION"] => deleted
_SERVER["MFLAGS"] =>
_SERVER["CC"] => gcc
_SERVER["PHP_SELF"] =>
_SERVER["SCRIPT_NAME"] =>
_SERVER["SCRIPT_FILENAME"] =>
_SERVER["PATH_TRANSLATED"] =>
_SERVER["DOCUMENT_ROOT"] =>
_SERVER["REQUEST_TIME"] => 1226247487
_SERVER["argv"] => Array
(
)
_SERVER["argc"] => 0
_ENV["LESSOPEN"] => | /usr/bin/lesspipe %s
_ENV["USER"] => root
_ENV["SSH_CLIENT"] => deleted
_ENV["MAIL"] => /var/mail/root
_ENV["SHLVL"] => 1
_ENV["HOME"] => /root
_ENV["OLDPWD"] => /root
_ENV["TEST_PHP_SRCDIR"] => /root/php5.3-200811091330
_ENV["SSH_TTY"] => deleted
_ENV["MAKEFLAGS"] =>
_ENV["LOGNAME"] => root
_ENV["_"] => /usr/bin/make
_ENV["TEST_PHP_EXECUTABLE"] => /root/php5.3-200811091330/sapi/cli/php
_ENV["TERM"] => xterm
_ENV["PATH"] =>
/usr/local/sbin:/usr/local/bin:/usr/sbin:/usr/bin:/sbin:/bin:/usr/bin/X11:/usr/games
_ENV["MAKELEVEL"] => 1
_ENV["LANG"] => de_AT.UTF-8
_ENV["LS_COLORS"] =>
no=00:fi=00:di=01;34:ln=01;36:pi=40;33:so=01;35:do=01;35:bd=40;33;01:cd=40;33;01:or=40;31;01:su=37;41:sg=30;43:tw=30;42:ow=34;42:st=37;44:ex=01;32:*.tar=01;31:*.tgz=01;31:*.arj=01;31:*.taz=01;31:*.lzh=01;31:*.zip=01;31:*.z=01;31:*.Z=01;31:*.gz=01;31:*.bz2=01;31:*.deb=01;31:*.rpm=01;31:*.jar=01;31:*.jpg=01;35:*.jpeg=01;35:*.gif=01;35:*.bmp=01;35:*.pbm=01;35:*.pgm=01;35:*.ppm=01;35:*.tga=01;35:*.xbm=01;35:*.xpm=01;35:*.tif=01;35:*.tiff=01;35:*.png=01;35:*.mov=01;35:*.mpg=01;35:*.mpeg=01;35:*.avi=01;35:*.fli=01;35:*.gl=01;35:*.dl=01;35:*.xcf=01;35:*.xwd=01;35:*.flac=01;35:*.mp3=01;35:*.mpc=01;35:*.ogg=01;35:*.wav=01;35:
_ENV["SSH_AUTH_SOCK"] => deleted
_ENV["SHELL"] => /bin/bash
_ENV["LESSCLOSE"] => /usr/bin/lesspipe %s %s
_ENV["PWD"] => /root/php5.3-200811091330
_ENV["SSH_CONNECTION"] => deleted
_ENV["MFLAGS"] =>
_ENV["CC"] => gcc
PHP License
This program is free software; you can redistribute it and/or modify
it under the terms of the PHP License as published by the PHP Group
and included in the distribution in the file: LICENSE
This program is distributed in the hope that it will be useful,
but WITHOUT ANY WARRANTY; without even the implied warranty of
MERCHANTABILITY or FITNESS FOR A PARTICULAR PURPOSE.
If you did not receive a copy of the PHP license, or have any
questions about PHP licensing, please contact license@php.net.