Bug #17834 Updated: Compile for Apache 2.0.39 Fails a/k/a bug search engine suspicious :)

From: Date: Wed, 19 Jun 2002 12:36:58 +0000
Subject: Bug #17834 Updated: Compile for Apache 2.0.39 Fails a/k/a bug search engine suspicious :)
References: 1  Groups: php.bugs 
Request: Send a blank email to php-bugs+get-11377@lists.php.net to get a copy of this message
ID: 17834 Updated by: matt8192@yahoo.com -Summary: Compile for Apache 2.0.39 Fails Reported By: matt8192@yahoo.com Status: Closed Bug Type: Compile Failure Operating System: Linux 2.4.18 (RH 7.3, i386) PHP Version: 4.2.1 New Comment: Thanks for the quick response. The reason I posted this bug is because an advanced bugsearch with keywords "2.0.39", php version "4.1.0" and "Bugs submitted yesteday" showed no results. Thought you should know! Thanks again, -Matt Previous Comments: ------------------------------------------------------------------------ [2002-06-19 08:30:25] sniper@php.net This bug has been fixed in CVS. You can grab a snapshot of the CVS version at http://snaps.php.net/. In case this was a documentation problem, the fix will show up soon at http://www.php.net/manual/. In case this was a PHP.net website problem, the change will show up on the PHP.net site and on the mirror sites. Thank you for the report, and for helping us make PHP better. ------------------------------------------------------------------------ [2002-06-19 08:29:19] matt8192@yahoo.com Bug summary semantic update ("Compile *for* apache fails" not "apache compile fails") ------------------------------------------------------------------------ [2002-06-19 08:21:11] matt8192@yahoo.com When compiling for Apache httpd 2.0.39, php "make" gives this error: ./configure --with-apxs2=/www/bin/apxs --with-mysql [...] make [...] /bin/sh /home/matt/php-4.2.1/libtool --silent --mode=compile gcc -I. -I/home/matt/php-4.2.1/sapi/apache2filter -I/home/matt/php-4.2.1/main -I/home/matt/php-4.2.1 -I/www/include -I/home/matt/php-4.2.1/Zend -I/home/matt/php-4.2.1/ext/mysql/libmysql -I/home/matt/php-4.2.1/ext/xml/expat -D_REENTRANT -I/home/matt/php-4.2.1/TSRM -DTHREAD=1 -g -O2 -pthread -DZTS -prefer-pic -c php_functions.c php_functions.c:93:27: missing binary operator before '!' make[3]: *** [php_functions.lo] Error 1 make[3]: Leaving directory `/home/matt/php-4.2.1/sapi/apache2filter' make[2]: *** [all-recursive] Error 1 make[2]: Leaving directory `/home/matt/php-4.2.1/sapi/apache2filter' make[1]: *** [all-recursive] Error 1 make[1]: Leaving directory `/home/matt/php-4.2.1/sapi' make: *** [all-recursive] Error 1 ------------------------------------------------------------------------ -- Edit this bug report at http://bugs.php.net/?id=17834&edit=1

« previous php.bugs (#11377) next »