Bug #17834: Apache 2.0.39 Compile Fails

From: Date: Wed, 19 Jun 2002 12:21:12 +0000
Subject: Bug #17834: Apache 2.0.39 Compile Fails
Groups: php.bugs 
Request: Send a blank email to php-bugs+get-11371@lists.php.net to get a copy of this message
From: matt8192@yahoo.com Operating system: Linux 2.4.18 (RH 7.3, i386) PHP version: 4.2.1 PHP Bug Type: Compile Failure Bug description: Apache 2.0.39 Compile Fails When compiling for Apache httpd 2.0.39, php "make" gives this error: ./configure --with-apxs2=/www/bin/apxs --with-mysql [...] make [...] /bin/sh /home/matt/php-4.2.1/libtool --silent --mode=compile gcc -I. -I/home/matt/php-4.2.1/sapi/apache2filter -I/home/matt/php-4.2.1/main -I/home/matt/php-4.2.1 -I/www/include -I/home/matt/php-4.2.1/Zend -I/home/matt/php-4.2.1/ext/mysql/libmysql -I/home/matt/php-4.2.1/ext/xml/expat -D_REENTRANT -I/home/matt/php-4.2.1/TSRM -DTHREAD=1 -g -O2 -pthread -DZTS -prefer-pic -c php_functions.c php_functions.c:93:27: missing binary operator before '!' make[3]: *** [php_functions.lo] Error 1 make[3]: Leaving directory `/home/matt/php-4.2.1/sapi/apache2filter' make[2]: *** [all-recursive] Error 1 make[2]: Leaving directory `/home/matt/php-4.2.1/sapi/apache2filter' make[1]: *** [all-recursive] Error 1 make[1]: Leaving directory `/home/matt/php-4.2.1/sapi' make: *** [all-recursive] Error 1 -- Edit bug report at http://bugs.php.net/?id=17834&edit=1 -- Fixed in CVS: http://bugs.php.net/fix.php?id=17834&r=fixedcvs Fixed in release: http://bugs.php.net/fix.php?id=17834&r=alreadyfixed Need backtrace: http://bugs.php.net/fix.php?id=17834&r=needtrace Try newer version: http://bugs.php.net/fix.php?id=17834&r=oldversion Not developer issue: http://bugs.php.net/fix.php?id=17834&r=support Expected behavior: http://bugs.php.net/fix.php?id=17834&r=notwrong Not enough info: http://bugs.php.net/fix.php?id=17834&r=notenoughinfo Submitted twice: http://bugs.php.net/fix.php?id=17834&r=submittedtwice register_globals: http://bugs.php.net/fix.php?id=17834&r=globals

« previous php.bugs (#11371) next »