Bug #17840: building php-4.2.1 for apache-2.0.39 fails

From: Date: Wed, 19 Jun 2002 14:39:43 +0000
Subject: Bug #17840: building php-4.2.1 for apache-2.0.39 fails
Groups: php.bugs 
Request: Send a blank email to php-bugs+get-11399@lists.php.net to get a copy of this message
From: michaud.bernard@ic.gc.ca Operating system: Solaris 8 x86 PHP version: 4.2.1 PHP Bug Type: Compile Failure Bug description: building php-4.2.1 for apache-2.0.39 fails System is Dell PowerEdge 6400 OS is Solaris 8 x86 2/02 Compiler is gcc-3.0.4 ... Making all in sapi make[1]: Entering directory `/playground/build/php-4.2.1/sapi' Making all in apache2filter make[2]: Entering directory `/playground/build/php-4.2.1/sapi/apache2filter' make[3]: Entering directory `/playground/build/php-4.2.1/sapi/apache2filter' /bin/sh /playground/build/php-4.2.1/libtool --silent --mode=compile gcc -I. -I/playground/build/php-4.2.1/sapi/apache2filter -I/playground/build/php-4.2.1/main -I/playground/build/php-4.2.1 -I/opt/apache-2.0/include -I/playground/build/php-4.2.1/Zend -I/usr/local/ssl/include -D_POSIX_PTHREAD_SEMANTICS -D_POSIX_PTHREAD_SEMANTICS -D_REENTRANT -I/playground/build/php-4.2.1/TSRM -O9 -march=i586 -mcpu=i686 -L/usr/local/lib -R/usr/local/lib -pthreads -DZTS -prefer-pic -c sapi_apache2.c /bin/sh /playground/build/php-4.2.1/libtool --silent --mode=compile gcc -I. -I/playground/build/php-4.2.1/sapi/apache2filter -I/playground/build/php-4.2.1/main -I/playground/build/php-4.2.1 -I/opt/apache-2.0/include -I/playground/build/php-4.2.1/Zend -I/usr/local/ssl/include -D_POSIX_PTHREAD_SEMANTICS -D_POSIX_PTHREAD_SEMANTICS -D_REENTRANT -I/playground/build/php-4.2.1/TSRM -O9 -march=i586 -mcpu=i686 -L/usr/local/lib -R/usr/local/lib -pthreads -DZTS -prefer-pic -c apache_config.c /bin/sh /playground/build/php-4.2.1/libtool --silent --mode=compile gcc -I. -I/playground/build/php-4.2.1/sapi/apache2filter -I/playground/build/php-4.2.1/main -I/playground/build/php-4.2.1 -I/opt/apache-2.0/include -I/playground/build/php-4.2.1/Zend -I/usr/local/ssl/include -D_POSIX_PTHREAD_SEMANTICS -D_POSIX_PTHREAD_SEMANTICS -D_REENTRANT -I/playground/build/php-4.2.1/TSRM -O9 -march=i586 -mcpu=i686 -L/usr/local/lib -R/usr/local/lib -pthreads -DZTS -prefer-pic -c php_functions.c php_functions.c:93:27: missing binary operator before '!' make[3]: *** [php_functions.lo] Error 1 make[3]: Leaving directory `/playground/build/php-4.2.1/sapi/apache2filter' make[2]: *** [all-recursive] Error 1 make[2]: Leaving directory `/playground/build/php-4.2.1/sapi/apache2filter' make[1]: *** [all-recursive] Error 1 make[1]: Leaving directory `/playground/build/php-4.2.1/sapi' make: *** [all-recursive] Error 1 -- Edit bug report at http://bugs.php.net/?id=17840&edit=1 -- Fixed in CVS: http://bugs.php.net/fix.php?id=17840&r=fixedcvs Fixed in release: http://bugs.php.net/fix.php?id=17840&r=alreadyfixed Need backtrace: http://bugs.php.net/fix.php?id=17840&r=needtrace Try newer version: http://bugs.php.net/fix.php?id=17840&r=oldversion Not developer issue: http://bugs.php.net/fix.php?id=17840&r=support Expected behavior: http://bugs.php.net/fix.php?id=17840&r=notwrong Not enough info: http://bugs.php.net/fix.php?id=17840&r=notenoughinfo Submitted twice: http://bugs.php.net/fix.php?id=17840&r=submittedtwice register_globals: http://bugs.php.net/fix.php?id=17840&r=globals

« previous php.bugs (#11399) next »