Bug #17840 Updated: building php-4.2.1 for apache-2.0.39 fails

From: Date: Wed, 19 Jun 2002 14:41:06 +0000
Subject: Bug #17840 Updated: building php-4.2.1 for apache-2.0.39 fails
References: 1  Groups: php.bugs 
Request: Send a blank email to php-bugs+get-11401@lists.php.net to get a copy of this message
ID: 17840 Updated by: derick@php.net Reported By: michaud.bernard@ic.gc.ca -Status: Open +Status: Closed Bug Type: Compile Failure Operating System: Solaris 8 x86 PHP Version: 4.2.1 New Comment: This bug has been fixed in CVS. You can grab a snapshot of the CVS version at http://snaps.php.net/. In case this was a documentation problem, the fix will show up soon at http://www.php.net/manual/. In case this was a PHP.net website problem, the change will show up on the PHP.net site and on the mirror sites. Thank you for the report, and for helping us make PHP better. Please use the SEARCH function in our bugsystem first... this is the 10th report today! Previous Comments: ------------------------------------------------------------------------ [2002-06-19 10:39:42] michaud.bernard@ic.gc.ca System is Dell PowerEdge 6400 OS is Solaris 8 x86 2/02 Compiler is gcc-3.0.4 ... Making all in sapi make[1]: Entering directory `/playground/build/php-4.2.1/sapi' Making all in apache2filter make[2]: Entering directory `/playground/build/php-4.2.1/sapi/apache2filter' make[3]: Entering directory `/playground/build/php-4.2.1/sapi/apache2filter' /bin/sh /playground/build/php-4.2.1/libtool --silent --mode=compile gcc -I. -I/playground/build/php-4.2.1/sapi/apache2filter -I/playground/build/php-4.2.1/main -I/playground/build/php-4.2.1 -I/opt/apache-2.0/include -I/playground/build/php-4.2.1/Zend -I/usr/local/ssl/include -D_POSIX_PTHREAD_SEMANTICS -D_POSIX_PTHREAD_SEMANTICS -D_REENTRANT -I/playground/build/php-4.2.1/TSRM -O9 -march=i586 -mcpu=i686 -L/usr/local/lib -R/usr/local/lib -pthreads -DZTS -prefer-pic -c sapi_apache2.c /bin/sh /playground/build/php-4.2.1/libtool --silent --mode=compile gcc -I. -I/playground/build/php-4.2.1/sapi/apache2filter -I/playground/build/php-4.2.1/main -I/playground/build/php-4.2.1 -I/opt/apache-2.0/include -I/playground/build/php-4.2.1/Zend -I/usr/local/ssl/include -D_POSIX_PTHREAD_SEMANTICS -D_POSIX_PTHREAD_SEMANTICS -D_REENTRANT -I/playground/build/php-4.2.1/TSRM -O9 -march=i586 -mcpu=i686 -L/usr/local/lib -R/usr/local/lib -pthreads -DZTS -prefer-pic -c apache_config.c /bin/sh /playground/build/php-4.2.1/libtool --silent --mode=compile gcc -I. -I/playground/build/php-4.2.1/sapi/apache2filter -I/playground/build/php-4.2.1/main -I/playground/build/php-4.2.1 -I/opt/apache-2.0/include -I/playground/build/php-4.2.1/Zend -I/usr/local/ssl/include -D_POSIX_PTHREAD_SEMANTICS -D_POSIX_PTHREAD_SEMANTICS -D_REENTRANT -I/playground/build/php-4.2.1/TSRM -O9 -march=i586 -mcpu=i686 -L/usr/local/lib -R/usr/local/lib -pthreads -DZTS -prefer-pic -c php_functions.c php_functions.c:93:27: missing binary operator before '!' make[3]: *** [php_functions.lo] Error 1 make[3]: Leaving directory `/playground/build/php-4.2.1/sapi/apache2filter' make[2]: *** [all-recursive] Error 1 make[2]: Leaving directory `/playground/build/php-4.2.1/sapi/apache2filter' make[1]: *** [all-recursive] Error 1 make[1]: Leaving directory `/playground/build/php-4.2.1/sapi' make: *** [all-recursive] Error 1 ------------------------------------------------------------------------ -- Edit this bug report at http://bugs.php.net/?id=17840&edit=1

« previous php.bugs (#11401) next »