Bug #17935: apache v2 compile problem since CVS 2002/06/19

From: Date: Sun, 23 Jun 2002 22:24:20 +0000
Subject: Bug #17935: apache v2 compile problem since CVS 2002/06/19
Groups: php.bugs 
Request: Send a blank email to php-bugs+get-11851@lists.php.net to get a copy of this message
From: mw@suk.net Operating system: RedHat Linux 7.3 PHP version: 4.0CVS-2002-06-23 PHP Bug Type: Compile Failure Bug description: apache v2 compile problem since CVS 2002/06/19 Latest working CVS version of PHP 4.3 with Apache v2.0.36 was on 18th June (CVS: 200206181800). Later on, starting from 19th the problem exists: Making install in apache2filter make[2]: Entering directory `/usr/src/server2/php4-STABLE-200206231500/sapi/apache2filter' make[3]: Entering directory `/usr/src/server2/php4-STABLE-200206231500/sapi/apache2filter' /bin/sh /usr/src/server2/php4-STABLE-200206231500/libtool --silent --mode=compile gcc -I. -I/usr/src/server2/php4-STABLE-200206231500/sapi/apache2filter -I/usr/src/server2/php4-STABLE-200206231500/main -I/usr/src/server2/php4-STABLE-200206231500 -I/usr/server-test/include -I/usr/src/server2/php4-STABLE-200206231500/Zend -I/usr/local/include -I/usr/include/mysql -I/usr/src/server2/php4-STABLE-200206231500/ext/xml/expat -D_REENTRANT -I/usr/src/server2/php4-STABLE-200206231500/TSRM -g -O2 -pthread -DZTS -prefer-pic -c php_functions.c php_functions.c:93:27: missing binary operator before '!' make[3]: *** [php_functions.lo] Error 1 make[3]: Leaving directory `/usr/src/server2/php4-STABLE-200206231500/sapi/apache2filter' make[2]: *** [install-recursive] Error 1 make[2]: Leaving directory `/usr/src/server2/php4-STABLE-200206231500/sapi/apache2filter' make[1]: *** [install-recursive] Error 1 make[1]: Leaving directory `/usr/src/server2/php4-STABLE-200206231500/sapi' make: *** [install-recursive] Error 1 php configure line: ./configure \ --prefix=/usr/server-test/ \ --enable-bcmath \ --enable-calendar \ --enable-ftp \ --enable-mbstring \ --enable-sockets \ --with-config-file-path=/usr/server-test/lib/ \ --with-gd=/usr/local \ --enable-gd-native-ttf \ --with-jpeg-dir=/usr/lib \ --with-png-dir=/usr/lib \ --with-mysql=/usr \ --with-openssl=/usr \ --with-zlib=/usr \ --with-apxs2=/usr/server-test/bin/apxs if it can be of any help i can provide you with the whole compile log, just drop me a note! -- Edit bug report at http://bugs.php.net/?id=17935&edit=1 -- Fixed in CVS: http://bugs.php.net/fix.php?id=17935&r=fixedcvs Fixed in release: http://bugs.php.net/fix.php?id=17935&r=alreadyfixed Need backtrace: http://bugs.php.net/fix.php?id=17935&r=needtrace Try newer version: http://bugs.php.net/fix.php?id=17935&r=oldversion Not developer issue: http://bugs.php.net/fix.php?id=17935&r=support Expected behavior: http://bugs.php.net/fix.php?id=17935&r=notwrong Not enough info: http://bugs.php.net/fix.php?id=17935&r=notenoughinfo Submitted twice: http://bugs.php.net/fix.php?id=17935&r=submittedtwice register_globals: http://bugs.php.net/fix.php?id=17935&r=globals

« previous php.bugs (#11851) next »