Bug #17935 Updated: apache v2 compile problem since CVS 2002/06/19

From: Date: Sun, 23 Jun 2002 22:28:28 +0000
Subject: Bug #17935 Updated: apache v2 compile problem since CVS 2002/06/19
References: 1  Groups: php.bugs 
Request: Send a blank email to php-bugs+get-11853@lists.php.net to get a copy of this message
ID: 17935 Updated by: mw@suk.net Reported By: mw@suk.net Status: Closed Bug Type: Compile Failure Operating System: RedHat Linux 7.3 PHP Version: 4.0CVS-2002-06-23 New Comment: seems like it has not been fixed, just grabbed a snapshot ( php4-STABLE-200206231500) and still same problem ... Previous Comments: ------------------------------------------------------------------------ [2002-06-23 18:25:42] derick@php.net This bug has been fixed in CVS. You can grab a snapshot of the CVS version at http://snaps.php.net/. In case this was a documentation problem, the fix will show up soon at http://www.php.net/manual/. In case this was a PHP.net website problem, the change will show up on the PHP.net site and on the mirror sites. Thank you for the report, and for helping us make PHP better. This was report Nr. 21 about this issue :) It's already fixed... Derick ------------------------------------------------------------------------ [2002-06-23 18:24:18] mw@suk.net Latest working CVS version of PHP 4.3 with Apache v2.0.36 was on 18th June (CVS: 200206181800). Later on, starting from 19th the problem exists: Making install in apache2filter make[2]: Entering directory `/usr/src/server2/php4-STABLE-200206231500/sapi/apache2filter' make[3]: Entering directory `/usr/src/server2/php4-STABLE-200206231500/sapi/apache2filter' /bin/sh /usr/src/server2/php4-STABLE-200206231500/libtool --silent --mode=compile gcc -I. -I/usr/src/server2/php4-STABLE-200206231500/sapi/apache2filter -I/usr/src/server2/php4-STABLE-200206231500/main -I/usr/src/server2/php4-STABLE-200206231500 -I/usr/server-test/include -I/usr/src/server2/php4-STABLE-200206231500/Zend -I/usr/local/include -I/usr/include/mysql -I/usr/src/server2/php4-STABLE-200206231500/ext/xml/expat -D_REENTRANT -I/usr/src/server2/php4-STABLE-200206231500/TSRM -g -O2 -pthread -DZTS -prefer-pic -c php_functions.c php_functions.c:93:27: missing binary operator before '!' make[3]: *** [php_functions.lo] Error 1 make[3]: Leaving directory `/usr/src/server2/php4-STABLE-200206231500/sapi/apache2filter' make[2]: *** [install-recursive] Error 1 make[2]: Leaving directory `/usr/src/server2/php4-STABLE-200206231500/sapi/apache2filter' make[1]: *** [install-recursive] Error 1 make[1]: Leaving directory `/usr/src/server2/php4-STABLE-200206231500/sapi' make: *** [install-recursive] Error 1 php configure line: ./configure \ --prefix=/usr/server-test/ \ --enable-bcmath \ --enable-calendar \ --enable-ftp \ --enable-mbstring \ --enable-sockets \ --with-config-file-path=/usr/server-test/lib/ \ --with-gd=/usr/local \ --enable-gd-native-ttf \ --with-jpeg-dir=/usr/lib \ --with-png-dir=/usr/lib \ --with-mysql=/usr \ --with-openssl=/usr \ --with-zlib=/usr \ --with-apxs2=/usr/server-test/bin/apxs if it can be of any help i can provide you with the whole compile log, just drop me a note! ------------------------------------------------------------------------ -- Edit this bug report at http://bugs.php.net/?id=17935&edit=1

« previous php.bugs (#11853) next »